{"text_format":"3","workbook":"xlsx","n_sheets":10,"sheets":["Main","Future Intra","Cash Intra","MidCap Intra","Bulk Deals","Call Tracker (Equity & F&O)","Sheet2","Sheet1","Sheet3","Sheet4"],"not_rendered":{"images":4,"defined_names":4},"read":"whole","date_system":"1900"}

{"sheet":"Main","index":0,"n_rows":27,"n_cols":11,"rows_kept":27}
[null,"                                                                                                 "]
{"$rows_empty":8}
[null,"2019-07-05"]
[]
[null,"Sheet No.","Template Name","Summary"]
[null,1,"Future Intra","For Intraday trading in F&O segment"]
[null,2,"Cash Intra","For Intraday trading in cash market segment"]
[null,3,"Mid-cap Intra","For Intraday trading in Mid-cap stocks"]
[null,4,"Bulk Deals","Reveals Bulk Deals carried on NSE & BSE"]
[null,5,"Call Tracker"]
{"$rows_empty":9}
[{"$nulls":10},"`"]

{"sheet":"Future Intra","index":1,"n_rows":236,"n_cols":15,"rows_kept":236,"merged":[[8,0,9,0],[8,1,9,1],[8,2,9,2],[8,5,8,7],[8,8,8,10]]}
[]
[]
[]
[]
[{"$nulls":12},"Back to Main Page"]
["FOR INTRA DAY TRADING",{"$nulls":10},{"$f":"Main!B10","v":"2019-07-05"}]
[]
[]
["Sr.no","Sector","Scrip","CLOSE RATE","Pivot Point","Supports",null,null,"Resistances"]
[null,"Sector",null,"Point","Point","S1","S2","S3","R1","R2","R3","HIGH","LOW","OI","% Change in OI"]
[1,"Index","BANKNIFTY",{"v":31548.2,"d":"31548.20"},{"v":31579.333333333332,"d":"31579.33"},{"v":31468.916666666664,"d":"31468.92"},{"v":31389.63333333333,"d":"31389.63"},{"v":31279.216666666664,"d":"31279.22"},{"v":31658.616666666665,"d":"31658.62"},{"v":31769.03333333333,"d":"31769.03"},{"v":31848.316666666666,"d":"31848.32"},31689.75,31500.05,1895520,{"v":0.0685848939600645,"d":"6.86%"}]
[2,"Index","NIFTY",11979.65,{"v":11973.766666666668,"d":"11973.77"},{"v":11948.533333333336,"d":"11948.53"},{"v":11917.416666666668,"d":"11917.42"},{"v":11892.183333333336,"d":"11892.18"},{"v":12004.883333333337,"d":"12004.88"},{"v":12030.11666666667,"d":"12030.12"},{"v":12061.233333333337,"d":"12061.23"},11999,11942.65,19379250,{"v":3.7057754160257305E-3,"d":"0.37%"}]
[3,"Index","NIFTYIT",{"v":15935,"d":"15935.00"},{"v":15943,"d":"15943.00"},{"v":15898,"d":"15898.00"},{"v":15861,"d":"15861.00"},{"v":15816,"d":"15816.00"},{"v":15980,"d":"15980.00"},{"v":16025,"d":"16025.00"},{"v":16062,"d":"16062.00"},15988,15906,17450,{"v":0.02046783625730994,"d":"2.05%"}]
[4,"Cement","ACC",{"v":1582.2,"d":"1582.20"},{"v":1580,"d":"1580.00"},1570.55,{"v":1558.8999999999999,"d":"1558.90"},{"v":1549.4499999999998,"d":"1549.45"},1591.65,{"v":1601.1,"d":"1601.10"},{"v":1612.7500000000002,"d":"1612.75"},1589.45,1568.35,2139200,{"v":-2.0526217577906325E-3,"d":"-0.21%"}]
[5,"Others","ADANIENT",{"v":156.2,"d":"156.20"},{"v":157.26666666666668,"d":"157.27"},{"v":152.73333333333335,"d":"152.73"},{"v":149.26666666666668,"d":"149.27"},{"v":144.73333333333335,"d":"144.73"},{"v":160.73333333333335,"d":"160.73"},{"v":165.2666666666667,"d":"165.27"},{"v":168.73333333333335,"d":"168.73"},161.8,153.8,29320000,{"v":0.04490377761938703,"d":"4.49%"}]
[6,"Others","ADANIPORTS",{"v":417,"d":"417.00"},{"v":416.98333333333335,"d":"416.98"},{"v":415.2166666666667,"d":"415.22"},{"v":413.43333333333334,"d":"413.43"},{"v":411.6666666666667,"d":"411.67"},{"v":418.7666666666667,"d":"418.77"},{"v":420.53333333333336,"d":"420.53"},{"v":422.3166666666667,"d":"422.32"},418.75,415.2,15385000,{"v":-0.007739438890680426,"d":"-0.77%"}]
[7,"Power","ADANIPOWER",{"v":65.7,"d":"65.70"},{"v":65.96666666666667,"d":"65.97"},{"v":64.83333333333334,"d":"64.83"},{"v":63.96666666666667,"d":"63.97"},{"v":62.83333333333334,"d":"62.83"},{"v":66.83333333333334,"d":"66.83"},{"v":67.96666666666667,"d":"67.97"},{"v":68.83333333333334,"d":"68.83"},67.1,65.1,136760000,{"v":-0.01823402727925341,"d":"-1.82%"}]
[8,"Automobile","AMARAJABAT",647.05,{"v":642.9499999999999,"d":"642.95"},{"v":635.0999999999999,"d":"635.10"},623.15,{"v":615.3,"d":"615.30"},{"v":654.8999999999999,"d":"654.90"},662.75,{"v":674.6999999999998,"d":"674.70"},650.8,631,1237600,{"v":0.09001233045622688,"d":"9.00%"}]
[9,"Cement","AMBUJACEM",{"v":217.5,"d":"217.50"},217.25,{"v":215.8,"d":"215.80"},{"v":214.10000000000002,"d":"214.10"},{"v":212.65000000000003,"d":"212.65"},218.95,{"v":220.39999999999998,"d":"220.40"},{"v":222.09999999999997,"d":"222.10"},218.7,215.55,15782500,{"v":3.1690698779908097E-4,"d":"0.03%"}]
[10,"Others","APOLLOHOSP",1334.35,{"v":1339.6833333333334,"d":"1339.68"},{"v":1323.3666666666668,"d":"1323.37"},{"v":1312.3833333333334,"d":"1312.38"},{"v":1296.0666666666668,"d":"1296.07"},{"v":1350.6666666666667,"d":"1350.67"},{"v":1366.9833333333333,"d":"1366.98"},{"v":1377.9666666666667,"d":"1377.97"},1356,1328.7,1448500,{"v":0.05884502923976608,"d":"5.88%"}]
{"$rows_left_out":172}
{"sheet":"Cash Intra","index":2,"n_rows":247,"n_cols":13,"rows_kept":247,"merged":[[7,0,8,0],[7,1,8,1],[7,2,8,2],[7,3,8,3],[7,4,7,6],[7,7,7,9]]}
[]
[]
[]
[]
[{"$nulls":12},"Back to Main Page"]
["FOR INTRA DAY TRADING",{"$nulls":9},{"$f":"Main!B10","v":"2019-07-05"}]
[]
["Sr.no","Scrip","CLOSE RATE","Pivot Point","Supports",null,null,"Resistances"]
[null,null,"Point",null,"S1","S2","S3","R1","R2","R3","HIGH","LOW","Total Trade Quanity in Lakhs"]
[1,"Nifty 50",11946.75,{"v":11946.550000000001,"d":"11946.55"},{"v":11923.850000000002,"d":"11923.85"},11900.95,{"v":11878.250000000002,"d":"11878.25"},{"v":11969.450000000003,"d":"11969.45"},{"v":11992.150000000003,"d":"11992.15"},{"v":12015.050000000003,"d":"12015.05"},11969.25,11923.65]
[2,"Nifty Bank",31471.85,31502.75,31397.15,31322.45,{"v":31216.850000000002,"d":"31216.85"},31577.45,31683.05,31757.75,31608.35,31428.05]
[3,"Nifty CPSE",2370.1,{"v":2370.8333333333335,"d":"2370.83"},{"v":2361.866666666667,"d":"2361.87"},{"v":2353.633333333333,"d":"2353.63"},{"v":2344.6666666666665,"d":"2344.67"},{"v":2379.066666666667,"d":"2379.07"},{"v":2388.0333333333333,"d":"2388.03"},{"v":2396.2666666666673,"d":"2396.27"},2379.8,2362.6]
[4,"Nifty Infra",3437.55,{"v":3437.4166666666665,"d":"3437.42"},{"v":3427.233333333333,"d":"3427.23"},{"v":3416.9166666666665,"d":"3416.92"},{"v":3406.733333333333,"d":"3406.73"},{"v":3447.733333333333,"d":"3447.73"},{"v":3457.9166666666665,"d":"3457.92"},{"v":3468.233333333333,"d":"3468.23"},3447.6,3427.1]
[5,"Nifty IT",15942.4,{"v":15943.966666666667,"d":"15943.97"},{"v":15895.333333333334,"d":"15895.33"},{"v":15848.266666666666,"d":"15848.27"},{"v":15799.633333333333,"d":"15799.63"},{"v":15991.033333333335,"d":"15991.03"},{"v":16039.666666666666,"d":"16039.67"},{"v":16086.733333333335,"d":"16086.73"},15992.6,15896.9]
[6,"Nifty PSE",3663.1,3661.75,3652.75,{"v":3642.4,"d":"3642.40"},{"v":3633.4,"d":"3633.40"},{"v":3672.1,"d":"3672.10"},{"v":3681.1,"d":"3681.10"},3691.45,3670.75,3651.4]
[7,"Nifty Midcap 50",4928.95,{"v":4936.633333333332,"d":"4936.63"},{"v":4914.866666666665,"d":"4914.87"},{"v":4900.783333333333,"d":"4900.78"},{"v":4879.0166666666655,"d":"4879.02"},{"v":4950.716666666664,"d":"4950.72"},{"v":4972.483333333333,"d":"4972.48"},{"v":4986.566666666664,"d":"4986.57"},4958.4,4922.55]
[8,"ABB",1652,{"v":1640.6666666666667,"d":"1640.67"},{"v":1616.3333333333335,"d":"1616.33"},{"v":1580.6666666666667,"d":"1580.67"},{"v":1556.3333333333335,"d":"1556.33"},{"v":1676.3333333333335,"d":"1676.33"},{"v":1700.666666666667,"d":"1700.67"},{"v":1736.3333333333335,"d":"1736.33"},1665,1605,1.84959]
[9,"ACC",1576.75,{"v":1576.9333333333334,"d":"1576.93"},{"v":1563.8666666666668,"d":"1563.87"},{"v":1550.9833333333333,"d":"1550.98"},{"v":1537.9166666666667,"d":"1537.92"},{"v":1589.8166666666668,"d":"1589.82"},{"v":1602.8833333333334,"d":"1602.88"},{"v":1615.7666666666669,"d":"1615.77"},1590,1564.05,8.39957]
[10,"AUBANK",694.55,{"v":696.7666666666668,"d":"696.77"},{"v":690.5833333333335,"d":"690.58"},{"v":686.6166666666667,"d":"686.62"},{"v":680.4333333333334,"d":"680.43"},{"v":700.7333333333336,"d":"700.73"},{"v":706.9166666666667,"d":"706.92"},{"v":710.8833333333337,"d":"710.88"},702.95,692.8,0.3879]
[11,"ADANIPORTS",414.9,{"v":415.1666666666667,"d":"415.17"},{"v":413.08333333333337,"d":"413.08"},{"v":411.2666666666667,"d":"411.27"},{"v":409.1833333333334,"d":"409.18"},{"v":416.98333333333335,"d":"416.98"},{"v":419.0666666666667,"d":"419.07"},{"v":420.8833333333333,"d":"420.88"},417.25,413.35,11.01623]
{"$rows_left_out":228}
{"sheet":"MidCap Intra","index":3,"n_rows":545,"n_cols":13,"rows_kept":545,"merged":[[0,0,0,1],[8,0,9,0],[8,1,9,1],[8,2,9,2],[8,3,9,3],[8,4,8,6],[8,7,8,9]]}
[]
[]
[]
[]
[{"$nulls":11},"Back To Main Page"]
["FOR INTRA DAY TRADING",{"$nulls":9},{"$f":"Main!B10","v":"2019-07-05"}]
[null,null," "]
[]
["Sr.no","Scrip","CLOSE RATE","Pivot Point","Supports",null,null,"Resistances"]
[null,null,"Point",null,"S1","S2","S3","R1","R2","R3","HIGH","LOW","Total Trade Quanity in Lakhs"]
[1,"3MINDIA",22794.7,{"v":22958.233333333334,"d":"22958.23"},{"v":22516.466666666667,"d":"22516.47"},{"v":22238.233333333334,"d":"22238.23"},{"v":21796.466666666667,"d":"21796.47"},{"v":23236.466666666667,"d":"23236.47"},{"v":23678.233333333337,"d":"23678.23"},{"v":23956.466666666667,"d":"23956.47"},23400,22680,0.01071]
[2,"ABB",1652,{"v":1640.6666666666667,"d":"1640.67"},{"v":1616.3333333333335,"d":"1616.33"},{"v":1580.6666666666667,"d":"1580.67"},{"v":1556.3333333333335,"d":"1556.33"},{"v":1676.3333333333335,"d":"1676.33"},{"v":1700.666666666667,"d":"1700.67"},{"v":1736.3333333333335,"d":"1736.33"},1665,1605,1.84959]
[3,"ACC",1576.75,{"v":1576.9333333333334,"d":"1576.93"},{"v":1563.8666666666668,"d":"1563.87"},{"v":1550.9833333333333,"d":"1550.98"},{"v":1537.9166666666667,"d":"1537.92"},{"v":1589.8166666666668,"d":"1589.82"},{"v":1602.8833333333334,"d":"1602.88"},{"v":1615.7666666666669,"d":"1615.77"},1590,1564.05,8.39957]
[4,"AIAENG",1826.65,{"v":1820.2166666666665,"d":"1820.22"},{"v":1796.433333333333,"d":"1796.43"},{"v":1766.2166666666665,"d":"1766.22"},{"v":1742.433333333333,"d":"1742.43"},{"v":1850.433333333333,"d":"1850.43"},{"v":1874.2166666666662,"d":"1874.22"},{"v":1904.433333333333,"d":"1904.43"},1844,1790,0.1118]
[5,"APLAPOLLO",1657.9,{"v":1658.6000000000001,"d":"1658.60"},{"v":1639.3000000000002,"d":"1639.30"},{"v":1620.7,"d":"1620.70"},{"v":1601.4,"d":"1601.40"},{"v":1677.2000000000003,"d":"1677.20"},{"v":1696.5,"d":"1696.50"},{"v":1715.1000000000004,"d":"1715.10"},1677.9,1640,0.24537]
[6,"AUBANK",694.55,{"v":696.7666666666668,"d":"696.77"},{"v":690.5833333333335,"d":"690.58"},{"v":686.6166666666667,"d":"686.62"},{"v":680.4333333333334,"d":"680.43"},{"v":700.7333333333336,"d":"700.73"},{"v":706.9166666666667,"d":"706.92"},{"v":710.8833333333337,"d":"710.88"},702.95,692.8,0.3879]
[7,"AAVAS",1506.3,{"v":1514.6499999999999,"d":"1514.65"},{"v":1494.6499999999996,"d":"1494.65"},{"v":1482.9999999999998,"d":"1483.00"},{"v":1462.9999999999995,"d":"1463.00"},{"v":1526.2999999999997,"d":"1526.30"},{"v":1546.3000000000002,"d":"1546.30"},{"v":1557.9499999999998,"d":"1557.95"},1534.65,1503,0.09915]
[8,"ADANIGREEN",51.05,{"v":51.56666666666666,"d":"51.57"},{"v":49.73333333333333,"d":"49.73"},{"v":48.416666666666664,"d":"48.42"},{"v":46.58333333333333,"d":"46.58"},{"v":52.883333333333326,"d":"52.88"},{"v":54.71666666666667,"d":"54.72"},{"v":56.033333333333324,"d":"56.03"},53.4,50.25,23.07705]
[9,"ADANIPORTS",414.9,{"v":415.1666666666667,"d":"415.17"},{"v":413.08333333333337,"d":"413.08"},{"v":411.2666666666667,"d":"411.27"},{"v":409.1833333333334,"d":"409.18"},{"v":416.98333333333335,"d":"416.98"},{"v":419.0666666666667,"d":"419.07"},{"v":420.8833333333333,"d":"420.88"},417.25,413.35,11.01623]
[10,"ADANIPOWER",65.35,{"v":65.64999999999999,"d":"65.65"},{"v":64.39999999999998,"d":"64.40"},{"v":63.44999999999999,"d":"63.45"},{"v":62.199999999999974,"d":"62.20"},{"v":66.59999999999998,"d":"66.60"},{"v":67.85000000000001,"d":"67.85"},{"v":68.79999999999998,"d":"68.80"},66.9,64.7,229.77698]
{"$rows_left_out":513}
{"sheet":"Bulk Deals","index":4,"n_rows":59,"n_cols":8,"rows_kept":59,"merged":[[4,0,4,1],[4,2,4,3],[6,1,6,2]]}
[" "]
[]
[]
[]
[]
[{"$nulls":4},"Back To Main Page"]
["Subject :","BULK DEAL",null,{"$f":"Main!B10","v":"2019-07-05"}]
[]
["Date","Scrip code","Scrip Name","Client Name","Buy / Sell","Quantity Traded","Trade Price / Wt.Avg.trade price","Exchange  "]
["2019-07-04",542721,"ARL","ASHVINIKUMAR MOOLCHAND MEHTA","BUY",{"v":200000,"d":"200,000"},27.03,"BSE"]
["2019-07-04",590122,"ASHIKACR","KABIR SHRAN DAGAR (HUF)","SELL",{"v":35945,"d":"35,945"},38.05,"BSE"]
["2019-07-04",504340,"CONFINT","PINKY SURANA","BUY",{"v":419000,"d":"419,000"},0.68,"BSE"]
["2019-07-04",504340,"CONFINT","DHARMESHBHAI JETHABHAI VAGHELA","SELL",{"v":374830,"d":"374,830"},0.68,"BSE"]
["2019-07-04",542724,"EARUM","SHASHIKANT VEDPRAKASH SHARMA","BUY",{"v":60000,"d":"60,000"},36,"BSE"]
["2019-07-04",542724,"EARUM","SMIRAL ASHWINKUMAR PATEL","BUY",{"v":60000,"d":"60,000"},36,"BSE"]
["2019-07-04",542724,"EARUM","MOHAK AMITKUMAR SHAH","BUY",{"v":90000,"d":"90,000"},36,"BSE"]
["2019-07-04",540937,"MEDICO","ARYAMAN BROKING LIMITED","SELL",{"v":24000,"d":"24,000"},{"v":83.1,"d":"83.10"},"BSE"]
["2019-07-04",540937,"MEDICO","GOODPOINT COMMODEAL PRIVATE LIMITED","BUY",{"v":54000,"d":"54,000"},{"v":83.1,"d":"83.10"},"BSE"]
["2019-07-04",540937,"MEDICO","SHRI RAVINDRA MEDIA VENTURES PRIVATE LIMITED","SELL",{"v":30000,"d":"30,000"},{"v":83.1,"d":"83.10"},"BSE"]
["2019-07-04",542145,"RONI","ARYAMAN BROKING LIMITED","SELL",{"v":24000,"d":"24,000"},30,"BSE"]
{"$rows_left_out":40}
{"sheet":"Call Tracker (Equity & F&O)","index":5,"n_rows":260,"n_cols":20,"rows_kept":260,"merged":[[62,0,63,0],[62,1,63,1],[62,9,63,9],[62,11,63,11],[62,12,63,12],[62,13,63,13],[62,14,63,14],[62,17,63,17],[65,0,66,0],[65,1,66,1],[65,9,66,9],[65,11,66,11],[65,12,66,12],[65,13,66,13],[65,14,66,14],[65,17,66,17]]}
[]
[]
[]
[]
[{"$nulls":12},"Back To Main Page"]
["Retail Research Technical Calls & Fundamental Performance Report for the month of July-2019 "]
[{"$nulls":12},{"$f":"Main!B10","v":"2019-07-05"}]
[null,"Positional  Call"]
["Sr.no","Date",null,"Company","Rec","Rec Price","Stop Loss***","Call Closed At","Target","Remark","Profit / Loss per Share","Gain / Loss  %","Status","Closed Date","NSE Closed Price"]
[1,"2019-05-27",null,"TATAELXSI","Buy",874,818.7,915,"970-990","Profit of Rs.41 /-",{"$f":"H10-F10","v":41},{"$f":"K10/F10","v":{"v":0.04691075514874142,"d":"4.69%"}},"Successful","2019-07-02",{"$nulls":3},"R"]
[2,"2019-05-28",null,"BAJAJFINSV","Sell","8150-8200",8625,null,7300,"Open",{"$nulls":4},{"$f":"VLOOKUP(D11,Sheet2!A54:M1849,6,0)","v":8430.45},null,null,"H"]
[3,"2019-05-31",null,"ITC","Buy","285-287",268.3,null,"315-325","Open",{"$nulls":4},{"$f":"VLOOKUP(D12,Sheet2!A61:M1856,6,0)","v":276.7},null,null,"R"]
[4,"2019-06-13",null,"GODREJCP","Buy","675-680",644,null,"740-750","Open",{"$nulls":4},{"$f":"VLOOKUP(D13,Sheet2!A66:M1861,6,0)","v":672.9},null,null,"H"]
[5,"2019-06-17",null,"SUNTV","Buy",517,476,539.5,"575-585","Part Profit of Rs.22.5/-",{"$f":"H14-F14","v":22.5},{"$f":"K14/F14","v":{"v":0.043520309477756286,"d":"4.35%"}},"Successful","2019-06-20",{"$f":"VLOOKUP(D14,Sheet2!A66:M1861,6,0)","v":513.55},null,null,"R"]
[6,"2019-06-21",null,"AJANTPHARM","Buy","950-960",897.7,null,"1060-1080","Open",{"$nulls":4},{"$f":"VLOOKUP(D15,Sheet2!A2:M1641,6,0)","v":954.75},null,null,"R"]
[7,"2019-06-24",null,"ESCORTS","Buy",549.5,518,573,600,"Part Profit of Rs.23.5 /-",23.5,{"v":0.042766151046405826,"d":"4.28%"},"Successful","2019-07-02",{"$f":"VLOOKUP(D16,Sheet2!A68:M1863,6,0)","v":571.8},null,null,"H"]
[8,"2019-06-25",null,"JUBLFOOD","Buy","1260-1265",1158.3,null,"1450 -1470","Open",{"$nulls":4},{"$f":"VLOOKUP(D17,Sheet2!A4:M1643,6,0)","v":1251.05},null,null,"R"]
[9,"2019-07-04",null,"TORNTPHARM","Buy","1540-1550",1454,null,"1730-1750","Open",{"$nulls":4},{"$f":"VLOOKUP(D18,Sheet2!A5:M1644,6,0)","v":1552.85},null,null,"R"]
[]
[]
{"$rows_left_out":241}
{"sheet":"Sheet2","index":6,"n_rows":1636,"n_cols":14,"rows_kept":1636,"hidden":true}
["SYMBOL","SERIES","OPEN","HIGH","LOW","CLOSE","LAST","PREVCLOSE","TOTTRDQTY","TOTTRDVAL","TIMESTAMP","TOTALTRADES","ISIN","ISIN"]
["20MICRONS","EQ",36.35,40.4,35.5,38.85,38.95,36.75,61882,2353866.55,"2019-07-03",593,"INE144J01027"]
["21STCENMGM","EQ",17.5,17.7,17.5,17.7,17.7,17.4,91,1596.7,"2019-07-03",5,"INE253B01015"]
["3IINFOTECH","EQ",3.3,3.3,3.2,3.25,3.25,3.3,1107906,3598110.6,"2019-07-03",386,"INE748C01020"]
["3MINDIA","EQ",23304.35,23450,23085,23206.85,23186.6,23392.9,1379,32109223.1,"2019-07-03",780,"INE470A01017"]
["3PLAND","EQ",8.4,8.75,8.4,8.75,8.75,8.8,3494,29414.55,"2019-07-03",7,"INE105C01023"]
["5PAISA","EQ",211.6,223,211.3,221.2,223,217.7,3567,779967.8,"2019-07-03",260,"INE618L01018"]
["63MOONS","EQ",111.6,114.75,110.1,111,111.5,110.15,155044,17421386.55,"2019-07-03",2303,"INE111B01023"]
["8KMILES","EQ",79,84.3,78,84.3,84.3,80.3,51291,4287597.2,"2019-07-03",399,"INE650K01021"]
["A2ZINFRA","EQ",12.2,12.55,11.9,12.45,12.3,12.3,213131,2614667.85,"2019-07-03",659,"INE619I01012"]
["AARTIDRUGS","EQ",525.2,528.95,522.05,525.4,526.85,520.95,5705,2993818.35,"2019-07-03",661,"INE767A01016"]
["AARTIIND","BE",1725.2,1799.45,1724,1753.7,1755,1801.25,11595,20327982.3,"2019-07-03",1391,"INE769A01020"]
["AARVEEDEN","EQ",19.35,20.25,19.15,19.6,19.5,19.4,6966,137284.55,"2019-07-03",122,"INE273D01019"]
["AAVAS","EQ",1509,1527,1490.85,1512.7,1510,1498.7,315791,474553139.55,"2019-07-03",4034,"INE216P01012"]
["ABAN","EQ",39.35,40,38.25,38.65,38.65,39.35,79497,3110058.25,"2019-07-03",1038,"INE421A01028"]
["ABB","EQ",1607.95,1615.45,1600,1607.75,1610,1600.45,58485,94062949.2,"2019-07-03",3892,"INE117A01022"]
["ABBOTINDIA","EQ",8726.25,8844.85,8726.25,8802.7,8799.9,8782.95,1366,12017904.05,"2019-07-03",482,"INE358A01014"]
["ABCAPITAL","EQ",91.8,92.8,90.7,92.4,92.5,91.35,873664,80515817.2,"2019-07-03",10673,"INE674K01013"]
["ABFRL","EQ",217.85,219.3,214,215.4,214.55,216.4,208043,45166768.95,"2019-07-03",7251,"INE647O01011"]
["ABSLNN50ET","EQ",274,277.39,274,277.39,277.39,274,53,14665.57,"2019-07-03",3,"INF209KB1B87"]
{"$rows_left_out":1617}
{"sheet":"Sheet1","index":7,"n_rows":0,"n_cols":0,"rows_kept":0,"hidden":true}

{"sheet":"Sheet3","index":8,"n_rows":0,"n_cols":0,"rows_kept":0,"hidden":true}

{"sheet":"Sheet4","index":9,"n_rows":0,"n_cols":0,"rows_kept":0,"hidden":true}