{"text_format":"3","workbook":"xlsx","n_sheets":11,"sheets":["Main","Future Intra","Cash Intra","MidCap Intra","Bulk Deals","Call Tracker (Equity & F&O)","Sheet2","Sheet1","Sheet3","Sheet4","Sheet5"],"not_rendered":{"images":4,"defined_names":5},"read":"whole","date_system":"1900"}

{"sheet":"Main","index":0,"n_rows":27,"n_cols":11,"rows_kept":27}
[null,"                                                                                                 "]
{"$rows_empty":8}
[null,"2020-04-07"]
[]
[null,"Sheet No.","Template Name","Summary"]
[null,1,"Future Intra","For Intraday trading in F&O segment"]
[null,2,"Cash Intra","For Intraday trading in cash market segment"]
[null,3,"Mid-cap Intra","For Intraday trading in Mid-cap stocks"]
[null,4,"Bulk Deals","Reveals Bulk Deals carried on NSE & BSE"]
[null,5,"Call Tracker"]
{"$rows_empty":9}
[{"$nulls":10},"`"]

{"sheet":"Future Intra","index":1,"n_rows":190,"n_cols":15,"rows_kept":190,"merged":[[8,0,9,0],[8,1,9,1],[8,2,9,2],[8,5,8,7],[8,8,8,10]]}
[]
[]
[]
[]
[{"$nulls":12},"Back to Main Page"]
["FOR INTRA DAY TRADING",{"$nulls":10},{"$f":"Main!B10","v":"2020-04-07"}]
[]
[]
["Sr.no","Sector","Scrip","CLOSE RATE","Pivot Point","Supports",null,null,"Resistances"]
[null,"Sector",null,"Point","Point","S1","S2","S3","R1","R2","R3","HIGH","LOW","OI","% Change in OI"]
[1,"Index","BANKNIFTY",{"v":17175.8,"d":"17175.80"},{"v":17492.3,"d":"17492.30"},{"v":16758.5,"d":"16758.50"},{"v":16341.2,"d":"16341.20"},{"v":15607.400000000001,"d":"15607.40"},{"v":17909.6,"d":"17909.60"},{"v":18643.399999999994,"d":"18643.40"},{"v":19060.699999999997,"d":"19060.70"},18226.1,17075,1050660,{"v":0.11632206379226077,"d":"11.63%"}]
[2,"Index","NIFTY",{"v":8084.5,"d":"8084.50"},{"v":8153.166666666667,"d":"8153.17"},{"v":7976.333333333334,"d":"7976.33"},{"v":7868.166666666667,"d":"7868.17"},{"v":7691.333333333334,"d":"7691.33"},{"v":8261.333333333334,"d":"8261.33"},{"v":8438.166666666668,"d":"8438.17"},{"v":8546.333333333334,"d":"8546.33"},8330,8045,10933875,{"v":-6.9074040013896556E-3,"d":"-0.69%"}]
[3,"Index","NIFTYIT",{"v":11710,"d":"11710.00"},{"v":11777.333333333334,"d":"11777.33"},{"v":11534.666666666668,"d":"11534.67"},{"v":11359.333333333334,"d":"11359.33"},{"v":11116.666666666668,"d":"11116.67"},{"v":11952.666666666668,"d":"11952.67"},{"v":12195.333333333336,"d":"12195.33"},{"v":12370.666666666668,"d":"12370.67"},12020,11602,850,{"v":-0.5526315789473685,"d":"-55.26%"}]
[4,"Cement","ACC",961.75,956.25,{"v":942.5,"d":"942.50"},923.25,{"v":909.5,"d":"909.50"},{"v":975.5,"d":"975.50"},989.25,{"v":1008.5,"d":"1008.50"},970,937,1848400,{"v":-0.08058097890966971,"d":"-8.06%"}]
[5,"Others","ADANIENT",129.75,{"v":130.88333333333333,"d":"130.88"},{"v":127.31666666666666,"d":"127.32"},{"v":124.88333333333333,"d":"124.88"},{"v":121.31666666666666,"d":"121.32"},{"v":133.31666666666666,"d":"133.32"},{"v":136.88333333333333,"d":"136.88"},{"v":139.31666666666666,"d":"139.32"},134.45,128.45,16412000,{"v":0.007612966601178782,"d":"0.76%"}]
[6,"Others","ADANIPORTS",245.85,{"v":245.88333333333333,"d":"245.88"},{"v":239.41666666666666,"d":"239.42"},{"v":232.98333333333332,"d":"232.98"},{"v":226.51666666666665,"d":"226.52"},{"v":252.31666666666666,"d":"252.32"},{"v":258.78333333333336,"d":"258.78"},{"v":265.2166666666667,"d":"265.22"},252.35,239.45,26490000,{"v":0.04281074697372306,"d":"4.28%"}]
[7,"Power","ADANIPOWER",26.95,{"v":26.650000000000002,"d":"26.65"},{"v":26.250000000000004,"d":"26.25"},25.55,{"v":25.150000000000002,"d":"25.15"},{"v":27.350000000000005,"d":"27.35"},{"v":27.750000000000004,"d":"27.75"},{"v":28.450000000000006,"d":"28.45"},27.05,25.95,51490000,{"v":7.0408761979268535E-3,"d":"0.70%"}]
[8,"Automobile","AMARAJABAT",{"v":461.8,"d":"461.80"},{"v":465.31666666666666,"d":"465.32"},{"v":454.5333333333333,"d":"454.53"},{"v":447.26666666666665,"d":"447.27"},{"v":436.4833333333333,"d":"436.48"},{"v":472.5833333333333,"d":"472.58"},{"v":483.36666666666673,"d":"483.37"},{"v":490.6333333333333,"d":"490.63"},476.1,458.05,953600,{"v":-8.3822296730930428E-4,"d":"-0.08%"}]
[9,"Cement","AMBUJACEM",153.35,{"v":153.79999999999998,"d":"153.80"},{"v":151.74999999999997,"d":"151.75"},{"v":150.14999999999998,"d":"150.15"},{"v":148.09999999999997,"d":"148.10"},{"v":155.39999999999998,"d":"155.40"},157.45,{"v":159.04999999999998,"d":"159.05"},155.85,152.2,18347500,{"v":0.010463995594107118,"d":"1.05%"}]
[10,"Others","APOLLOHOSP",{"v":1185,"d":"1185.00"},{"v":1162.3333333333333,"d":"1162.33"},{"v":1109.7166666666665,"d":"1109.72"},{"v":1034.4333333333332,"d":"1034.43"},{"v":981.8166666666664,"d":"981.82"},{"v":1237.6166666666666,"d":"1237.62"},{"v":1290.2333333333333,"d":"1290.23"},{"v":1365.5166666666667,"d":"1365.52"},1214.95,1087.05,745000,{"v":-0.029315960912052116,"d":"-2.93%"}]
{"$rows_left_out":155}
{"sheet":"Cash Intra","index":2,"n_rows":247,"n_cols":13,"rows_kept":247,"merged":[[7,0,8,0],[7,1,8,1],[7,2,8,2],[7,3,8,3],[7,4,7,6],[7,7,7,9]]}
[]
[]
[]
[]
[{"$nulls":12},"Back to Main Page"]
["FOR INTRA DAY TRADING",{"$nulls":9},{"$f":"Main!B10","v":"2020-04-07"}]
[]
["Sr.no","Scrip","CLOSE RATE","Pivot Point","Supports",null,null,"Resistances"]
[null,null,"Point",null,"S1","S2","S3","R1","R2","R3","HIGH","LOW","Total Trade Quanity in Lakhs"]
[1,"Nifty 50",8083.8,{"v":8165.383333333332,"d":"8165.38"},{"v":7974.216666666665,"d":"7974.22"},{"v":7864.633333333333,"d":"7864.63"},{"v":7673.466666666666,"d":"7673.47"},{"v":8274.966666666664,"d":"8274.97"},{"v":8466.133333333331,"d":"8466.13"},{"v":8575.716666666664,"d":"8575.72"},8356.55,8055.8]
[2,"Nifty Bank",17249.3,{"v":17572.866666666665,"d":"17572.87"},{"v":16819.63333333333,"d":"16819.63"},{"v":16389.966666666667,"d":"16389.97"},{"v":15636.733333333334,"d":"15636.73"},{"v":18002.53333333333,"d":"18002.53"},{"v":18755.76666666666,"d":"18755.77"},{"v":19185.433333333327,"d":"19185.43"},18326.1,17143.2]
[3,"Nifty CPSE",1293,{"v":1290.5166666666667,"d":"1290.52"},{"v":1269.9333333333334,"d":"1269.93"},{"v":1246.8666666666668,"d":"1246.87"},{"v":1226.2833333333335,"d":"1226.28"},{"v":1313.5833333333333,"d":"1313.58"},{"v":1334.1666666666667,"d":"1334.17"},{"v":1357.2333333333331,"d":"1357.23"},1311.1,1267.45]
[4,"Nifty Infra",2280.45,{"v":2290.2666666666664,"d":"2290.27"},{"v":2248.333333333333,"d":"2248.33"},{"v":2216.2166666666667,"d":"2216.22"},{"v":2174.2833333333333,"d":"2174.28"},{"v":2322.3833333333328,"d":"2322.38"},{"v":2364.316666666666,"d":"2364.32"},{"v":2396.4333333333325,"d":"2396.43"},2332.2,2258.15]
[5,"Nifty IT",11680.05,{"v":11816.066666666666,"d":"11816.07"},{"v":11485.18333333333,"d":"11485.18"},{"v":11290.316666666666,"d":"11290.32"},{"v":10959.43333333333,"d":"10959.43"},{"v":12010.93333333333,"d":"12010.93"},{"v":12341.816666666666,"d":"12341.82"},{"v":12536.68333333333,"d":"12536.68"},12146.95,11621.2]
[6,"Nifty PSE",2168.55,{"v":2163.7833333333333,"d":"2163.78"},{"v":2123.1666666666665,"d":"2123.17"},{"v":2077.7833333333333,"d":"2077.78"},{"v":2037.1666666666665,"d":"2037.17"},{"v":2209.1666666666665,"d":"2209.17"},{"v":2249.7833333333333,"d":"2249.78"},{"v":2295.1666666666665,"d":"2295.17"},2204.4,2118.4]
[7,"Nifty Midcap 50",3037,{"v":3060.4166666666665,"d":"3060.42"},{"v":3007.083333333333,"d":"3007.08"},{"v":2977.1666666666665,"d":"2977.17"},{"v":2923.833333333333,"d":"2923.83"},{"v":3090.333333333333,"d":"3090.33"},{"v":3143.666666666666,"d":"3143.67"},{"v":3173.583333333333,"d":"3173.58"},3113.75,3030.5]
[8,"ACC",962.6,{"v":956.4500000000002,"d":"956.45"},{"v":943.1000000000004,"d":"943.10"},{"v":923.6000000000003,"d":"923.60"},{"v":910.2500000000005,"d":"910.25"},{"v":975.9500000000003,"d":"975.95"},{"v":989.3,"d":"989.30"},{"v":1008.8000000000002,"d":"1008.80"},969.8,936.95,5.14199]
[9,"AUBANK",465.45,{"v":468.7833333333333,"d":"468.78"},{"v":454.66666666666663,"d":"454.67"},{"v":443.8833333333333,"d":"443.88"},{"v":429.76666666666665,"d":"429.77"},{"v":479.5666666666666,"d":"479.57"},{"v":493.6833333333333,"d":"493.68"},{"v":504.4666666666666,"d":"504.47"},482.9,458,4.21839]
[10,"ADANIPORTS",244.8,{"v":245.5,"d":"245.50"},{"v":238.2,"d":"238.20"},{"v":231.6,"d":"231.60"},{"v":224.29999999999998,"d":"224.30"},{"v":252.1,"d":"252.10"},{"v":259.4,"d":"259.40"},{"v":266,"d":"266.00"},252.8,238.9,29.12256]
[11,"ADANIPOWER",26.75,{"v":26.566666666666666,"d":"26.57"},{"v":25.983333333333334,"d":"25.98"},{"v":25.21666666666667,"d":"25.22"},{"v":24.633333333333336,"d":"24.63"},{"v":27.333333333333332,"d":"27.33"},{"v":27.916666666666668,"d":"27.92"},{"v":28.68333333333333,"d":"28.68"},27.15,25.8,57.54033]
{"$rows_left_out":228}
{"sheet":"MidCap Intra","index":3,"n_rows":545,"n_cols":13,"rows_kept":545,"merged":[[0,0,0,1],[8,0,9,0],[8,1,9,1],[8,2,9,2],[8,3,9,3],[8,4,8,6],[8,7,8,9]]}
[]
[]
[]
[]
[{"$nulls":11},"Back To Main Page"]
["FOR INTRA DAY TRADING",{"$nulls":9},{"$f":"Main!B10","v":"2020-04-07"}]
[null,null," "]
[]
["Sr.no","Scrip","CLOSE RATE","Pivot Point","Supports",null,null,"Resistances"]
[null,null,"Point",null,"S1","S2","S3","R1","R2","R3","HIGH","LOW","Total Trade Quanity in Lakhs"]
[1,"3MINDIA",17490.1,{"v":17771.7,"d":"17771.70"},{"v":16893.4,"d":"16893.40"},{"v":16296.7,"d":"16296.70"},{"v":15418.400000000001,"d":"15418.40"},{"v":18368.4,"d":"18368.40"},{"v":19246.699999999997,"d":"19246.70"},{"v":19843.4,"d":"19843.40"},18650,17175,0.07588]
[2,"AARTIIND",790.7,{"v":788.4833333333332,"d":"788.48"},{"v":772.9666666666665,"d":"772.97"},{"v":755.2333333333332,"d":"755.23"},{"v":739.7166666666665,"d":"739.72"},{"v":806.2166666666665,"d":"806.22"},{"v":821.7333333333331,"d":"821.73"},{"v":839.4666666666665,"d":"839.47"},804,770.75,1.35885]
[3,"AAVAS",1132.4,{"v":1148.2666666666667,"d":"1148.27"},{"v":1116.5333333333333,"d":"1116.53"},{"v":1100.6666666666667,"d":"1100.67"},{"v":1068.9333333333334,"d":"1068.93"},{"v":1164.1333333333332,"d":"1164.13"},{"v":1195.8666666666663,"d":"1195.87"},{"v":1211.7333333333331,"d":"1211.73"},1180,1132.4,1.04654]
[4,"ABBOTINDIA",15810.5,{"v":15673.5,"d":"15673.50"},{"v":15347,"d":"15347.00"},{"v":14883.5,"d":"14883.50"},{"v":14557,"d":"14557.00"},{"v":16137,"d":"16137.00"},{"v":16463.5,"d":"16463.50"},{"v":16927,"d":"16927.00"},16000,15210,0.28827]
[5,"ABCAPITAL",43.45,{"v":43.23333333333333,"d":"43.23"},{"v":41.26666666666665,"d":"41.27"},{"v":39.08333333333332,"d":"39.08"},{"v":37.116666666666646,"d":"37.12"},{"v":45.41666666666666,"d":"45.42"},{"v":47.38333333333334,"d":"47.38"},{"v":49.56666666666666,"d":"49.57"},45.2,41.05,13.36547]
[6,"ABFRL",145.95,145.65,{"v":142.3,"d":"142.30"},138.65,{"v":135.3,"d":"135.30"},{"v":149.3,"d":"149.30"},{"v":152.64999999999998,"d":"152.65"},{"v":156.3,"d":"156.30"},149,142,4.31692]
[7,"ACC",962.6,{"v":956.4500000000002,"d":"956.45"},{"v":943.1000000000004,"d":"943.10"},{"v":923.6000000000003,"d":"923.60"},{"v":910.2500000000005,"d":"910.25"},{"v":975.9500000000003,"d":"975.95"},{"v":989.3,"d":"989.30"},{"v":1008.8000000000002,"d":"1008.80"},969.8,936.95,12.21295]
[8,"ADANIGAS",90.35,{"v":90.43333333333334,"d":"90.43"},{"v":88.86666666666667,"d":"88.87"},{"v":87.38333333333334,"d":"87.38"},{"v":85.81666666666668,"d":"85.82"},{"v":91.91666666666667,"d":"91.92"},{"v":93.48333333333333,"d":"93.48"},{"v":94.96666666666667,"d":"94.97"},92,88.95,8.94968]
[9,"ADANIGREEN",151.9,{"v":152.4,"d":"152.40"},{"v":149.95000000000002,"d":"149.95"},{"v":148,"d":"148.00"},145.55,{"v":154.35000000000002,"d":"154.35"},{"v":156.8,"d":"156.80"},{"v":158.75000000000003,"d":"158.75"},154.85,150.45,2.59616]
[10,"ADANIPORTS",244.8,{"v":245.5,"d":"245.50"},{"v":238.2,"d":"238.20"},{"v":231.6,"d":"231.60"},{"v":224.29999999999998,"d":"224.30"},{"v":252.1,"d":"252.10"},{"v":259.4,"d":"259.40"},{"v":266,"d":"266.00"},252.8,238.9,72.10453]
{"$rows_left_out":514}
{"sheet":"Bulk Deals","index":4,"n_rows":28,"n_cols":8,"rows_kept":28,"merged":[[4,0,4,1],[4,2,4,3],[6,1,6,2]]}
[" "]
[]
[]
[]
[]
[{"$nulls":4},"Back To Main Page"]
["Subject :","BULK DEAL",null,{"$f":"Main!B10","v":"2020-04-07"}]
[]
["Date","Scrip code","Scrip Name","Client Name","Buy / Sell","Quantity Traded","Trade Price / Wt.Avg.trade price","Exchange  "]
["2020-04-03",542602,"EMBASSY","REDDY VEERANNA","SELL",{"v":15625000,"d":"15,625,000"},321.5,"BSE"]
["2020-04-03",542602,"EMBASSY","AMERICAN BALANCED FUND","BUY",{"v":9514600,"d":"9,514,600"},321.5,"BSE"]
["2020-04-03",542602,"EMBASSY","CAPITAL INCOME BUILDER","BUY",{"v":4318000,"d":"4,318,000"},321.5,"BSE"]
["2020-04-03",511628,"IMCAP","RAJPAL SINGH","BUY",{"v":30100,"d":"30,100"},20,"BSE"]
["2020-04-03",511628,"IMCAP","WELSOME FINANCE PRIVATE LIMITED","SELL",{"v":30000,"d":"30,000"},20,"BSE"]
["2020-04-03",543171,"ROJL","VIVIDOFFSET PRINTERS PRIVATELIMITED","BUY",{"v":15000,"d":"15,000"},35.9,"BSE"]
["2020-04-03",540797,"SHALBY","GOLDMAN SACHS INDIA FUND LIMITED","SELL",{"v":1231536,"d":"1,231,536"},43.04,"BSE"]
["2020-04-03",539026,"SSPNFIN","ASHOK KUMAR SINGH","BUY",{"v":28000,"d":"28,000"},41.25,"BSE"]
["2020-04-03",539026,"SSPNFIN","RUSHIL SHAILESH PANDYA","SELL",{"v":24000,"d":"24,000"},41.25,"BSE"]
["2020-04-03","AMJUMBO","A and M Jumbo Bags Ltd","NISHA JIGARBHAI SHAH","BUY",{"v":48000,"d":"48,000"},7,"NSE"]
["2020-04-03","IBULISL","Indiabulls Integr Ser Ltd","TOSCAFUND ASSET MANAGEMENT LLP A/C TOSCA","BUY",{"v":815000,"d":"815,000"},40.7,"NSE"]
{"$rows_left_out":9}
{"sheet":"Call Tracker (Equity & F&O)","index":5,"n_rows":210,"n_cols":18,"rows_kept":210}
[]
[]
[]
[]
[{"$nulls":12},"Back To Main Page"]
["Retail Research Technical Calls & Fundamental Performance Report for the month of April-2020 "]
[{"$nulls":12},{"$f":"Main!B10","v":"2020-04-07"}]
[null,"Positional  Call"]
["Sr.no","Date",null,"Company","Rec","Rec Price","Stop Loss***","Call Closed At","Target","Remark","Profit / Loss per Share","Gain / Loss  %","Status","Closed Date","NSE Closed Price"]
[1,"2020-03-27",null,"ULTRACEMCO","Buy","3150-3200",2940,null,"3400-3500","Open",{"$nulls":4},{"$f":"VLOOKUP(D10,Sheet2!A2:F1647,6,0)","v":3041.6},null,null,"H"]
[2,"2020-03-31",null,"ZEEL","Buy","125-126",118,null,"135-140","Open",{"$nulls":4},{"$f":"VLOOKUP(D11,Sheet2!A3:F1648,6,0)","v":124.35},null,null,"N"]
[3,"2020-04-01",null,"HCLTECH","Buy","420-427",395,null,"460-480","Open",{"$nulls":4},{"$f":"VLOOKUP(D12,Sheet2!A4:F1649,6,0)","v":405.8},null,null,"H"]
[4,"2020-04-01",null,"ASIANPAINT","Buy",1635,1540,1530,"1820-1850","Loss of Rs.105/-",{"$f":"H13-F13","v":-105},{"$f":"K13/F13","v":{"v":-0.06422018348623854,"d":"-6.42%"}},"Unsuccessful","2020-04-03",{"$nulls":3},"N"]
[5,"2020-04-01",null,"APOLLOHOSP","Buy",1105,1040,1145,1250,"Profit of Rs.40/-",{"$f":"H14-F14","v":40},{"$f":"K14/F14","v":{"v":0.03619909502262444,"d":"3.62%"}},"Successful","2020-04-03",{"$nulls":3},"H"]
[6,"2020-04-03",null,"PIDILITIND","Buy","1250-1260",1170,null,"1400-1420","Open",{"$nulls":4},{"$f":"VLOOKUP(D15,Sheet2!A7:F1652,6,0)","v":1215.9},null,null,"H"]
[]
["CLBS = Closing Basis ***"]
["Dividend adjusted <>",{"$nulls":4},"Reinitiated $"]
["Part book {}",{"$nulls":4},"Revised stoploss #"]
[]
{"$rows_left_out":191}
{"sheet":"Sheet2","index":6,"n_rows":1899,"n_cols":14,"rows_kept":1899,"hidden":true}
["SYMBOL","SERIES","OPEN","HIGH","LOW","CLOSE","LAST","PREVCLOSE","TOTTRDQTY","TOTTRDVAL","TIMESTAMP","TOTALTRADES","ISIN","ISIN"]
["20MICRONS","EQ",25,25.55,23.2,24.45,24.4,24.55,18990,459870.25,"2020-04-03",340,"INE144J01027"]
["21STCENMGM","EQ",10.65,10.65,10.5,10.5,10.5,10.65,499,5241.5,"2020-04-03",6,"INE253B01015"]
["3IINFOTECH","EQ",1.3,1.3,1.2,1.3,1.3,1.25,2445739,3123810.45,"2020-04-03",885,"INE748C01020"]
["3MINDIA","EQ",18410,18650,17175,17490.1,17400.05,18469.55,7588,132897327.6,"2020-04-03",3561,"INE470A01017"]
["3PLAND","EQ",3.4,3.55,3.4,3.55,3.55,3.4,1503,5334.45,"2020-04-03",8,"INE105C01023"]
["5PAISA","EQ",115,128,113.6,115.1,115,113.55,2711,313459.35,"2020-04-03",132,"INE618L01018"]
["63MOONS","EQ",46.2,47,45.45,46.15,46.45,46.35,31413,1450773.6,"2020-04-03",2071,"INE111B01023"]
["A2ZINFRA","EQ",3.1,3.2,3.05,3.1,3.1,3.1,169080,528508.55,"2020-04-03",210,"INE619I01012"]
["AARTIDRUGS","EQ",527.7,547,520.15,540.75,542.7,517.5,25364,13614992.05,"2020-04-03",2068,"INE767A01016"]
["AARTIIND","EQ",801.1,804,770.75,790.7,793,795.8,135885,107549233.45,"2020-04-03",18657,"INE769A01020"]
["AARVEEDEN","EQ",8.15,8.15,7.4,7.8,7.9,7.65,1750,13639.25,"2020-04-03",61,"INE273D01019"]
["AAVAS","EQ",1179,1180,1132.4,1132.4,1132.4,1192,104654,118589319.65,"2020-04-03",4176,"INE216P01012"]
["ABAN","EQ",14.35,14.75,14.05,14.75,14.75,14.05,66242,971578.05,"2020-04-03",532,"INE421A01028"]
["ABB","EQ",914.3,949,893,934.15,935,929.65,40418,37234007.25,"2020-04-03",3299,"INE117A01022"]
["ABBOTINDIA","EQ",15775,16000,15210,15810.5,15809,15613.6,28827,451028181.4,"2020-04-03",8802,"INE358A01014"]
["ABCAPITAL","EQ",42.5,45.2,41.05,43.45,43.4,42.9,1336547,57486265.15,"2020-04-03",9170,"INE674K01013"]
["ABFRL","EQ",149,149,142,145.95,146.3,149.55,431692,62392632.15,"2020-04-03",15174,"INE647O01011"]
["ABSLBANETF","EQ",210,228,203.7,228,228,223.62,13,2796.4,"2020-04-03",10,"INF209KB1O58"]
["ABSLNN50ET","EQ",234,234,211.82,211.82,211.82,236.74,39,8613.3,"2020-04-03",4,"INF209KB1B87"]
{"$rows_left_out":1685}
{"sheet":"Sheet1","index":7,"n_rows":0,"n_cols":0,"rows_kept":0,"hidden":true}

{"sheet":"Sheet3","index":8,"n_rows":0,"n_cols":0,"rows_kept":0,"hidden":true}

{"sheet":"Sheet4","index":9,"n_rows":0,"n_cols":0,"rows_kept":0,"hidden":true}

{"sheet":"Sheet5","index":10,"n_rows":0,"n_cols":0,"rows_kept":0,"hidden":true}