{"text_format":"3","workbook":"xlsx","n_sheets":11,"sheets":["Main","Future Intra","Cash Intra","MidCap Intra","Bulk Deals","Call Tracker (Equity & F&O)","Sheet2","Sheet1","Sheet3","Sheet4","Sheet5"],"not_rendered":{"images":4,"defined_names":5},"read":"whole","date_system":"1900"}

{"sheet":"Main","index":0,"n_rows":27,"n_cols":11,"rows_kept":27}
[null,"                                                                                                 "]
{"$rows_empty":8}
[null,"2019-11-06"]
[]
[null,"Sheet No.","Template Name","Summary"]
[null,1,"Future Intra","For Intraday trading in F&O segment"]
[null,2,"Cash Intra","For Intraday trading in cash market segment"]
[null,3,"Mid-cap Intra","For Intraday trading in Mid-cap stocks"]
[null,4,"Bulk Deals","Reveals Bulk Deals carried on NSE & BSE"]
[null,5,"Call Tracker"]
{"$rows_empty":9}
[{"$nulls":10},"`"]

{"sheet":"Future Intra","index":1,"n_rows":193,"n_cols":15,"rows_kept":193,"merged":[[8,0,9,0],[8,1,9,1],[8,2,9,2],[8,5,8,7],[8,8,8,10]]}
[]
[]
[]
[]
[{"$nulls":12},"Back to Main Page"]
["FOR INTRA DAY TRADING",{"$nulls":10},{"$f":"Main!B10","v":"2019-11-06"}]
[]
[]
["Sr.no","Sector","Scrip","CLOSE RATE","Pivot Point","Supports",null,null,"Resistances"]
[null,"Sector",null,"Point","Point","S1","S2","S3","R1","R2","R3","HIGH","LOW","OI","% Change in OI"]
[1,"Index","BANKNIFTY",30294.15,30323.05,{"v":30126.199999999997,"d":"30126.20"},{"v":29958.249999999996,"d":"29958.25"},{"v":29761.399999999994,"d":"29761.40"},{"v":30491,"d":"30491.00"},30687.85,{"v":30855.800000000003,"d":"30855.80"},30519.9,30155.1,1165820,{"v":0.06448137326515704,"d":"6.45%"}]
[2,"Index","NIFTY",{"v":11956,"d":"11956.00"},11951.25,11905.75,{"v":11855.5,"d":"11855.50"},{"v":11810,"d":"11810.00"},{"v":12001.5,"d":"12001.50"},{"v":12047,"d":"12047.00"},12097.25,11996.75,11901,15775875,{"v":0.02831539992080292,"d":"2.83%"}]
[3,"Index","NIFTYIT",{"v":15619,"d":"15619.00"},{"v":15609.666666666666,"d":"15609.67"},{"v":15559.333333333332,"d":"15559.33"},{"v":15499.666666666666,"d":"15499.67"},{"v":15449.333333333332,"d":"15449.33"},{"v":15669.333333333332,"d":"15669.33"},{"v":15719.666666666664,"d":"15719.67"},{"v":15779.333333333332,"d":"15779.33"},15660,15550,7600,{"v":0.034013605442176874,"d":"3.40%"}]
[4,"Cement","ACC",1522.15,{"v":1537.0333333333335,"d":"1537.03"},{"v":1503.316666666667,"d":"1503.32"},{"v":1484.4833333333336,"d":"1484.48"},{"v":1450.766666666667,"d":"1450.77"},{"v":1555.866666666667,"d":"1555.87"},{"v":1589.5833333333337,"d":"1589.58"},{"v":1608.416666666667,"d":"1608.42"},1570.75,1518.2,2735600,{"v":0.050699032109387004,"d":"5.07%"}]
[5,"Others","ADANIENT",201.25,200.65,{"v":199,"d":"199.00"},196.75,{"v":195.1,"d":"195.10"},{"v":202.9,"d":"202.90"},{"v":204.55000000000004,"d":"204.55"},{"v":206.8,"d":"206.80"},202.3,198.4,29720000,{"v":5.957216355266721E-3,"d":"0.60%"}]
[6,"Others","ADANIPORTS",{"v":390.8,"d":"390.80"},{"v":390.9166666666667,"d":"390.92"},{"v":387.3833333333334,"d":"387.38"},{"v":383.9666666666667,"d":"383.97"},{"v":380.4333333333334,"d":"380.43"},{"v":394.33333333333337,"d":"394.33"},{"v":397.8666666666667,"d":"397.87"},{"v":401.28333333333336,"d":"401.28"},394.45,387.5,16090000,{"v":7.829627309740057E-3,"d":"0.78%"}]
[7,"Power","ADANIPOWER",{"v":70.1,"d":"70.10"},{"v":70.78333333333335,"d":"70.78"},{"v":68.86666666666669,"d":"68.87"},{"v":67.63333333333334,"d":"67.63"},{"v":65.71666666666668,"d":"65.72"},{"v":72.0166666666667,"d":"72.02"},{"v":73.93333333333335,"d":"73.93"},{"v":75.1666666666667,"d":"75.17"},72.7,69.55,80080000,{"v":-0.008420009905894007,"d":"-0.84%"}]
[8,"Automobile","AMARAJABAT",658.15,{"v":657.9333333333334,"d":"657.93"},{"v":648.3666666666668,"d":"648.37"},{"v":638.5833333333334,"d":"638.58"},{"v":629.0166666666668,"d":"629.02"},{"v":667.7166666666668,"d":"667.72"},{"v":677.2833333333334,"d":"677.28"},{"v":687.0666666666668,"d":"687.07"},667.5,648.15,1349700,{"v":-0.03454935622317597,"d":"-3.45%"}]
[9,"Cement","AMBUJACEM",201.75,{"v":202.46666666666667,"d":"202.47"},{"v":199.98333333333335,"d":"199.98"},{"v":198.21666666666667,"d":"198.22"},{"v":195.73333333333335,"d":"195.73"},{"v":204.23333333333335,"d":"204.23"},{"v":206.71666666666664,"d":"206.72"},{"v":208.48333333333335,"d":"208.48"},204.95,200.7,19747500,{"v":-0.0316292754689224,"d":"-3.16%"}]
[10,"Others","APOLLOHOSP",1421.45,{"v":1429.0833333333333,"d":"1429.08"},{"v":1409.5666666666666,"d":"1409.57"},{"v":1397.6833333333334,"d":"1397.68"},{"v":1378.1666666666667,"d":"1378.17"},{"v":1440.9666666666665,"d":"1440.97"},{"v":1460.4833333333333,"d":"1460.48"},{"v":1472.3666666666663,"d":"1472.37"},1448.6,1417.2,1662000,{"v":9.0334236675700087E-4,"d":"0.09%"}]
{"$rows_left_out":159}
{"sheet":"Cash Intra","index":2,"n_rows":247,"n_cols":13,"rows_kept":247,"merged":[[7,0,8,0],[7,1,8,1],[7,2,8,2],[7,3,8,3],[7,4,7,6],[7,7,7,9]]}
[]
[]
[]
[]
[{"$nulls":12},"Back to Main Page"]
["FOR INTRA DAY TRADING",{"$nulls":9},{"$f":"Main!B10","v":"2019-11-06"}]
[]
["Sr.no","Scrip","CLOSE RATE","Pivot Point","Supports",null,null,"Resistances"]
[null,null,"Point",null,"S1","S2","S3","R1","R2","R3","HIGH","LOW","Total Trade Quanity in Lakhs"]
[1,"Nifty 50",11917.2,11919.35,11859.75,{"v":11802.3,"d":"11802.30"},{"v":11742.699999999999,"d":"11742.70"},{"v":11976.800000000001,"d":"11976.80"},{"v":12036.400000000003,"d":"12036.40"},{"v":12093.850000000002,"d":"12093.85"},11978.95,11861.9]
[2,"Nifty Bank",30219.85,{"v":30254.63333333333,"d":"30254.63"},{"v":30056.566666666662,"d":"30056.57"},{"v":29893.28333333333,"d":"29893.28"},{"v":29695.21666666666,"d":"29695.22"},{"v":30417.916666666664,"d":"30417.92"},{"v":30615.98333333333,"d":"30615.98"},{"v":30779.266666666666,"d":"30779.27"},30452.7,30091.35]
[3,"Nifty CPSE",2040.55,{"v":2049.183333333333,"d":"2049.18"},{"v":2028.766666666666,"d":"2028.77"},{"v":2016.9833333333331,"d":"2016.98"},{"v":1996.5666666666662,"d":"1996.57"},{"v":2060.966666666666,"d":"2060.97"},{"v":2081.3833333333328,"d":"2081.38"},{"v":2093.1666666666656,"d":"2093.17"},2069.6,2037.4]
[4,"Nifty Infra",3290.45,{"v":3294.7999999999997,"d":"3294.80"},{"v":3272.0999999999995,"d":"3272.10"},{"v":3253.7499999999995,"d":"3253.75"},{"v":3231.0499999999993,"d":"3231.05"},{"v":3313.1499999999996,"d":"3313.15"},{"v":3335.8499999999995,"d":"3335.85"},{"v":3354.2,"d":"3354.20"},3317.5,3276.45]
[5,"Nifty IT",15533.45,{"v":15523.116666666669,"d":"15523.12"},{"v":15433.133333333337,"d":"15433.13"},{"v":15332.816666666668,"d":"15332.82"},{"v":15242.833333333336,"d":"15242.83"},{"v":15623.433333333338,"d":"15623.43"},{"v":15713.416666666668,"d":"15713.42"},{"v":15813.733333333339,"d":"15813.73"},15613.1,15422.8]
[6,"Nifty PSE",3406.2,3414.85,{"v":3387.6499999999996,"d":"3387.65"},{"v":3369.1,"d":"3369.10"},{"v":3341.8999999999996,"d":"3341.90"},{"v":3433.3999999999996,"d":"3433.40"},{"v":3460.5999999999995,"d":"3460.60"},{"v":3479.1499999999996,"d":"3479.15"},3442.05,3396.3]
[7,"Nifty Midcap 50",4597.15,{"v":4621.3,"d":"4621.30"},{"v":4565.950000000001,"d":"4565.95"},{"v":4534.750000000001,"d":"4534.75"},{"v":4479.4000000000015,"d":"4479.40"},{"v":4652.5,"d":"4652.50"},4707.85,{"v":4739.049999999999,"d":"4739.05"},4676.65,4590.1]
[8,"ACC",1514.65,{"v":1529.6833333333334,"d":"1529.68"},{"v":1495.3666666666668,"d":"1495.37"},{"v":1476.0833333333335,"d":"1476.08"},{"v":1441.7666666666669,"d":"1441.77"},{"v":1548.9666666666667,"d":"1548.97"},{"v":1583.2833333333333,"d":"1583.28"},{"v":1602.5666666666666,"d":"1602.57"},1564,1510.4,9.14025]
[9,"AUBANK",674.75,{"v":678.9833333333333,"d":"678.98"},{"v":666.7666666666667,"d":"666.77"},{"v":658.7833333333333,"d":"658.78"},{"v":646.5666666666666,"d":"646.57"},{"v":686.9666666666667,"d":"686.97"},{"v":699.1833333333334,"d":"699.18"},{"v":707.1666666666667,"d":"707.17"},691.2,671,1.95701]
[10,"ADANIPORTS",390,{"v":389.8,"d":"389.80"},{"v":386.70000000000005,"d":"386.70"},{"v":383.40000000000003,"d":"383.40"},{"v":380.30000000000007,"d":"380.30"},{"v":393.1,"d":"393.10"},{"v":396.20000000000005,"d":"396.20"},{"v":399.5,"d":"399.50"},392.9,386.5,13.95899]
[11,"ADANIPOWER",69.9,{"v":70.56666666666668,"d":"70.57"},{"v":68.68333333333335,"d":"68.68"},{"v":67.46666666666667,"d":"67.47"},{"v":65.58333333333334,"d":"65.58"},{"v":71.78333333333336,"d":"71.78"},{"v":73.66666666666669,"d":"73.67"},{"v":74.88333333333337,"d":"74.88"},72.45,69.35,96.65951]
{"$rows_left_out":228}
{"sheet":"MidCap Intra","index":3,"n_rows":545,"n_cols":13,"rows_kept":545,"merged":[[0,0,0,1],[8,0,9,0],[8,1,9,1],[8,2,9,2],[8,3,9,3],[8,4,8,6],[8,7,8,9]]}
[]
[]
[]
[]
[{"$nulls":11},"Back To Main Page"]
["FOR INTRA DAY TRADING",{"$nulls":9},{"$f":"Main!B10","v":"2019-11-06"}]
[null,null," "]
[]
["Sr.no","Scrip","CLOSE RATE","Pivot Point","Supports",null,null,"Resistances"]
[null,null,"Point",null,"S1","S2","S3","R1","R2","R3","HIGH","LOW","Total Trade Quanity in Lakhs"]
[1,"3MINDIA",22456.5,{"v":22452.166666666668,"d":"22452.17"},{"v":22254.333333333336,"d":"22254.33"},{"v":22052.166666666668,"d":"22052.17"},{"v":21854.333333333336,"d":"21854.33"},{"v":22654.333333333336,"d":"22654.33"},{"v":22852.16666666667,"d":"22852.17"},{"v":23054.333333333336,"d":"23054.33"},22650,22250,0.01862]
[2,"ACC",1514.65,{"v":1529.6833333333334,"d":"1529.68"},{"v":1495.3666666666668,"d":"1495.37"},{"v":1476.0833333333335,"d":"1476.08"},{"v":1441.7666666666669,"d":"1441.77"},{"v":1548.9666666666667,"d":"1548.97"},{"v":1583.2833333333333,"d":"1583.28"},{"v":1602.5666666666666,"d":"1602.57"},1564,1510.4,9.14025]
[3,"AIAENG",1718.9,{"v":1705.3333333333333,"d":"1705.33"},{"v":1675.6666666666665,"d":"1675.67"},{"v":1632.4333333333332,"d":"1632.43"},{"v":1602.7666666666664,"d":"1602.77"},{"v":1748.5666666666666,"d":"1748.57"},{"v":1778.2333333333331,"d":"1778.23"},{"v":1821.4666666666667,"d":"1821.47"},1735,1662.1,0.07702]
[4,"APLAPOLLO",1497.3,1502.95,{"v":1481.9,"d":"1481.90"},{"v":1466.5,"d":"1466.50"},1445.45,{"v":1518.3500000000001,"d":"1518.35"},{"v":1539.3999999999999,"d":"1539.40"},{"v":1554.8000000000002,"d":"1554.80"},1524,1487.55,1.12676]
[5,"AUBANK",674.75,{"v":678.9833333333333,"d":"678.98"},{"v":666.7666666666667,"d":"666.77"},{"v":658.7833333333333,"d":"658.78"},{"v":646.5666666666666,"d":"646.57"},{"v":686.9666666666667,"d":"686.97"},{"v":699.1833333333334,"d":"699.18"},{"v":707.1666666666667,"d":"707.17"},691.2,671,1.95701]
[6,"AAVAS",1473.75,1492.25,{"v":1436.5,"d":"1436.50"},1399.25,{"v":1343.5,"d":"1343.50"},{"v":1529.5,"d":"1529.50"},1585.25,{"v":1622.5,"d":"1622.50"},1548,1455,0.43163]
[7,"ABBOTINDIA",11786.55,11859.85,{"v":11631.7,"d":"11631.70"},11476.85,{"v":11248.7,"d":"11248.70"},{"v":12014.7,"d":"12014.70"},{"v":12242.849999999999,"d":"12242.85"},{"v":12397.7,"d":"12397.70"},12088,11705,0.05344]
[8,"ADANIGAS",146.75,{"v":147.36666666666667,"d":"147.37"},{"v":145.88333333333335,"d":"145.88"},{"v":145.01666666666668,"d":"145.02"},{"v":143.53333333333336,"d":"143.53"},{"v":148.23333333333335,"d":"148.23"},{"v":149.7166666666667,"d":"149.72"},{"v":150.58333333333334,"d":"150.58"},148.85,146.5,4.58786]
[9,"ADANIGREEN",90.7,{"v":91.46666666666665,"d":"91.47"},{"v":89.33333333333331,"d":"89.33"},{"v":87.96666666666665,"d":"87.97"},{"v":85.83333333333331,"d":"85.83"},{"v":92.83333333333331,"d":"92.83"},{"v":94.96666666666667,"d":"94.97"},{"v":96.33333333333331,"d":"96.33"},93.6,90.1,9.63016]
[10,"ADANIPORTS",390,{"v":389.8,"d":"389.80"},{"v":386.70000000000005,"d":"386.70"},{"v":383.40000000000003,"d":"383.40"},{"v":380.30000000000007,"d":"380.30"},{"v":393.1,"d":"393.10"},{"v":396.20000000000005,"d":"396.20"},{"v":399.5,"d":"399.50"},392.9,386.5,13.95899]
{"$rows_left_out":513}
{"sheet":"Bulk Deals","index":4,"n_rows":54,"n_cols":8,"rows_kept":54,"merged":[[4,0,4,1],[4,2,4,3],[6,1,6,2]]}
[" "]
[]
[]
[]
[]
[{"$nulls":4},"Back To Main Page"]
["Subject :","BULK DEAL",null,{"$f":"Main!B10","v":"2019-11-06"}]
[]
["Date","Scrip code","Scrip Name","Client Name","Buy / Sell","Quantity Traded","Trade Price / Wt.Avg.trade price","Exchange  "]
["2019-11-05",532172,"ADROITINFO","MOHAMMED QAYYUM","BUY",{"v":174075,"d":"174,075"},{"v":7.5,"d":"7.50"},"BSE"]
["2019-11-05",532172,"ADROITINFO","JOKEMAN MEDIA AND ENTERTAINMENT PRIVATE LIMITED","SELL",{"v":176875,"d":"176,875"},{"v":7.5,"d":"7.50"},"BSE"]
["2019-11-05",542216,"DALBHARAT","TIMF HOLDINGS","BUY",{"v":994198,"d":"994,198"},815,"BSE"]
["2019-11-05",542216,"DALBHARAT","OPPENHEIMER DEVELOPING MARKET FUND","SELL",{"v":972301,"d":"972,301"},815.13,"BSE"]
["2019-11-05",539770,"DARJEELING","VIDHI NIKUNJ SHAH","BUY",{"v":3363,"d":"3,363"},91.21,"BSE"]
["2019-11-05",539770,"DARJEELING","VIDHI NIKUNJ SHAH","SELL",{"v":22363,"d":"22,363"},83.26,"BSE"]
["2019-11-05",539770,"DARJEELING","DEEPAK MALL","BUY",{"v":16000,"d":"16,000"},83.24,"BSE"]
["2019-11-05",540134,"IISL","REKHA NAVINKUMAR TANK","SELL",{"v":32494,"d":"32,494"},14.41,"BSE"]
["2019-11-05",519319,"JATALIA","HANSABEN HASMUKHBHAI AMIN","BUY",{"v":26874,"d":"26,874"},3.25,"BSE"]
["2019-11-05",519319,"JATALIA","HANSABEN HASMUKHBHAI AMIN","SELL",4,{"v":3.1,"d":"3.10"},"BSE"]
["2019-11-05",519319,"JATALIA","ANILKUMARMOODEDLA","SELL",{"v":26875,"d":"26,875"},3.25,"BSE"]
{"$rows_left_out":35}
{"sheet":"Call Tracker (Equity & F&O)","index":5,"n_rows":297,"n_cols":18,"rows_kept":297,"merged":[[77,0,78,0],[77,1,78,1],[77,9,78,9],[77,11,78,11],[77,12,78,12],[77,13,78,13],[77,14,78,14],[79,0,80,0],[79,1,80,1],[79,9,80,9],[79,11,80,11],[79,12,80,12],[79,13,80,13],[79,14,80,14],[81,0,82,0],[81,1,82,1],[81,9,82,9],[81,11,82,11],[81,12,82,12],[81,13,82,13],[81,14,82,14],[83,0,84,0],[83,1,84,1],[83,9,84,9],[83,11,84,11],[83,12,84,12],[83,13,84,13],[83,14,84,14],[85,0,86,0],[85,1,86,1],[85,9,86,9],[85,11,86,11],[85,12,86,12],[85,13,86,13],[85,14,86,14],[87,0,88,0],[87,1,88,1],[87,9,88,9],[87,11,88,11],[87,12,88,12],[87,13,88,13],[87,14,88,14],[89,0,90,0],[89,1,90,1],[89,9,90,9],[89,11,90,11],[89,12,90,12],[89,13,90,13],[89,14,90,14],[91,0,92,0],[91,1,92,1],[91,9,92,9],[91,11,92,11],[91,12,92,12],[91,13,92,13],[91,14,92,14],[93,0,94,0],[93,1,94,1],[93,9,94,9],[93,11,94,11],[93,12,94,12],[93,13,94,13],[93,14,94,14],[95,0,96,0],[95,1,96,1],[95,9,96,9],[95,11,96,11],[95,12,96,12],[95,13,96,13],[95,14,96,14],[97,0,98,0],[97,1,98,1],[97,9,98,9],[97,11,98,11],[97,12,98,12],[97,13,98,13],[97,14,98,14],[99,0,100,0],[99,1,100,1],[99,9,100,9],[99,11,100,11],[99,12,100,12],[99,13,100,13],[99,14,100,14],[101,0,102,0],[101,1,102,1],[101,9,102,9],[101,11,102,11],[101,12,102,12],[101,13,102,13],[101,14,102,14],[103,0,104,0],[103,1,104,1],[103,9,104,9],[103,11,104,11],[103,12,104,12],[103,13,104,13],[103,14,104,14],[105,0,106,0],[105,1,106,1],[105,9,106,9],[105,11,106,11],[105,12,106,12],[105,13,106,13],[105,14,106,14],[112,0,113,0],[112,1,113,1],[112,9,113,9],[112,11,113,11],[112,12,113,12],[112,13,113,13],[112,14,113,14],[114,0,115,0],[114,1,115,1],[114,9,115,9],[114,11,115,11],[114,12,115,12],[114,13,115,13],[114,14,115,14],[117,0,118,0],[117,1,118,1],[117,9,118,9],[117,11,118,11],[117,12,118,12],[117,13,118,13],[117,14,118,14],[119,0,120,0],[119,1,120,1],[119,9,120,9],[119,11,120,11],[119,12,120,12],[119,13,120,13],[119,14,120,14]]}
[]
[]
[]
[]
[{"$nulls":12},"Back To Main Page"]
["Retail Research Technical Calls & Fundamental Performance Report for the month of November-2019 "]
[{"$nulls":12},{"$f":"Main!B10","v":"2019-11-06"}]
[null,"Positional  Call"]
["Sr.no","Date",null,"Company","Rec","Rec Price","Stop Loss***","Call Closed At","Target","Remark","Profit / Loss per Share","Gain / Loss  %","Status","Closed Date","NSE Closed Price"]
[1,"2019-09-26",null,"HDFC","Buy",2070,1940,2165,"2250-2300","Profit of Rs.95/-",{"$f":"H10-F10","v":95},{"$f":"K10/F10","v":{"v":0.04589371980676329,"d":"4.59%"}},"Successful","2019-11-01",{"$nulls":3},"H"]
[2,"2019-10-01",null,"UPL","Buy",595,564,614,"650-660","Part Profit of Rs.19/-",19,{"v":0.031932773109243695,"d":"3.19%"},"Successful","2019-11-05",{"$f":"VLOOKUP(D11,Sheet2!A50:M1689,6,0)","v":605.65},null,null,"R"]
[3,"2019-10-07",null,"PIDILITIND","Buy",1367.5,1297,1413.5,"1500-1520","Part Profit of Rs.46/-",{"$f":"H12-F12","v":46},{"$f":"K12/F12","v":{"v":0.03363802559414991,"d":"3.36%"}},"Successful","2019-10-31",{"$f":"VLOOKUP(D12,Sheet2!A51:M1690,6,0)","v":1388.8},null,null,"R"]
[4,"2019-10-22",null,"HEIDELBERG","Buy",188.5,178,199,"205-210","Profit of Rs.10.50/-",10.5,{"v":0.05570291777188329,"d":"5.57%"},"Successful","2019-11-05",{"$nulls":3},"H"]
[5,"2019-10-27",null,"AMBUJACEM","Buy",197,185.4,203.5,"216-220","Part Profit of Rs.6.5/-",{"$f":"H14-F14","v":6.5},{"$f":"K14/F14","v":{"v":0.03299492385786802,"d":"3.30%"}},"Successful","2019-10-30",{"$f":"VLOOKUP(D14,Sheet2!A60:M1699,6,0)","v":201.55},null,null,"R"]
[6,"2019-11-04",null,"UBL","Buy","1237-1243",1178,null,"1340-1360","Open",{"$nulls":4},{"$f":"VLOOKUP(D15,Sheet2!A60:M1699,6,0)","v":1217.85},null,null,"H"]
[7,"2019-11-05",null,"TATAMOTORS ","Sell","172-174",183.3,null,"158-155","Open"]
{"$rows_empty":13}
["CLBS = Closing Basis ***"]
["Dividend adjusted <>",{"$nulls":4},"Reinitiated $"]
["Part book {}",{"$nulls":4},"Revised stoploss #"]
{"$rows_left_out":241}
{"sheet":"Sheet2","index":6,"n_rows":1899,"n_cols":14,"rows_kept":1899,"hidden":true}
["SYMBOL","SERIES","OPEN","HIGH","LOW","CLOSE","LAST","PREVCLOSE","TOTTRDQTY","TOTTRDVAL","TIMESTAMP","TOTALTRADES","ISIN","ISIN"]
["20MICRONS","EQ",37.05,39.25,37.05,39,38.85,37.35,169093,6531376.65,"2019-11-05",1460,"INE144J01027"]
["21STCENMGM","EQ",13.75,13.75,13.75,13.75,13.75,13.5,203,2791.25,"2019-11-05",3,"INE253B01015"]
["3IINFOTECH","EQ",2.05,2.05,1.95,1.95,2,2,1445744,2892782.5,"2019-11-05",559,"INE748C01020"]
["3MINDIA","EQ",22499.85,22650,22250,22456.5,22390,22314.85,1862,41754586.5,"2019-11-05",923,"INE470A01017"]
["3PLAND","EQ",6.5,6.5,6.5,6.5,6.5,6.5,20,130,"2019-11-05",2,"INE105C01023"]
["5PAISA","EQ",170.35,170.4,164,168.95,169,166.25,4775,805698.85,"2019-11-05",177,"INE618L01018"]
["63MOONS","EQ",118.2,119.95,116.9,117.45,117.6,117.6,70674,8341894.1,"2019-11-05",1353,"INE111B01023"]
["A2ZINFRA","EQ",10.25,10.3,9.85,10,10.05,10,241785,2436371.1,"2019-11-05",493,"INE619I01012"]
["AARTIDRUGS","EQ",532,532,515.7,522.85,524.75,526.6,7840,4091251.85,"2019-11-05",668,"INE767A01016"]
["AARTIIND","EQ",850.3,869.8,838,845,844.6,852.1,73911,63353150.45,"2019-11-05",3362,"INE769A01020"]
["AARVEEDEN","EQ",15.45,15.5,12.75,13.85,13.7,14.3,27199,374165.5,"2019-11-05",434,"INE273D01019"]
["AAVAS","EQ",1533,1548,1455,1473.75,1464.95,1532.55,43163,64713125.75,"2019-11-05",3568,"INE216P01012"]
["ABAN","BE",30.85,30.85,30.85,30.85,30.85,29.4,45368,1399602.8,"2019-11-05",333,"INE421A01028"]
["ABB","EQ",1457.25,1474,1445.55,1448.35,1449,1456.7,40619,59215154,"2019-11-05",4209,"INE117A01022"]
["ABBOTINDIA","EQ",12088,12088,11705,11786.55,11839.95,11987.25,5344,63191407.15,"2019-11-05",2194,"INE358A01014"]
["ABCAPITAL","EQ",83.65,85.95,83,85.45,85.5,83.35,3470582,294183831.2,"2019-11-05",36475,"INE674K01013"]
["ABFRL","EQ",213.85,214.95,205.8,209.6,208.95,213.7,475008,99481730.05,"2019-11-05",8580,"INE647O01011"]
["ABSLBANETF","EQ",275.19,329.9,275.19,329.9,329.9,330,94,26414.96,"2019-11-05",10,"INF209KB1O58"]
["ACC","EQ",1561,1564,1510.4,1514.65,1515,1564.65,914025,1400100419.85,"2019-11-05",44378,"INE012A01025"]
{"$rows_left_out":1701}
{"sheet":"Sheet1","index":7,"n_rows":0,"n_cols":0,"rows_kept":0,"hidden":true}

{"sheet":"Sheet3","index":8,"n_rows":0,"n_cols":0,"rows_kept":0,"hidden":true}

{"sheet":"Sheet4","index":9,"n_rows":0,"n_cols":0,"rows_kept":0,"hidden":true}

{"sheet":"Sheet5","index":10,"n_rows":0,"n_cols":0,"rows_kept":0,"hidden":true}