{"text_format":"3","workbook":"xlsx","n_sheets":11,"sheets":["Main","Future Intra","Cash Intra","MidCap Intra","Bulk Deals","Call Tracker (Equity & F&O)","Sheet2","Sheet1","Sheet3","Sheet4","Sheet5"],"not_rendered":{"images":4,"defined_names":5},"read":"whole","date_system":"1900"}

{"sheet":"Main","index":0,"n_rows":27,"n_cols":11,"rows_kept":27}
[null,"                                                                                                 "]
{"$rows_empty":8}
[null,"2019-10-04"]
[]
[null,"Sheet No.","Template Name","Summary"]
[null,1,"Future Intra","For Intraday trading in F&O segment"]
[null,2,"Cash Intra","For Intraday trading in cash market segment"]
[null,3,"Mid-cap Intra","For Intraday trading in Mid-cap stocks"]
[null,4,"Bulk Deals","Reveals Bulk Deals carried on NSE & BSE"]
[null,5,"Call Tracker"]
{"$rows_empty":9}
[{"$nulls":10},"`"]

{"sheet":"Future Intra","index":1,"n_rows":193,"n_cols":15,"rows_kept":193,"merged":[[8,0,9,0],[8,1,9,1],[8,2,9,2],[8,5,8,7],[8,8,8,10]]}
[]
[]
[]
[]
[{"$nulls":12},"Back to Main Page"]
["FOR INTRA DAY TRADING",{"$nulls":10},{"$f":"Main!B10","v":"2019-10-04"}]
[]
[]
["Sr.no","Sector","Scrip","CLOSE RATE","Pivot Point","Supports",null,null,"Resistances"]
[null,"Sector",null,"Point","Point","S1","S2","S3","R1","R2","R3","HIGH","LOW","OI","% Change in OI"]
[1,"Index","BANKNIFTY",28570.85,28619.75,{"v":28319.7,"d":"28319.70"},28068.55,{"v":27768.5,"d":"27768.50"},{"v":28870.9,"d":"28870.90"},{"v":29170.950000000004,"d":"29170.95"},{"v":29422.100000000002,"d":"29422.10"},28919.8,28368.6,1665380,{"v":0.05160198527461703,"d":"5.16%"}]
[2,"Index","NIFTY",{"v":11361.8,"d":"11361.80"},{"v":11364.033333333333,"d":"11364.03"},{"v":11310.066666666666,"d":"11310.07"},{"v":11258.333333333332,"d":"11258.33"},{"v":11204.366666666665,"d":"11204.37"},{"v":11415.766666666666,"d":"11415.77"},{"v":11469.733333333334,"d":"11469.73"},{"v":11521.466666666667,"d":"11521.47"},11418,11312.3,16781550,{"v":0.023333882150632056,"d":"2.33%"}]
[3,"Index","NIFTYIT",{"v":15361,"d":"15361.00"},{"v":15373.666666666666,"d":"15373.67"},{"v":15287.333333333332,"d":"15287.33"},{"v":15213.666666666666,"d":"15213.67"},{"v":15127.333333333332,"d":"15127.33"},{"v":15447.333333333332,"d":"15447.33"},{"v":15533.666666666664,"d":"15533.67"},{"v":15607.333333333332,"d":"15607.33"},15460,15300,11000,{"v":0.04265402843601896,"d":"4.27%"}]
[4,"Cement","ACC",{"v":1556.5,"d":"1556.50"},{"v":1565.1333333333332,"d":"1565.13"},{"v":1537.8666666666663,"d":"1537.87"},{"v":1519.2333333333331,"d":"1519.23"},{"v":1491.9666666666662,"d":"1491.97"},{"v":1583.7666666666664,"d":"1583.77"},{"v":1611.0333333333333,"d":"1611.03"},{"v":1629.6666666666665,"d":"1629.67"},1592.4,1546.5,2182800,{"v":0.08575407879029048,"d":"8.58%"}]
[5,"Others","ADANIENT",{"v":144.1,"d":"144.10"},{"v":143.73333333333332,"d":"143.73"},{"v":141.91666666666663,"d":"141.92"},{"v":139.73333333333332,"d":"139.73"},{"v":137.91666666666663,"d":"137.92"},{"v":145.91666666666663,"d":"145.92"},{"v":147.7333333333333,"d":"147.73"},{"v":149.91666666666663,"d":"149.92"},145.55,141.55,25780000,{"v":0.013364779874213837,"d":"1.34%"}]
[6,"Others","ADANIPORTS",406.35,{"v":405.5,"d":"405.50"},402.45,398.55,{"v":395.5,"d":"395.50"},{"v":409.4,"d":"409.40"},{"v":412.44999999999993,"d":"412.45"},{"v":416.34999999999997,"d":"416.35"},408.55,401.6,11812500,{"v":0.04930046635576282,"d":"4.93%"}]
[7,"Power","ADANIPOWER",{"v":61.5,"d":"61.50"},{"v":61.56666666666666,"d":"61.57"},{"v":60.783333333333324,"d":"60.78"},{"v":60.06666666666666,"d":"60.07"},{"v":59.283333333333324,"d":"59.28"},{"v":62.283333333333324,"d":"62.28"},{"v":63.066666666666656,"d":"63.07"},{"v":63.783333333333324,"d":"63.78"},62.35,60.85,90900000,{"v":1.3218770654329147E-3,"d":"0.13%"}]
[8,"Automobile","AMARAJABAT",{"v":713.5,"d":"713.50"},{"v":708.7666666666668,"d":"708.77"},{"v":699.6833333333335,"d":"699.68"},{"v":685.8666666666668,"d":"685.87"},{"v":676.7833333333335,"d":"676.78"},{"v":722.5833333333335,"d":"722.58"},{"v":731.6666666666667,"d":"731.67"},{"v":745.4833333333335,"d":"745.48"},717.85,694.95,1639400,{"v":-0.017205203524968526,"d":"-1.72%"}]
[9,"Cement","AMBUJACEM",{"v":197.6,"d":"197.60"},198.25,{"v":194.5,"d":"194.50"},{"v":191.4,"d":"191.40"},187.65,201.35,{"v":205.1,"d":"205.10"},{"v":208.2,"d":"208.20"},202,195.15,24525000,{"v":-3.3526363913441025E-3,"d":"-0.34%"}]
[10,"Others","APOLLOHOSP",{"v":1386.1,"d":"1386.10"},1378.05,{"v":1365.5,"d":"1365.50"},{"v":1344.9,"d":"1344.90"},{"v":1332.3500000000001,"d":"1332.35"},{"v":1398.6499999999999,"d":"1398.65"},{"v":1411.1999999999996,"d":"1411.20"},{"v":1431.7999999999997,"d":"1431.80"},1390.6,1357.45,1861500,{"v":0.014717906786590351,"d":"1.47%"}]
{"$rows_left_out":160}
{"sheet":"Cash Intra","index":2,"n_rows":247,"n_cols":13,"rows_kept":247,"merged":[[7,0,8,0],[7,1,8,1],[7,2,8,2],[7,3,8,3],[7,4,7,6],[7,7,7,9]]}
[]
[]
[]
[]
[{"$nulls":12},"Back to Main Page"]
["FOR INTRA DAY TRADING",{"$nulls":9},{"$f":"Main!B10","v":"2019-10-04"}]
[]
["Sr.no","Scrip","CLOSE RATE","Pivot Point","Supports",null,null,"Resistances"]
[null,null,"Point",null,"S1","S2","S3","R1","R2","R3","HIGH","LOW","Total Trade Quanity in Lakhs"]
[1,"Nifty 50",11314,{"v":11313.916666666666,"d":"11313.92"},{"v":11257.433333333332,"d":"11257.43"},{"v":11200.866666666667,"d":"11200.87"},{"v":11144.383333333333,"d":"11144.38"},{"v":11370.483333333332,"d":"11370.48"},{"v":11426.966666666665,"d":"11426.97"},{"v":11483.533333333331,"d":"11483.53"},11370.4,11257.35]
[2,"Nifty Bank",28414.1,{"v":28474.666666666668,"d":"28474.67"},{"v":28180.233333333337,"d":"28180.23"},{"v":27946.36666666667,"d":"27946.37"},{"v":27651.933333333338,"d":"27651.93"},{"v":28708.533333333336,"d":"28708.53"},{"v":29002.966666666664,"d":"29002.97"},{"v":29236.833333333336,"d":"29236.83"},28769.1,28240.8]
[3,"Nifty CPSE",1927.1,{"v":1927.1166666666668,"d":"1927.12"},{"v":1911.0833333333335,"d":"1911.08"},{"v":1895.0666666666666,"d":"1895.07"},{"v":1879.0333333333333,"d":"1879.03"},{"v":1943.1333333333337,"d":"1943.13"},{"v":1959.166666666667,"d":"1959.17"},{"v":1975.1833333333338,"d":"1975.18"},1943.15,1911.1]
[4,"Nifty Infra",3171.2,{"v":3160.933333333333,"d":"3160.93"},{"v":3134.216666666666,"d":"3134.22"},{"v":3097.2333333333327,"d":"3097.23"},{"v":3070.5166666666655,"d":"3070.52"},{"v":3197.916666666666,"d":"3197.92"},{"v":3224.633333333333,"d":"3224.63"},{"v":3261.6166666666663,"d":"3261.62"},3187.65,3123.95]
[5,"Nifty IT",15277.95,{"v":15308.033333333333,"d":"15308.03"},{"v":15198.816666666666,"d":"15198.82"},{"v":15119.683333333332,"d":"15119.68"},{"v":15010.466666666665,"d":"15010.47"},{"v":15387.166666666666,"d":"15387.17"},{"v":15496.383333333333,"d":"15496.38"},{"v":15575.516666666666,"d":"15575.52"},15417.25,15228.9]
[6,"Nifty PSE",3272.55,{"v":3257.4,"d":"3257.40"},3231.05,3189.55,{"v":3163.2000000000003,"d":"3163.20"},{"v":3298.9,"d":"3298.90"},{"v":3325.2499999999995,"d":"3325.25"},3366.75,3283.75,3215.9]
[7,"Nifty Midcap 50",4303.65,{"v":4298.716666666666,"d":"4298.72"},{"v":4264.483333333333,"d":"4264.48"},{"v":4225.316666666667,"d":"4225.32"},{"v":4191.083333333333,"d":"4191.08"},{"v":4337.883333333332,"d":"4337.88"},{"v":4372.116666666666,"d":"4372.12"},{"v":4411.283333333332,"d":"4411.28"},4332.95,4259.55]
[8,"ACC",1545.75,{"v":1555.2,"d":"1555.20"},{"v":1527.5500000000002,"d":"1527.55"},{"v":1509.3500000000001,"d":"1509.35"},{"v":1481.7000000000003,"d":"1481.70"},{"v":1573.4,"d":"1573.40"},{"v":1601.0500000000002,"d":"1601.05"},1619.25,1582.85,1537,7.15946]
[9,"AUBANK",649.85,{"v":648.4333333333334,"d":"648.43"},{"v":644.0666666666668,"d":"644.07"},{"v":638.2833333333334,"d":"638.28"},{"v":633.9166666666669,"d":"633.92"},{"v":654.2166666666668,"d":"654.22"},{"v":658.5833333333334,"d":"658.58"},{"v":664.3666666666668,"d":"664.37"},652.8,642.65,1.79831]
[10,"ADANIPORTS",403.9,{"v":402.8999999999999,"d":"402.90"},{"v":399.59999999999985,"d":"399.60"},{"v":395.29999999999995,"d":"395.30"},{"v":391.9999999999999,"d":"392.00"},{"v":407.1999999999998,"d":"407.20"},{"v":410.4999999999999,"d":"410.50"},{"v":414.7999999999998,"d":"414.80"},406.2,398.6,26.19077]
[11,"ADANIPOWER",61.3,{"v":61.333333333333336,"d":"61.33"},{"v":60.56666666666667,"d":"60.57"},{"v":59.833333333333336,"d":"59.83"},{"v":59.06666666666667,"d":"59.07"},{"v":62.06666666666667,"d":"62.07"},{"v":62.833333333333336,"d":"62.83"},{"v":63.56666666666667,"d":"63.57"},62.1,60.6,79.01384]
{"$rows_left_out":228}
{"sheet":"MidCap Intra","index":3,"n_rows":545,"n_cols":13,"rows_kept":545,"merged":[[0,0,0,1],[8,0,9,0],[8,1,9,1],[8,2,9,2],[8,3,9,3],[8,4,8,6],[8,7,8,9]]}
[]
[]
[]
[]
[{"$nulls":11},"Back To Main Page"]
["FOR INTRA DAY TRADING",{"$nulls":9},{"$f":"Main!B10","v":"2019-10-04"}]
[null,null," "]
[]
["Sr.no","Scrip","CLOSE RATE","Pivot Point","Supports",null,null,"Resistances"]
[null,null,"Point",null,"S1","S2","S3","R1","R2","R3","HIGH","LOW","Total Trade Quanity in Lakhs"]
[1,"3MINDIA",19988.75,{"v":20025.566666666666,"d":"20025.57"},{"v":19763.18333333333,"d":"19763.18"},{"v":19537.616666666665,"d":"19537.62"},{"v":19275.23333333333,"d":"19275.23"},{"v":20251.13333333333,"d":"20251.13"},{"v":20513.516666666663,"d":"20513.52"},{"v":20739.083333333332,"d":"20739.08"},20287.95,19800,0.01377]
[2,"ACC",1545.75,{"v":1555.2,"d":"1555.20"},{"v":1527.5500000000002,"d":"1527.55"},{"v":1509.3500000000001,"d":"1509.35"},{"v":1481.7000000000003,"d":"1481.70"},{"v":1573.4,"d":"1573.40"},{"v":1601.0500000000002,"d":"1601.05"},1619.25,1582.85,1537,7.15946]
[3,"AIAENG",1663.85,{"v":1674.9166666666667,"d":"1674.92"},{"v":1637.9333333333334,"d":"1637.93"},{"v":1612.0166666666667,"d":"1612.02"},{"v":1575.0333333333333,"d":"1575.03"},{"v":1700.8333333333335,"d":"1700.83"},{"v":1737.8166666666666,"d":"1737.82"},{"v":1763.7333333333336,"d":"1763.73"},1711.9,1649,0.22881]
[4,"APLAPOLLO",1329.3,{"v":1357.3666666666666,"d":"1357.37"},{"v":1292.9333333333332,"d":"1292.93"},{"v":1256.5666666666666,"d":"1256.57"},{"v":1192.1333333333332,"d":"1192.13"},{"v":1393.7333333333331,"d":"1393.73"},{"v":1458.1666666666665,"d":"1458.17"},{"v":1494.533333333333,"d":"1494.53"},1421.8,1321,0.39798]
[5,"AUBANK",649.85,{"v":648.4333333333334,"d":"648.43"},{"v":644.0666666666668,"d":"644.07"},{"v":638.2833333333334,"d":"638.28"},{"v":633.9166666666669,"d":"633.92"},{"v":654.2166666666668,"d":"654.22"},{"v":658.5833333333334,"d":"658.58"},{"v":664.3666666666668,"d":"664.37"},652.8,642.65,1.79831]
[6,"AAVAS",1612.95,{"v":1600.9833333333333,"d":"1600.98"},{"v":1581.9666666666667,"d":"1581.97"},{"v":1550.9833333333333,"d":"1550.98"},{"v":1531.9666666666667,"d":"1531.97"},{"v":1631.9666666666667,"d":"1631.97"},{"v":1650.9833333333336,"d":"1650.98"},{"v":1681.9666666666667,"d":"1681.97"},1620,1570,0.05138]
[7,"ABBOTINDIA",10997.85,{"v":11068.949999999999,"d":"11068.95"},{"v":10839.899999999998,"d":"10839.90"},{"v":10681.949999999999,"d":"10681.95"},{"v":10452.899999999998,"d":"10452.90"},{"v":11226.899999999998,"d":"11226.90"},{"v":11455.949999999997,"d":"11455.95"},{"v":11613.899999999998,"d":"11613.90"},11298,10911,0.13582]
[8,"ADANIGAS",128.65,{"v":129.88333333333333,"d":"129.88"},{"v":126.86666666666665,"d":"126.87"},{"v":125.08333333333331,"d":"125.08"},{"v":122.06666666666663,"d":"122.07"},{"v":131.66666666666666,"d":"131.67"},{"v":134.6833333333333,"d":"134.68"},{"v":136.46666666666667,"d":"136.47"},132.9,128.1,4.01737]
[9,"ADANIGREEN",61.2,{"v":59.81666666666666,"d":"59.82"},{"v":56.383333333333326,"d":"56.38"},{"v":51.56666666666666,"d":"51.57"},{"v":48.133333333333326,"d":"48.13"},{"v":64.63333333333333,"d":"64.63"},{"v":68.06666666666666,"d":"68.07"},{"v":72.88333333333333,"d":"72.88"},63.25,55,31.83487]
[10,"ADANIPORTS",403.9,{"v":402.8999999999999,"d":"402.90"},{"v":399.59999999999985,"d":"399.60"},{"v":395.29999999999995,"d":"395.30"},{"v":391.9999999999999,"d":"392.00"},{"v":407.1999999999998,"d":"407.20"},{"v":410.4999999999999,"d":"410.50"},{"v":414.7999999999998,"d":"414.80"},406.2,398.6,26.19077]
{"$rows_left_out":513}
{"sheet":"Bulk Deals","index":4,"n_rows":54,"n_cols":8,"rows_kept":54,"merged":[[4,0,4,1],[4,2,4,3],[6,1,6,2]]}
[" "]
[]
[]
[]
[]
[{"$nulls":4},"Back To Main Page"]
["Subject :","BULK DEAL",null,{"$f":"Main!B10","v":"2019-10-04"}]
[]
["Date","Scrip code","Scrip Name","Client Name","Buy / Sell","Quantity Traded","Trade Price / Wt.Avg.trade price","Exchange  "]
["2019-10-03",539570,"ACEWIN","AMALIN CLARA MARY","BUY",{"v":57600,"d":"57,600"},6.11,"BSE"]
["2019-10-03",511463,"ALEXANDER","VANDNA ANIRUDH SETHI","BUY",{"v":62565,"d":"62,565"},20.34,"BSE"]
["2019-10-03",541401,"ARIHANTINS","DINESH DALICHAND VORA","BUY",{"v":52000,"d":"52,000"},7.58,"BSE"]
["2019-10-03",541401,"ARIHANTINS","ASHISH HASMUKHLAL SHAH","BUY",{"v":52000,"d":"52,000"},7.51,"BSE"]
["2019-10-03",541401,"ARIHANTINS","ASHISH HASMUKHLAL SHAH","SELL",{"v":20000,"d":"20,000"},7.37,"BSE"]
["2019-10-03",590122,"ASHIKACR","KABIR SHRAN DAGAR (HUF)","BUY",{"v":46400,"d":"46,400"},38.38,"BSE"]
["2019-10-03",590122,"ASHIKACR","KABIR SHRAN DAGAR (HUF)","SELL",{"v":4400,"d":"4,400"},38.4,"BSE"]
["2019-10-03",541702,"ASHNI","JIGNESH BABULAL PARIKH","SELL",{"v":50000,"d":"50,000"},1.51,"BSE"]
["2019-10-03",526235,"MERCATOR","MULTIPLIER SHARE & STOCK ADVISORS PRIVATE LIMITED","BUY",{"v":104568,"d":"104,568"},{"v":1.1,"d":"1.10"},"BSE"]
["2019-10-03",526235,"MERCATOR","MULTIPLIER SHARE & STOCK ADVISORS PRIVATE LIMITED","SELL",{"v":1903568,"d":"1,903,568"},1.03,"BSE"]
["2019-10-03",531272,"NIKKIGL","SHRADDHA DEVI SARAF","SELL",{"v":20000,"d":"20,000"},6.17,"BSE"]
{"$rows_left_out":35}
{"sheet":"Call Tracker (Equity & F&O)","index":5,"n_rows":243,"n_cols":18,"rows_kept":243,"merged":[[52,0,53,0],[52,1,53,1],[52,9,53,9],[52,11,53,11],[52,12,53,12],[52,13,53,13],[52,14,53,14],[54,0,55,0],[54,1,55,1],[54,9,55,9],[54,11,55,11],[54,12,55,12],[54,13,55,13],[54,14,55,14]]}
[]
[]
[]
[]
[{"$nulls":12},"Back To Main Page"]
["Retail Research Technical Calls & Fundamental Performance Report for the month of October-2019 "]
[{"$nulls":12},{"$f":"Main!B10","v":"2019-10-04"}]
[null,"Positional  Call"]
["Sr.no","Date",null,"Company","Rec","Rec Price","Stop Loss***","Call Closed At","Target","Remark","Profit / Loss per Share","Gain / Loss  %","Status","Closed Date","NSE Closed Price"]
[1,"2019-08-30",null,"BIOCON","Buy{}",229.5,214.3,237,"255-260","Part Profit of Rs.7.5/-",{"$f":"H10-F10","v":7.5},{"$f":"K10/F10","v":{"v":0.0326797385620915,"d":"3.27%"}},"Successful","2019-08-30",{"$f":"VLOOKUP(D10,Sheet2!A38:M1677,6,0)","v":232.2},null,null,"R"]
[2,"2019-09-09",null,"TORNTPHARM","Sell",1705,1808,1618,"1560-1540","Profit of Rs.87/-",{"$f":"F11-H11","v":87},{"$f":"K11/F11","v":{"v":0.0510263929618768,"d":"5.10%"}},"Successful","2019-10-01",{"$nulls":3},"R"]
[3,"2019-09-25",null,"AXISBANK","Buy","690-700",628,null,"800-820","Open",{"$nulls":4},{"$f":"VLOOKUP(D12,Sheet2!A41:M1680,6,0)","v":668.4},null,null,"H"]
[4,"2019-09-26",null,"HDFC","Buy","2065-2075",1940,null,"2250-2300","Open",{"$nulls":4},{"$f":"VLOOKUP(D13,Sheet2!A42:M1681,6,0)","v":1974.55},null,null,"H"]
[5,"2019-09-26",null,"BANKBARODA","Buy",96,89,89.5,"110-114","Loss of Rs.6.5/-",{"$f":"H14-F14","v":-6.5},{"$f":"K14/F14","v":{"v":-0.0677083333333333,"d":"-6.77%"}},"UnSuccessful","2019-10-01",{"$nulls":3},"H"]
[6,"2019-09-30",null,"BPCL","Sell",475,510,503,"420-410","Loss of Rs.28/-",{"$f":"F15-H15","v":-28},{"v":-0.0589473684210526,"d":"-5.89%"},"UnSuccessful","2019-10-03",{"$nulls":3},"H"]
[7,"2019-10-01",null,"CUMMINSIND","Buy","574-579",530,null,"640-660","Open",{"$nulls":4},{"$f":"VLOOKUP(D16,Sheet2!A46:M1685,6,0)","v":559.5},null,null,"H"]
[8,"2019-10-01",null,"UPL","Buy","592-598",564,null,"650-660","Open",{"$nulls":4},{"$f":"VLOOKUP(D17,Sheet2!A47:M1686,6,0)","v":594.4},null,null,"R"]
[9,"2019-10-03",null,"HEIDELBERG","Buy","182-184",169,null,"205-210","Open",{"$nulls":4},{"$f":"VLOOKUP(D18,Sheet2!A48:M1687,6,0)","v":185.2}]
[10,"2019-10-03",null,"APOLLOHOSP","Buy","1375-1382",1286,null,"1550-1580","Open",{"$nulls":4},{"$f":"VLOOKUP(D19,Sheet2!A49:M1688,6,0)","v":1379.1}]
[]
{"$rows_left_out":211}
{"sheet":"Sheet2","index":6,"n_rows":1899,"n_cols":14,"rows_kept":1899,"hidden":true}
["SYMBOL","SERIES","OPEN","HIGH","LOW","CLOSE","LAST","PREVCLOSE","TOTTRDQTY","TOTTRDVAL","TIMESTAMP","TOTALTRADES","ISIN","ISIN"]
["20MICRONS","EQ",38.95,38.95,37,37.65,37.6,37.9,24437,920996.7,"2019-10-03",329,"INE144J01027"]
["21STCENMGM","EQ",13.2,13.2,13.2,13.2,13.2,13.15,20,264,"2019-10-03",1,"INE253B01015"]
["3IINFOTECH","EQ",2,2,1.9,2,2,1.95,668807,1313742.6,"2019-10-03",484,"INE748C01020"]
["3MINDIA","EQ",20287.95,20287.95,19800,19988.75,20000,20008.2,1377,27506833,"2019-10-03",804,"INE470A01017"]
["3PLAND","EQ",6.2,6.2,6.2,6.2,6.2,5.95,15,93,"2019-10-03",3,"INE105C01023"]
["5PAISA","EQ",172,174.8,171.8,171.8,171.8,180.8,3233,555498.45,"2019-10-03",82,"INE618L01018"]
["63MOONS","EQ",119.8,122.65,116,119.4,119.2,120.6,98903,11833865.55,"2019-10-03",2035,"INE111B01023"]
["A2ZINFRA","EQ",9.8,10.1,9.8,9.9,9.85,10,81888,815546.3,"2019-10-03",210,"INE619I01012"]
["AARTIDRUGS","EQ",461,461,443,455.75,460.95,455.6,3648,1643371.35,"2019-10-03",487,"INE767A01016"]
["AARTIIND","EQ",759.95,760,741.15,748.9,749.95,758.85,110544,82790978.2,"2019-10-03",9267,"INE769A01020"]
["AARVEEDEN","EQ",15.85,15.9,14.6,14.9,15.5,15.1,9648,144450.8,"2019-10-03",318,"INE273D01019"]
["AAVAS","EQ",1570,1620,1570,1612.95,1613.5,1580.2,5138,8226504.75,"2019-10-03",1154,"INE216P01012"]
["ABAN","BE",25,26.15,23.75,26.1,26.15,24.95,64408,1577719.3,"2019-10-03",624,"INE421A01028"]
["ABB","EQ",1480.45,1486,1450.1,1461.1,1461,1485.5,182070,266099095.75,"2019-10-03",10578,"INE117A01022"]
["ABBOTINDIA","EQ",10961,11298,10911,10997.85,10974,10861,13582,151214274.75,"2019-10-03",3283,"INE358A01014"]
["ABCAPITAL","EQ",80.6,80.95,78.5,78.75,78.85,81.4,1422854,112914742.3,"2019-10-03",15470,"INE674K01013"]
["ABFRL","EQ",206.5,211.5,203.3,210.4,209.5,206.5,196473,40811349.65,"2019-10-03",5163,"INE647O01011"]
["ABMINTLTD","BE",14.1,14.1,14.1,14.1,14.1,14.1,25,352.5,"2019-10-03",1,"INE251C01017"]
["ACC","EQ",1564,1582.85,1537,1545.75,1543.9,1575.7,715946,1114054802.45,"2019-10-03",32528,"INE012A01025"]
{"$rows_left_out":1701}
{"sheet":"Sheet1","index":7,"n_rows":0,"n_cols":0,"rows_kept":0,"hidden":true}

{"sheet":"Sheet3","index":8,"n_rows":0,"n_cols":0,"rows_kept":0,"hidden":true}

{"sheet":"Sheet4","index":9,"n_rows":0,"n_cols":0,"rows_kept":0,"hidden":true}

{"sheet":"Sheet5","index":10,"n_rows":0,"n_cols":0,"rows_kept":0,"hidden":true}