{"text_format":"3","workbook":"xlsx","n_sheets":6,"sheets":["Main","Future Intra","Cash Intra","MidCap Intra","Bulk Deals","Call Tracker (Equity & F&O)"],"not_rendered":{"images":4,"defined_names":1},"read":"whole","date_system":"1900"}

{"sheet":"Main","index":0,"n_rows":27,"n_cols":11,"rows_kept":27}
[null,"                                                                                                 "]
[]
[]
[]
[]
[{"$nulls":6}," "]
[]
[]
[]
[null,"2024-05-06"]
[]
[null,"Sheet No.","Template Name","Summary"]
[null,1,"Future Intra","For Intraday trading in F&O segment"]
[null,2,"Cash Intra","For Intraday trading in cash market segment"]
[null,3,"Mid-cap Intra","For Intraday trading in Mid-cap stocks"]
[null,4,"Bulk Deals","Reveals Bulk Deals carried on NSE & BSE"]
[null,5,"Call Tracker"]
{"$rows_empty":9}
[{"$nulls":10},"`"]

{"sheet":"Future Intra","index":1,"n_rows":236,"n_cols":16,"rows_kept":236,"merged":[[8,0,9,0],[8,1,9,1],[8,2,9,2],[8,3,9,3],[8,6,8,8],[8,9,8,11]]}
[]
[]
[]
[]
[{"$nulls":12},"Back to Main Page"]
["FOR INTRA DAY TRADING",{"$nulls":10},{"$f":"Main!B10","v":"2024-05-06"}]
[]
[]
["Sr.no","Sector","Scrip","Expiry Date","CLOSE RATE","Pivot Point","Supports",null,null,"Resistances"]
[{"$nulls":4},"Point","Point","S1","S2","S3","R1","R2","R3","HIGH","LOW","OI","% Change in OI"]
[1,"Index","NIFTY","2024-05-30",{"v":22575.2,"d":"22575.20"},{"v":22644.516666666666,"d":"22644.52"},{"v":22400.683333333334,"d":"22400.68"},{"v":22226.166666666668,"d":"22226.17"},{"v":21982.333333333336,"d":"21982.33"},{"v":22819.033333333333,"d":"22819.03"},{"v":23062.86666666667,"d":"23062.87"},{"v":23237.38333333333,"d":"23237.38"},22888.35,22470,11720500,{"v":-0.04171274275540802,"d":"-4.17%"}]
[2,"Index","BANKNIFTY","2024-05-29",49094.75,{"v":49204.916666666664,"d":"49204.92"},{"v":48759.83333333333,"d":"48759.83"},{"v":48424.916666666664,"d":"48424.92"},{"v":47979.83333333333,"d":"47979.83"},{"v":49539.83333333333,"d":"49539.83"},{"v":49984.91666666666,"d":"49984.92"},{"v":50319.83333333333,"d":"50319.83"},49650,48870,2322675,{"v":-0.08062390158172232,"d":"-8.06%"}]
[3,"Index","FINNIFTY","2024-05-28",21892.75,{"v":21949.333333333332,"d":"21949.33"},{"v":21731.966666666664,"d":"21731.97"},{"v":21571.18333333333,"d":"21571.18"},{"v":21353.816666666662,"d":"21353.82"},{"v":22110.116666666665,"d":"22110.12"},{"v":22327.483333333334,"d":"22327.48"},{"v":22488.266666666666,"d":"22488.27"},22166.7,21788.55,57280,{"v":0.014883061658398299,"d":"1.49%"}]
[4,"Index","MIDCPNIFTY","2024-05-27",{"v":11111.8,"d":"11111.80"},{"v":11129.050000000001,"d":"11129.05"},{"v":11038.750000000002,"d":"11038.75"},{"v":10965.7,"d":"10965.70"},{"v":10875.400000000001,"d":"10875.40"},{"v":11202.100000000002,"d":"11202.10"},{"v":11292.400000000001,"d":"11292.40"},{"v":11365.450000000003,"d":"11365.45"},11219.35,11056,1918500,{"v":-0.008898474731689678,"d":"-0.89%"}]
[5,"Chemicals","AARTIIND","2024-05-30",746.55,{"v":748.4666666666667,"d":"748.47"},{"v":735.9833333333333,"d":"735.98"},{"v":725.4166666666666,"d":"725.42"},{"v":712.9333333333333,"d":"712.93"},{"v":759.0333333333334,"d":"759.03"},{"v":771.5166666666668,"d":"771.52"},{"v":782.0833333333335,"d":"782.08"},760.95,737.9,13949000,{"v":0.008750361585189471,"d":"0.88%"}]
[6,"Capital_Goods","ABB","2024-05-30",{"v":6758.5,"d":"6758.50"},{"v":6765.150000000001,"d":"6765.15"},{"v":6683.350000000001,"d":"6683.35"},{"v":6608.200000000001,"d":"6608.20"},{"v":6526.4000000000015,"d":"6526.40"},{"v":6840.300000000001,"d":"6840.30"},{"v":6922.1,"d":"6922.10"},{"v":6997.250000000001,"d":"6997.25"},6846.95,6690,1121750,{"v":-0.008068973140267492,"d":"-0.81%"}]
[7,"Pharma","ABBOTINDIA","2024-05-30",26298.85,{"v":26524.86666666667,"d":"26524.87"},{"v":26007.083333333336,"d":"26007.08"},{"v":25715.316666666666,"d":"25715.32"},{"v":25197.533333333333,"d":"25197.53"},{"v":26816.63333333334,"d":"26816.63"},{"v":27334.41666666667,"d":"27334.42"},{"v":27626.18333333334,"d":"27626.18"},27042.65,26233.1,177860,{"v":-0.10298567682065765,"d":"-10.30%"}]
[8,"Finance","ABCAPITAL","2024-05-30",233.25,{"v":233.1,"d":"233.10"},{"v":229.89999999999998,"d":"229.90"},{"v":226.54999999999998,"d":"226.55"},{"v":223.34999999999997,"d":"223.35"},236.45,{"v":239.64999999999998,"d":"239.65"},{"v":243,"d":"243.00"},236.3,229.75,69535800,{"v":-3.7908092217236577E-3,"d":"-0.38%"}]
[9,"Textile","ABFRL","2024-05-30",{"v":256.2,"d":"256.20"},{"v":257.90000000000003,"d":"257.90"},{"v":249.80000000000007,"d":"249.80"},{"v":243.40000000000003,"d":"243.40"},{"v":235.30000000000007,"d":"235.30"},{"v":264.30000000000007,"d":"264.30"},{"v":272.4000000000001,"d":"272.40"},{"v":278.80000000000007,"d":"278.80"},266,251.5,43464200,{"v":-0.06110643077787138,"d":"-6.11%"}]
[10,"Cement","ACC","2024-05-30",{"v":2547.8,"d":"2547.80"},2552.25,2518.25,{"v":2488.7,"d":"2488.70"},{"v":2454.7,"d":"2454.70"},{"v":2581.8,"d":"2581.80"},{"v":2615.8,"d":"2615.80"},{"v":2645.3500000000004,"d":"2645.35"},2586.25,2522.7,5499900,{"v":-0.015677852348993288,"d":"-1.57%"}]
{"$rows_left_out":194}
{"sheet":"Cash Intra","index":2,"n_rows":245,"n_cols":13,"rows_kept":245,"merged":[[7,0,8,0],[7,1,8,1],[7,2,8,2],[7,3,8,3],[7,4,7,6],[7,7,7,9]]}
[]
[]
[]
[]
[{"$nulls":12},"Back to Main Page"]
["FOR INTRA DAY TRADING",{"$nulls":9},{"$f":"Main!B10","v":"2024-05-06"}]
[]
["Sr.no",null,"CLOSE RATE","Pivot Point","Supports",null,null,"Resistances"]
[{"$nulls":4},"S1","S2","S3","R1","R2","R3","HIGH","LOW","Total Trade Quanity in Lakhs"]
[1,"Nifty 50",22475.85,{"v":22539.533333333336,"d":"22539.53"},{"v":22284.366666666672,"d":"22284.37"},{"v":22092.883333333335,"d":"22092.88"},{"v":21837.71666666667,"d":"21837.72"},{"v":22731.016666666674,"d":"22731.02"},{"v":22986.183333333338,"d":"22986.18"},{"v":23177.666666666675,"d":"23177.67"},{"v":22794.7,"d":"22794.70"},22348.05]
[2,"Nifty Bank",48923.55,{"v":49063.666666666664,"d":"49063.67"},{"v":48519.58333333333,"d":"48519.58"},{"v":48115.61666666666,"d":"48115.62"},{"v":47571.533333333326,"d":"47571.53"},{"v":49467.63333333333,"d":"49467.63"},{"v":50011.71666666666,"d":"50011.72"},{"v":50415.683333333334,"d":"50415.68"},49607.75,{"v":48659.7,"d":"48659.70"}]
[3,"Nifty CPSE",{"v":6368.3,"d":"6368.30"},{"v":6368.483333333334,"d":"6368.48"},{"v":6292.5666666666675,"d":"6292.57"},{"v":6216.833333333334,"d":"6216.83"},{"v":6140.916666666668,"d":"6140.92"},{"v":6444.216666666667,"d":"6444.22"},{"v":6520.133333333333,"d":"6520.13"},{"v":6595.866666666667,"d":"6595.87"},{"v":6444.4,"d":"6444.40"},6292.75]
[4,"Nifty Infra",{"v":8519.5,"d":"8519.50"},{"v":8548.816666666668,"d":"8548.82"},{"v":8423.483333333335,"d":"8423.48"},{"v":8327.466666666667,"d":"8327.47"},{"v":8202.133333333335,"d":"8202.13"},{"v":8644.833333333336,"d":"8644.83"},{"v":8770.166666666668,"d":"8770.17"},{"v":8866.183333333336,"d":"8866.18"},8674.15,{"v":8452.8,"d":"8452.80"}]
[5,"Nifty IT",{"v":32908.4,"d":"32908.40"},{"v":32967.96666666667,"d":"32967.97"},{"v":32630.933333333334,"d":"32630.93"},{"v":32353.466666666667,"d":"32353.47"},{"v":32016.433333333334,"d":"32016.43"},{"v":33245.433333333334,"d":"33245.43"},{"v":33582.466666666674,"d":"33582.47"},{"v":33859.933333333334,"d":"33859.93"},{"v":33305,"d":"33305.00"},{"v":32690.5,"d":"32690.50"}]
[6,"Nifty PSE",10268.75,{"v":10275.266666666668,"d":"10275.27"},{"v":10162.133333333337,"d":"10162.13"},{"v":10055.516666666668,"d":"10055.52"},{"v":9942.383333333337,"d":"9942.38"},{"v":10381.883333333337,"d":"10381.88"},{"v":10495.016666666668,"d":"10495.02"},{"v":10601.633333333337,"d":"10601.63"},{"v":10388.4,"d":"10388.40"},10168.65]
[7,"Nifty Midcap 50",{"v":14189.3,"d":"14189.30"},14200.65,14102.55,{"v":14015.8,"d":"14015.80"},{"v":13917.699999999999,"d":"13917.70"},{"v":14287.4,"d":"14287.40"},{"v":14385.500000000002,"d":"14385.50"},14472.25,14298.75,{"v":14113.9,"d":"14113.90"}]
[8,"ABB",6698.55,{"v":6708.883333333334,"d":"6708.88"},{"v":6627.766666666668,"d":"6627.77"},{"v":6556.9833333333345,"d":"6556.98"},{"v":6475.866666666669,"d":"6475.87"},{"v":6779.666666666668,"d":"6779.67"},{"v":6860.783333333335,"d":"6860.78"},{"v":6931.5666666666675,"d":"6931.57"},6790,6638.1,3.37954]
[9,"ACC",2531.4,{"v":2532.8166666666666,"d":"2532.82"},{"v":2501.633333333333,"d":"2501.63"},{"v":2471.866666666667,"d":"2471.87"},{"v":2440.6833333333334,"d":"2440.68"},{"v":2562.583333333333,"d":"2562.58"},{"v":2593.7666666666664,"d":"2593.77"},{"v":2623.533333333333,"d":"2623.53"},2564,2503.05,5.21596]
[10,"APLAPOLLO",1587.3,{"v":1590.1666666666667,"d":"1590.17"},{"v":1567.3333333333335,"d":"1567.33"},{"v":1547.3666666666668,"d":"1547.37"},{"v":1524.5333333333335,"d":"1524.53"},{"v":1610.1333333333334,"d":"1610.13"},{"v":1632.966666666667,"d":"1632.97"},{"v":1652.9333333333334,"d":"1652.93"},1613,1570.2,3.61205]
[11,"AUBANK",645,{"v":646.6833333333333,"d":"646.68"},{"v":637.8166666666666,"d":"637.82"},{"v":630.6333333333333,"d":"630.63"},{"v":621.7666666666667,"d":"621.77"},{"v":653.8666666666666,"d":"653.87"},{"v":662.7333333333331,"d":"662.73"},{"v":669.9166666666665,"d":"669.92"},655.55,639.5,36.62846]
{"$rows_left_out":226}
{"sheet":"MidCap Intra","index":3,"n_rows":530,"n_cols":13,"rows_kept":530,"merged":[[0,0,0,1],[8,0,9,0],[8,1,9,1],[8,2,9,2],[8,3,9,3],[8,4,8,6],[8,7,8,9]]}
[]
[]
[]
[]
[{"$nulls":11},"Back To Main Page"]
["FOR INTRA DAY TRADING",{"$nulls":9},{"$f":"Main!B10","v":"2024-05-06"}]
[null,null," "]
[]
["Sr.no","Scrip","CLOSE RATE","Pivot Point","Supports",null,null,"Resistances"]
[{"$nulls":4},"S1","S2","S3","R1","R2","R3","HIGH","LOW","Total Trade Quanity in Lakhs"]
[1,"360ONE",791.95,{"v":785.4500000000002,"d":"785.45"},{"v":774.5500000000003,"d":"774.55"},{"v":757.1500000000001,"d":"757.15"},{"v":746.2500000000002,"d":"746.25"},{"v":802.8500000000004,"d":"802.85"},{"v":813.7500000000002,"d":"813.75"},{"v":831.1500000000004,"d":"831.15"},796.35,768.05,7.31424]
[2,"3MINDIA",29696.8,{"v":29748.650000000005,"d":"29748.65"},{"v":29299.30000000001,"d":"29299.30"},{"v":28901.800000000007,"d":"28901.80"},{"v":28452.45000000001,"d":"28452.45"},{"v":30146.15000000001,"d":"30146.15"},{"v":30595.500000000007,"d":"30595.50"},{"v":30993.000000000007,"d":"30993.00"},30198,29351.15,0.1355]
[3,"ABB",6698.55,{"v":6708.883333333334,"d":"6708.88"},{"v":6627.766666666668,"d":"6627.77"},{"v":6556.9833333333345,"d":"6556.98"},{"v":6475.866666666669,"d":"6475.87"},{"v":6779.666666666668,"d":"6779.67"},{"v":6860.783333333335,"d":"6860.78"},{"v":6931.5666666666675,"d":"6931.57"},6790,6638.1,3.37954]
[4,"ACC",2531.4,{"v":2532.8166666666666,"d":"2532.82"},{"v":2501.633333333333,"d":"2501.63"},{"v":2471.866666666667,"d":"2471.87"},{"v":2440.6833333333334,"d":"2440.68"},{"v":2562.583333333333,"d":"2562.58"},{"v":2593.7666666666664,"d":"2593.77"},{"v":2623.533333333333,"d":"2623.53"},2564,2503.05,5.21596]
[5,"AIAENG",3708.5,{"v":3729.5,"d":"3729.50"},{"v":3679,"d":"3679.00"},{"v":3649.5,"d":"3649.50"},{"v":3599,"d":"3599.00"},{"v":3759,"d":"3759.00"},{"v":3809.5,"d":"3809.50"},{"v":3839,"d":"3839.00"},3780,3700,6.22763]
[6,"APLAPOLLO",1587.3,{"v":1590.1666666666667,"d":"1590.17"},{"v":1567.3333333333335,"d":"1567.33"},{"v":1547.3666666666668,"d":"1547.37"},{"v":1524.5333333333335,"d":"1524.53"},{"v":1610.1333333333334,"d":"1610.13"},{"v":1632.966666666667,"d":"1632.97"},{"v":1652.9333333333334,"d":"1652.93"},1613,1570.2,3.61205]
[7,"AUBANK",645,{"v":646.6833333333333,"d":"646.68"},{"v":637.8166666666666,"d":"637.82"},{"v":630.6333333333333,"d":"630.63"},{"v":621.7666666666667,"d":"621.77"},{"v":653.8666666666666,"d":"653.87"},{"v":662.7333333333331,"d":"662.73"},{"v":669.9166666666665,"d":"669.92"},655.55,639.5,36.62846]
[8,"AARTIDRUGS",502.6,{"v":500.7833333333333,"d":"500.78"},{"v":495.1166666666666,"d":"495.12"},{"v":487.6333333333333,"d":"487.63"},{"v":481.96666666666664,"d":"481.97"},{"v":508.2666666666666,"d":"508.27"},{"v":513.9333333333334,"d":"513.93"},{"v":521.4166666666665,"d":"521.42"},506.45,493.3,0.9778]
[9,"AARTIIND",739.5,{"v":742.6333333333333,"d":"742.63"},{"v":730.2666666666667,"d":"730.27"},{"v":721.0333333333333,"d":"721.03"},{"v":708.6666666666666,"d":"708.67"},{"v":751.8666666666667,"d":"751.87"},{"v":764.2333333333332,"d":"764.23"},{"v":773.4666666666667,"d":"773.47"},755,733.4,8.63447]
[10,"AAVAS",1586.05,{"v":1585.6666666666667,"d":"1585.67"},{"v":1566.3833333333334,"d":"1566.38"},{"v":1546.7166666666667,"d":"1546.72"},{"v":1527.4333333333334,"d":"1527.43"},{"v":1605.3333333333335,"d":"1605.33"},{"v":1624.6166666666668,"d":"1624.62"},{"v":1644.2833333333335,"d":"1644.28"},1604.95,1566,1.37496]
{"$rows_left_out":511}
{"sheet":"Bulk Deals","index":4,"n_rows":171,"n_cols":8,"rows_kept":171,"merged":[[4,0,4,1],[4,2,4,3],[6,1,6,2]]}
[" "]
[]
[]
[]
[]
[{"$nulls":4},"Back To Main Page"]
["Subject :","BULK DEAL",null,{"$f":"Main!B10","v":"2024-05-06"}]
[]
["Date","Scrip code","Scrip Name","Client Name","Buy / Sell","Quantity Traded","Trade Price / Wt.Avg.trade price","Exchange  "]
["2024-05-03",543319,"AAPLUSTRAD","JAINISH ANILKUMAR LALCHETA","SELL",{"v":128000,"d":"128,000"},18.4,"BSE"]
["2024-05-03",543319,"AAPLUSTRAD","KETAN KIRTIKUMAR VAKHARIA","SELL",{"v":80000,"d":"80,000"},17.54,"BSE"]
["2024-05-03",543319,"AAPLUSTRAD","SHUBHAM ASHOKBHAI PATEL","SELL",{"v":8000,"d":"8,000"},18.4,"BSE"]
["2024-05-03",543319,"AAPLUSTRAD","MAHADEV MANUBHAI MAKVANA","SELL",{"v":8000,"d":"8,000"},18.4,"BSE"]
["2024-05-03",543319,"AAPLUSTRAD","SHUBHAM ASHOKBHAI PATEL","BUY",{"v":80000,"d":"80,000"},18.2,"BSE"]
["2024-05-03",543319,"AAPLUSTRAD","MAHADEV MANUBHAI MAKVANA","BUY",{"v":376000,"d":"376,000"},18.05,"BSE"]
["2024-05-03",543678,"AMBOAGRI","PRADEEP SUTODIYA","BUY",{"v":96000,"d":"96,000"},34.09,"BSE"]
["2024-05-03",531300,"AMITINT","KAVITA MAYANK VARIA","SELL",{"v":100000,"d":"100,000"},4.06,"BSE"]
["2024-05-03",531300,"AMITINT","MAITREEVARIA","SELL",{"v":100000,"d":"100,000"},4.06,"BSE"]
["2024-05-03",531300,"AMITINT","PRAVEENSINGH","BUY",{"v":300000,"d":"300,000"},4.06,"BSE"]
["2024-05-03",539662,"BFLAFL","SUMIT KUMAR GOEL","BUY",{"v":92954,"d":"92,954"},19.89,"BSE"]
{"$rows_left_out":152}
{"sheet":"Call Tracker (Equity & F&O)","index":5,"n_rows":291,"n_cols":19,"rows_kept":291,"merged":[[40,0,41,0],[40,1,41,1],[40,9,41,9],[40,15,41,15],[42,0,43,0],[42,1,43,1],[42,9,43,9],[42,12,43,12],[42,14,43,14],[42,15,43,15],[46,0,47,0],[46,1,47,1],[46,9,47,9],[46,12,47,12],[46,14,47,14],[46,15,47,15],[48,0,49,0],[48,1,49,1],[48,9,49,9],[48,12,49,12],[48,14,49,14],[48,15,49,15],[50,0,51,0],[50,1,51,1],[50,9,51,9],[50,12,51,12],[50,14,51,14],[50,15,51,15]]}
[]
[]
[]
[]
[{"$nulls":12},"Back To Main Page"]
["Retail Research Technical Calls & Fundamental Performance Report for the month of May-2024"]
[{"$nulls":12},{"$f":"Main!B10","v":"2024-05-06"}]
[null,"Positional  Call"]
["Sr.no","Date",null,"Company","Rec","Rec Price","Stop Loss***","Call Closed At","Target","Remark","Profit / Loss per Share","All charges","Net Gain / Loss  %","Status","Closed Date","Market Closing Price","Second Buying Date"]
[1,"2024-03-11",null,"NESTLEIND","Accu","2485-2585",2390,null,"2800-3000","Open",{"$nulls":5},{"$f":"VLOOKUP(D10,'MidCap Intra'!$B$11:$C$568,2,0)","v":{"v":2456.1,"d":"2456.10"}},null,null,"H"]
[2,"2024-03-22",null,"TCS","Accu","3780-3880",3640,null,"4100-4200","Open",{"$nulls":5},{"$f":"VLOOKUP(D11,'MidCap Intra'!$B$11:$C$568,2,0)","v":{"v":3843.4,"d":"3843.40"}},null,null,"H"]
[3,"2024-04-03",null,"BRITANNIA","Accu","4710-4810",4580,null,"5050-5300","Open",{"$nulls":5},{"$f":"VLOOKUP(D12,'MidCap Intra'!$B$11:$C$568,2,0)","v":{"v":4744.6,"d":"4744.60"}},null,null,"H"]
[4,"2024-04-12",null,"GLAND","Accu","1705-1750",1625,null,"1875-2000","Open",{"$nulls":5},{"$f":"VLOOKUP(D13,'MidCap Intra'!$B$11:$C$568,2,0)","v":1686.45},null,null,"K"]
[5,"2024-04-15",null,"HDFCBANK","Accu","1445-1497",1377,null,"1630-1750","Open",{"$nulls":5},{"$f":"VLOOKUP(D14,'MidCap Intra'!$B$11:$C$568,2,0)","v":{"v":1519.6,"d":"1519.60"}},null,null,"H"]
[6,"2024-04-23",null,"PRSMJOHNSN","Accu","158-164",149.5,null,"180-195","Open",{"$nulls":5},{"$f":"VLOOKUP(D15,'MidCap Intra'!$B$11:$C$568,2,0)","v":160.65},null,null,"H"]
[7,"2024-04-29",null,"SUNTV","Accu","632.5-652.5",618,null,"695-730","Open",{"$nulls":5},{"$f":"VLOOKUP(D16,'MidCap Intra'!$B$11:$C$568,2,0)","v":655.95},null,null,"H"]
[8,"2024-04-30",null,"LTF","Accu","162-169",159,null,"180-190","Open",{"$nulls":5},{"$f":"VLOOKUP(D17,'MidCap Intra'!$B$11:$C$568,2,0)","v":167.75},null,null,"H"]
[9,"2024-04-30",null,"KPITTECH","Accu","1410-1480",1360,null,"1600-1700","Open",{"$nulls":5},{"$f":"VLOOKUP(D18,'MidCap Intra'!$B$11:$C$568,2,0)","v":1537.25},null,null,"H"]
[10,"2024-05-02",null,"HCLTECH","Accu","1310-1360",1285,null,"1435-1510","Open",{"$nulls":5},{"$f":"VLOOKUP(D19,'MidCap Intra'!$B$11:$C$568,2,0)","v":1348.05},null,null,"H"]
[]
{"$rows_left_out":264}