{"text_format":"3","workbook":"xlsx","n_sheets":11,"sheets":["Main","Future Intra","Cash Intra","MidCap Intra","Bulk Deals","Call Tracker (Equity & F&O)","Sheet2","Sheet1","Sheet3","Sheet4","Sheet5"],"not_rendered":{"images":4,"defined_names":5},"read":"whole","date_system":"1900"}

{"sheet":"Main","index":0,"n_rows":27,"n_cols":11,"rows_kept":27}
[null,"                                                                                                 "]
{"$rows_empty":8}
[null,"2020-04-03"]
[]
[null,"Sheet No.","Template Name","Summary"]
[null,1,"Future Intra","For Intraday trading in F&O segment"]
[null,2,"Cash Intra","For Intraday trading in cash market segment"]
[null,3,"Mid-cap Intra","For Intraday trading in Mid-cap stocks"]
[null,4,"Bulk Deals","Reveals Bulk Deals carried on NSE & BSE"]
[null,5,"Call Tracker"]
{"$rows_empty":9}
[{"$nulls":10},"`"]

{"sheet":"Future Intra","index":1,"n_rows":190,"n_cols":15,"rows_kept":190,"merged":[[8,0,9,0],[8,1,9,1],[8,2,9,2],[8,5,8,7],[8,8,8,10]]}
[]
[]
[]
[]
[{"$nulls":12},"Back to Main Page"]
["FOR INTRA DAY TRADING",{"$nulls":10},{"$f":"Main!B10","v":"2020-04-03"}]
[]
[]
["Sr.no","Sector","Scrip","CLOSE RATE","Pivot Point","Supports",null,null,"Resistances"]
[null,"Sector",null,"Point","Point","S1","S2","S3","R1","R2","R3","HIGH","LOW","OI","% Change in OI"]
[1,"Index","BANKNIFTY",{"v":18171.2,"d":"18171.20"},{"v":18376.633333333335,"d":"18376.63"},{"v":17757.21666666667,"d":"17757.22"},{"v":17343.233333333337,"d":"17343.23"},{"v":16723.816666666673,"d":"16723.82"},{"v":18790.61666666667,"d":"18790.62"},{"v":19410.033333333333,"d":"19410.03"},{"v":19824.016666666666,"d":"19824.02"},18996.05,17962.65,941180,{"v":-0.08545164800995025,"d":"-8.55%"}]
[2,"Index","NIFTY",{"v":8257.3,"d":"8257.30"},{"v":8335.766666666666,"d":"8335.77"},{"v":8102.533333333333,"d":"8102.53"},{"v":7947.766666666666,"d":"7947.77"},{"v":7714.533333333333,"d":"7714.53"},{"v":8490.533333333333,"d":"8490.53"},{"v":8723.766666666666,"d":"8723.77"},{"v":8878.533333333333,"d":"8878.53"},8569,8181,11009925,{"v":-0.06064270905321355,"d":"-6.06%"}]
[3,"Index","NIFTYIT",{"v":12072,"d":"12072.00"},{"v":12207.333333333334,"d":"12207.33"},{"v":11864.666666666668,"d":"11864.67"},{"v":11657.333333333334,"d":"11657.33"},{"v":11314.666666666668,"d":"11314.67"},{"v":12414.666666666668,"d":"12414.67"},{"v":12757.333333333336,"d":"12757.33"},{"v":12964.666666666668,"d":"12964.67"},12550,12000,1900,{"v":0.1875,"d":"18.75%"}]
[4,"Cement","ACC",{"v":962.1,"d":"962.10"},{"v":960.9666666666666,"d":"960.97"},{"v":951.9333333333332,"d":"951.93"},{"v":941.7666666666665,"d":"941.77"},{"v":932.7333333333331,"d":"932.73"},{"v":971.1333333333332,"d":"971.13"},{"v":980.1666666666667,"d":"980.17"},{"v":990.3333333333333,"d":"990.33"},970,950.8,2010400,{"v":-0.006326611308817715,"d":"-0.63%"}]
[5,"Others","ADANIENT",{"v":134.7,"d":"134.70"},{"v":135.45000000000002,"d":"135.45"},{"v":131.90000000000003,"d":"131.90"},{"v":129.10000000000002,"d":"129.10"},{"v":125.55000000000004,"d":"125.55"},{"v":138.25000000000003,"d":"138.25"},{"v":141.80000000000004,"d":"141.80"},{"v":144.60000000000002,"d":"144.60"},139,132.65,16288000,{"v":4.440059200789344E-3,"d":"0.44%"}]
[6,"Others","ADANIPORTS",245.95,{"v":243.29999999999998,"d":"243.30"},{"v":238.04999999999995,"d":"238.05"},{"v":230.14999999999998,"d":"230.15"},{"v":224.89999999999995,"d":"224.90"},{"v":251.19999999999996,"d":"251.20"},{"v":256.45000000000005,"d":"256.45"},{"v":264.34999999999997,"d":"264.35"},248.55,235.4,25402500,{"v":0.0416196822142491,"d":"4.16%"}]
[7,"Power","ADANIPOWER",{"v":26.9,"d":"26.90"},{"v":27.083333333333332,"d":"27.08"},{"v":26.466666666666665,"d":"26.47"},{"v":26.03333333333333,"d":"26.03"},{"v":25.416666666666664,"d":"25.42"},{"v":27.516666666666666,"d":"27.52"},{"v":28.133333333333333,"d":"28.13"},{"v":28.566666666666666,"d":"28.57"},27.7,26.65,51130000,{"v":0.009676145339652449,"d":"0.97%"}]
[8,"Automobile","AMARAJABAT",{"v":479.5,"d":"479.50"},{"v":479.68333333333334,"d":"479.68"},{"v":464.81666666666666,"d":"464.82"},{"v":450.1333333333333,"d":"450.13"},{"v":435.26666666666665,"d":"435.27"},{"v":494.3666666666667,"d":"494.37"},{"v":509.23333333333335,"d":"509.23"},{"v":523.9166666666667,"d":"523.92"},494.55,465,954400,{"v":0.048330404217926184,"d":"4.83%"}]
[9,"Cement","AMBUJACEM",{"v":155.5,"d":"155.50"},{"v":153.76666666666665,"d":"153.77"},{"v":151.33333333333331,"d":"151.33"},{"v":147.16666666666666,"d":"147.17"},{"v":144.73333333333332,"d":"144.73"},{"v":157.9333333333333,"d":"157.93"},{"v":160.36666666666665,"d":"160.37"},{"v":164.5333333333333,"d":"164.53"},156.2,149.6,18157500,{"v":0.06855965867294395,"d":"6.86%"}]
[10,"Others","APOLLOHOSP",1091.45,{"v":1102.7,"d":"1102.70"},{"v":1068.5500000000002,"d":"1068.55"},1045.65,{"v":1011.5000000000002,"d":"1011.50"},{"v":1125.6000000000001,"d":"1125.60"},{"v":1159.7500000000002,"d":"1159.75"},1182.65,1136.85,1079.8,767500,{"v":0.02813127930341594,"d":"2.81%"}]
{"$rows_left_out":155}
{"sheet":"Cash Intra","index":2,"n_rows":247,"n_cols":13,"rows_kept":247,"merged":[[7,0,8,0],[7,1,8,1],[7,2,8,2],[7,3,8,3],[7,4,7,6],[7,7,7,9]]}
[]
[]
[]
[]
[{"$nulls":12},"Back to Main Page"]
["FOR INTRA DAY TRADING",{"$nulls":9},{"$f":"Main!B10","v":"2020-04-03"}]
[]
["Sr.no","Scrip","CLOSE RATE","Pivot Point","Supports",null,null,"Resistances"]
[null,null,"Point",null,"S1","S2","S3","R1","R2","R3","HIGH","LOW","Total Trade Quanity in Lakhs"]
[1,"Nifty 50",8253.8,8346.75,{"v":8105.4,"d":"8105.40"},{"v":7957,"d":"7957.00"},7715.65,8495.15,{"v":8736.499999999998,"d":"8736.50"},{"v":8884.9,"d":"8884.90"},8588.1,8198.35]
[2,"Nifty Bank",18208.35,18468.45,17782.15,17355.95,16669.65,18894.65,{"v":19580.949999999997,"d":"19580.95"},20007.15,19154.75,18042.25]
[3,"Nifty CPSE",1276.75,{"v":1285.9166666666667,"d":"1285.92"},{"v":1262.1333333333334,"d":"1262.13"},{"v":1247.5166666666667,"d":"1247.52"},{"v":1223.7333333333333,"d":"1223.73"},{"v":1300.5333333333335,"d":"1300.53"},{"v":1324.3166666666668,"d":"1324.32"},{"v":1338.9333333333336,"d":"1338.93"},1309.7,1271.3]
[4,"Nifty Infra",2283.6,{"v":2301.3333333333335,"d":"2301.33"},{"v":2242.166666666667,"d":"2242.17"},{"v":2200.7333333333336,"d":"2200.73"},{"v":2141.566666666667,"d":"2141.57"},{"v":2342.766666666667,"d":"2342.77"},{"v":2401.933333333334,"d":"2401.93"},{"v":2443.366666666667,"d":"2443.37"},2360.5,2259.9]
[5,"Nifty IT",12045.85,{"v":12242.016666666668,"d":"12242.02"},{"v":11793.433333333336,"d":"11793.43"},{"v":11541.016666666668,"d":"11541.02"},{"v":11092.433333333336,"d":"11092.43"},{"v":12494.433333333336,"d":"12494.43"},{"v":12943.016666666668,"d":"12943.02"},{"v":13195.433333333336,"d":"13195.43"},12690.6,11989.6]
[6,"Nifty PSE",2146.65,{"v":2163.5833333333335,"d":"2163.58"},{"v":2117.816666666667,"d":"2117.82"},{"v":2088.9833333333336,"d":"2088.98"},{"v":2043.2166666666672,"d":"2043.22"},{"v":2192.416666666667,"d":"2192.42"},{"v":2238.1833333333334,"d":"2238.18"},{"v":2267.016666666667,"d":"2267.02"},2209.35,2134.75]
[7,"Nifty Midcap 50",3095.45,{"v":3115.4500000000003,"d":"3115.45"},{"v":3047.8500000000004,"d":"3047.85"},3000.25,2932.65,{"v":3163.0500000000006,"d":"3163.05"},3230.65,{"v":3278.250000000001,"d":"3278.25"},3183.05,3067.85]
[8,"ACC",963.45,960.15,{"v":951.3,"d":"951.30"},939.15,{"v":930.3,"d":"930.30"},{"v":972.3,"d":"972.30"},{"v":981.1500000000001,"d":"981.15"},{"v":993.3,"d":"993.30"},969,948,5.14199]
[9,"AUBANK",481.35,{"v":497.15000000000003,"d":"497.15"},{"v":464.30000000000007,"d":"464.30"},{"v":447.25000000000006,"d":"447.25"},{"v":414.4000000000001,"d":"414.40"},{"v":514.2,"d":"514.20"},{"v":547.0500000000001,"d":"547.05"},{"v":564.1,"d":"564.10"},530,480.1,4.21839]
[10,"ADANIPORTS",244.8,{"v":242.55000000000004,"d":"242.55"},{"v":237.30000000000007,"d":"237.30"},{"v":229.80000000000004,"d":"229.80"},{"v":224.55000000000007,"d":"224.55"},{"v":250.05000000000007,"d":"250.05"},{"v":255.3,"d":"255.30"},{"v":262.80000000000007,"d":"262.80"},247.8,235.05,29.12256]
[11,"ADANIPOWER",26.8,{"v":27.083333333333332,"d":"27.08"},{"v":26.266666666666666,"d":"26.27"},{"v":25.733333333333334,"d":"25.73"},{"v":24.916666666666668,"d":"24.92"},{"v":27.616666666666664,"d":"27.62"},{"v":28.433333333333334,"d":"28.43"},{"v":28.96666666666666,"d":"28.97"},27.9,26.55,57.54033]
{"$rows_left_out":228}
{"sheet":"MidCap Intra","index":3,"n_rows":545,"n_cols":13,"rows_kept":545,"merged":[[0,0,0,1],[8,0,9,0],[8,1,9,1],[8,2,9,2],[8,3,9,3],[8,4,8,6],[8,7,8,9]]}
[]
[]
[]
[]
[{"$nulls":11},"Back To Main Page"]
["FOR INTRA DAY TRADING",{"$nulls":9},{"$f":"Main!B10","v":"2020-04-03"}]
[null,null," "]
[]
["Sr.no","Scrip","CLOSE RATE","Pivot Point","Supports",null,null,"Resistances"]
[null,null,"Point",null,"S1","S2","S3","R1","R2","R3","HIGH","LOW","Total Trade Quanity in Lakhs"]
[1,"3MINDIA",18469.55,{"v":18549.866666666665,"d":"18549.87"},{"v":18019.68333333333,"d":"18019.68"},{"v":17569.816666666666,"d":"17569.82"},{"v":17039.63333333333,"d":"17039.63"},{"v":18999.73333333333,"d":"18999.73"},{"v":19529.916666666664,"d":"19529.92"},{"v":19979.78333333333,"d":"19979.78"},19080.05,18100,0.02822]
[2,"AARTIIND",795.8,{"v":794.2833333333333,"d":"794.28"},{"v":769.5666666666666,"d":"769.57"},{"v":743.3333333333333,"d":"743.33"},{"v":718.6166666666666,"d":"718.62"},{"v":820.5166666666667,"d":"820.52"},{"v":845.2333333333333,"d":"845.23"},{"v":871.4666666666667,"d":"871.47"},819,768.05,4.53572]
[3,"AAVAS",1192,{"v":1193.8666666666666,"d":"1193.87"},{"v":1107.7333333333331,"d":"1107.73"},{"v":1023.4666666666665,"d":"1023.47"},{"v":937.333333333333,"d":"937.33"},{"v":1278.1333333333332,"d":"1278.13"},{"v":1364.2666666666669,"d":"1364.27"},{"v":1448.5333333333333,"d":"1448.53"},1280,1109.6,1.58743]
[4,"ABBOTINDIA",15613.6,{"v":15604.533333333333,"d":"15604.53"},{"v":15211.066666666666,"d":"15211.07"},{"v":14808.533333333333,"d":"14808.53"},{"v":14415.066666666666,"d":"14415.07"},{"v":16007.066666666666,"d":"16007.07"},{"v":16400.533333333333,"d":"16400.53"},{"v":16803.066666666666,"d":"16803.07"},15998,15202,0.1759]
[5,"ABCAPITAL",42.9,42.75,41.75,{"v":40.6,"d":"40.60"},{"v":39.6,"d":"39.60"},{"v":43.9,"d":"43.90"},{"v":44.9,"d":"44.90"},46.05,43.75,41.6,8.53443]
[6,"ABFRL",149.55,{"v":150.31666666666666,"d":"150.32"},{"v":146.28333333333333,"d":"146.28"},{"v":143.01666666666668,"d":"143.02"},{"v":138.98333333333335,"d":"138.98"},{"v":153.58333333333331,"d":"153.58"},{"v":157.61666666666662,"d":"157.62"},{"v":160.8833333333333,"d":"160.88"},154.35,147.05,10.12321]
[7,"ACC",963.45,960.15,{"v":951.3,"d":"951.30"},939.15,{"v":930.3,"d":"930.30"},{"v":972.3,"d":"972.30"},{"v":981.1500000000001,"d":"981.15"},{"v":993.3,"d":"993.30"},969,948,10.20895]
[8,"ADANIGAS",89,{"v":88.39999999999999,"d":"88.40"},{"v":85.59999999999998,"d":"85.60"},{"v":82.19999999999999,"d":"82.20"},{"v":79.39999999999998,"d":"79.40"},{"v":91.79999999999998,"d":"91.80"},{"v":94.6,"d":"94.60"},{"v":97.99999999999999,"d":"98.00"},91.2,85,9.22474]
[9,"ADANIGREEN",152.9,{"v":154.29999999999998,"d":"154.30"},{"v":149.59999999999997,"d":"149.60"},{"v":146.29999999999998,"d":"146.30"},{"v":141.59999999999997,"d":"141.60"},{"v":157.59999999999997,"d":"157.60"},{"v":162.29999999999995,"d":"162.30"},{"v":165.59999999999997,"d":"165.60"},159,151,2.26224]
[10,"ADANIPORTS",244.8,{"v":242.55000000000004,"d":"242.55"},{"v":237.30000000000007,"d":"237.30"},{"v":229.80000000000004,"d":"229.80"},{"v":224.55000000000007,"d":"224.55"},{"v":250.05000000000007,"d":"250.05"},{"v":255.3,"d":"255.30"},{"v":262.80000000000007,"d":"262.80"},247.8,235.05,40.34211]
{"$rows_left_out":514}
{"sheet":"Bulk Deals","index":4,"n_rows":16,"n_cols":8,"rows_kept":16,"merged":[[4,0,4,1],[4,2,4,3],[6,1,6,2]]}
[" "]
[]
[]
[]
[]
[{"$nulls":4},"Back To Main Page"]
["Subject :","BULK DEAL",null,{"$f":"Main!B10","v":"2020-04-03"}]
[]
["Date","Scrip code","Scrip Name","Client Name","Buy / Sell","Quantity Traded","Trade Price / Wt.Avg.trade price","Exchange  "]
["2020-04-01",542771,"NOVATEOR","BEELINE BROKING LIMITED","SELL",{"v":48000,"d":"48,000"},8.23,"BSE"]
["2020-04-01",530589,"PRIMAPLA","ITHOUGHTWEALTH ANALYTICS LLP","SELL",{"v":64120,"d":"64,120"},25.02,"BSE"]
["2020-04-01",543171,"ROJL","VIVIDOFFSET PRINTERS PRIVATELIMITED","BUY",{"v":15000,"d":"15,000"},36,"BSE"]
["2020-04-01",539222,"VMV","DEVJEET CHAKRABORTY","BUY",{"v":40000,"d":"40,000"},25.9,"BSE"]
["2020-04-01",539222,"VMV","RAJESH RAMANLAL KAPADIA","SELL",{"v":40000,"d":"40,000"},25.9,"BSE"]
["2020-04-01","PAISALO","Paisalo Digital Limited","ANTARA INDIA EVERGREEN FUND LTD","BUY",{"v":264937,"d":"264,937"},159,"NSE"]
["2020-04-01","PAISALO","Paisalo Digital Limited","DAVOS INTERNATIONAL FUND","SELL",{"v":265000,"d":"265,000"},159,"NSE"]

{"sheet":"Call Tracker (Equity & F&O)","index":5,"n_rows":206,"n_cols":18,"rows_kept":206}
[]
[]
[]
[]
[{"$nulls":12},"Back To Main Page"]
["Retail Research Technical Calls & Fundamental Performance Report for the month of April-2020 "]
[{"$nulls":12},{"$f":"Main!B10","v":"2020-04-03"}]
[null,"Positional  Call"]
["Sr.no","Date",null,"Company","Rec","Rec Price","Stop Loss***","Call Closed At","Target","Remark","Profit / Loss per Share","Gain / Loss  %","Status","Closed Date","NSE Closed Price"]
[1,"2020-03-27",null,"ULTRACEMCO","Buy","3150-3200",2940,null,"3400-3500","Open",{"$nulls":4},{"$f":"VLOOKUP(D10,Sheet2!A2:F1647,6,0)","v":3140.65},null,null,"H"]
[2,"2020-03-31",null,"ZEEL","Buy","125-126",118,null,"135-140","Open",{"$nulls":4},{"$f":"VLOOKUP(D11,Sheet2!A3:F1648,6,0)","v":120.9},null,null,"N"]
[3,"2020-04-01",null,"HCLTECH","Buy","420-427",395,null,"460-480","Open",{"$nulls":4},{"$f":"VLOOKUP(D12,Sheet2!A4:F1649,6,0)","v":413.55},null,null,"H"]
[4,"2020-04-01",null,"ASIANPAINT","Buy","1630-1640",1540,null,"1820-1850","Open",{"$nulls":4},{"$f":"VLOOKUP(D13,Sheet2!A5:F1650,6,0)","v":1603.2},null,null,"N"]
[5,"2020-04-01",null,"APOLLOHOSP","Buy","1100-1110",1040,null,1250,"Open",{"$nulls":4},{"$f":"VLOOKUP(D14,Sheet2!A6:F1651,6,0)","v":1088.85},null,null,"H"]
[]
[]
["CLBS = Closing Basis ***"]
["Dividend adjusted <>",{"$nulls":4},"Reinitiated $"]
["Part book {}",{"$nulls":4},"Revised stoploss #"]
[]
{"$rows_left_out":187}
{"sheet":"Sheet2","index":6,"n_rows":1899,"n_cols":14,"rows_kept":1899,"hidden":true}
["SYMBOL","SERIES","OPEN","HIGH","LOW","CLOSE","LAST","PREVCLOSE","TOTTRDQTY","TOTTRDVAL","TIMESTAMP","TOTALTRADES","ISIN","ISIN"]
["20MICRONS","EQ",26.2,26.2,24.15,24.55,24.5,25.55,27658,699609.35,"2020-04-01",378,"INE144J01027"]
["21STCENMGM","EQ",10.6,10.65,10.6,10.65,10.65,10.8,110,1166.5,"2020-04-01",3,"INE253B01015"]
["3IINFOTECH","EQ",1.35,1.35,1.25,1.25,1.3,1.3,2388606,3080938,"2020-04-01",766,"INE748C01020"]
["3MINDIA","EQ",19080.05,19080.05,18100,18469.55,18350,18827.95,2822,52061227.2,"2020-04-01",1802,"INE470A01017"]
["3PLAND","EQ",3.55,3.6,3.4,3.4,3.4,3.55,1096,3763.75,"2020-04-01",7,"INE105C01023"]
["5PAISA","EQ",103.05,135,103,113.55,115,113.15,6871,791638.05,"2020-04-01",337,"INE618L01018"]
["63MOONS","EQ",46.05,48,45.85,46.35,47.05,46.05,36603,1710661.45,"2020-04-01",2279,"INE111B01023"]
["A2ZINFRA","EQ",3.2,3.25,3.05,3.1,3.1,3.15,106932,338243.9,"2020-04-01",210,"INE619I01012"]
["AARTIDRUGS","EQ",508,539.45,500,517.5,520,502.3,33444,17601352.8,"2020-04-01",2798,"INE767A01016"]
["AARTIIND","EQ",778,819,768.05,795.8,778.2,766.75,453572,362395276.25,"2020-04-01",25749,"INE769A01020"]
["AARVEEDEN","EQ",7.8,7.95,7.2,7.65,7.95,7.95,3380,26040.2,"2020-04-01",38,"INE273D01019"]
["AAVAS","EQ",1177.55,1280,1109.6,1192,1128,1188.85,158743,194788417.25,"2020-04-01",5660,"INE216P01012"]
["ABAN","EQ",13.4,14.35,13.35,14.05,14.05,14,67450,943285.35,"2020-04-01",596,"INE421A01028"]
["ABB","EQ",935.4,949,904.9,929.65,914.3,935.4,14021,12915379.3,"2020-04-01",1785,"INE117A01022"]
["ABBOTINDIA","EQ",15525.35,15998,15202,15613.6,15500,15451.1,17590,273596329.5,"2020-04-01",7346,"INE358A01014"]
["ABCAPITAL","EQ",42.35,43.75,41.6,42.9,43.05,42.15,853443,36552706.8,"2020-04-01",6571,"INE674K01013"]
["ABFRL","EQ",153,154.35,147.05,149.55,148.55,152.9,1012321,151752432.25,"2020-04-01",14675,"INE647O01011"]
["ABMINTLTD","BE",13.45,13.45,13.45,13.45,13.45,13.45,1,13.45,"2020-04-01",1,"INE251C01017"]
["ABSLBANETF","EQ",210,224,210,223.62,224,235,104,23243,"2020-04-01",6,"INF209KB1O58"]
{"$rows_left_out":1685}
{"sheet":"Sheet1","index":7,"n_rows":0,"n_cols":0,"rows_kept":0,"hidden":true}

{"sheet":"Sheet3","index":8,"n_rows":0,"n_cols":0,"rows_kept":0,"hidden":true}

{"sheet":"Sheet4","index":9,"n_rows":0,"n_cols":0,"rows_kept":0,"hidden":true}

{"sheet":"Sheet5","index":10,"n_rows":0,"n_cols":0,"rows_kept":0,"hidden":true}