{"text_format":"3","workbook":"xlsx","n_sheets":6,"sheets":["Main","Future Intra","Cash Intra","MidCap Intra","Bulk Deals","Call Tracker (Equity & F&O)"],"not_rendered":{"images":4,"defined_names":1},"read":"whole","date_system":"1900"}

{"sheet":"Main","index":0,"n_rows":27,"n_cols":11,"rows_kept":27}
[null,"                                                                                                 "]
[]
[]
[]
[]
[{"$nulls":6}," "]
[]
[]
[]
[null,"2023-12-04"]
[]
[null,"Sheet No.","Template Name","Summary"]
[null,1,"Future Intra","For Intraday trading in F&O segment"]
[null,2,"Cash Intra","For Intraday trading in cash market segment"]
[null,3,"Mid-cap Intra","For Intraday trading in Mid-cap stocks"]
[null,4,"Bulk Deals","Reveals Bulk Deals carried on NSE & BSE"]
[null,5,"Call Tracker"]
{"$rows_empty":9}
[{"$nulls":10},"`"]

{"sheet":"Future Intra","index":1,"n_rows":236,"n_cols":16,"rows_kept":236,"merged":[[8,0,9,0],[8,1,9,1],[8,2,9,2],[8,3,9,3],[8,6,8,8],[8,9,8,11]]}
[]
[]
[]
[]
[{"$nulls":12},"Back to Main Page"]
["FOR INTRA DAY TRADING",{"$nulls":10},{"$f":"Main!B10","v":"2023-12-04"}]
[]
[]
["Sr.no","Sector","Scrip","Expiry Date","CLOSE RATE","Pivot Point","Supports",null,null,"Resistances"]
[{"$nulls":4},"Point","Point","S1","S2","S3","R1","R2","R3","HIGH","LOW","OI","% Change in OI"]
[1,"Index","NIFTY","2023-12-28",20375.15,{"v":20359.350000000002,"d":"20359.35"},{"v":20308.700000000004,"d":"20308.70"},{"v":20242.250000000004,"d":"20242.25"},{"v":20191.600000000006,"d":"20191.60"},{"v":20425.800000000003,"d":"20425.80"},{"v":20476.450000000004,"d":"20476.45"},{"v":20542.9,"d":"20542.90"},20410,20292.9,10869750,{"v":0.014423435866806033,"d":"1.44%"}]
[2,"Index","BANKNIFTY","2023-12-28",{"v":45071.2,"d":"45071.20"},{"v":44941.38333333333,"d":"44941.38"},{"v":44652.166666666664,"d":"44652.17"},{"v":44233.13333333333,"d":"44233.13"},{"v":43943.916666666664,"d":"43943.92"},{"v":45360.416666666664,"d":"45360.42"},{"v":45649.63333333334,"d":"45649.63"},{"v":46068.666666666664,"d":"46068.67"},45230.6,44522.35,2389155,{"v":-0.08032311707508603,"d":"-8.03%"}]
[3,"Index","FINNIFTY","2023-12-26",{"v":20327.2,"d":"20327.20"},{"v":20309.016666666666,"d":"20309.02"},{"v":20248.083333333332,"d":"20248.08"},{"v":20168.966666666667,"d":"20168.97"},{"v":20108.033333333333,"d":"20108.03"},{"v":20388.13333333333,"d":"20388.13"},{"v":20449.066666666666,"d":"20449.07"},{"v":20528.18333333333,"d":"20528.18"},20369.95,20229.9,69000,{"v":0.016499705362404242,"d":"1.65%"}]
[4,"Index","MIDCPNIFTY","2023-12-22",{"v":9776.2,"d":"9776.20"},{"v":9763.866666666667,"d":"9763.87"},{"v":9727.333333333334,"d":"9727.33"},{"v":9678.466666666667,"d":"9678.47"},{"v":9641.933333333334,"d":"9641.93"},{"v":9812.733333333334,"d":"9812.73"},{"v":9849.266666666666,"d":"9849.27"},{"v":9898.133333333333,"d":"9898.13"},9800.4,9715,638925,{"v":0.03928266438941076,"d":"3.93%"}]
[5,"Chemical","AARTIIND","2023-12-28",{"v":556.2,"d":"556.20"},{"v":555.9,"d":"555.90"},{"v":548.3499999999999,"d":"548.35"},{"v":540.4999999999999,"d":"540.50"},{"v":532.9499999999998,"d":"532.95"},563.75,{"v":571.3,"d":"571.30"},{"v":579.1500000000001,"d":"579.15"},563.45,548.05,13238000,{"v":-0.033369843008397224,"d":"-3.34%"}]
[6,"Capital_Goods","ABB","2023-12-28",{"v":4420.2,"d":"4420.20"},{"v":4435.366666666667,"d":"4435.37"},{"v":4392.183333333333,"d":"4392.18"},{"v":4364.166666666667,"d":"4364.17"},{"v":4320.983333333334,"d":"4320.98"},{"v":4463.383333333333,"d":"4463.38"},{"v":4506.5666666666675,"d":"4506.57"},{"v":4534.583333333333,"d":"4534.58"},4478.55,4407.35,1113500,{"v":-0.019698470342247167,"d":"-1.97%"}]
[7,"Pharma","ABBOTINDIA","2023-12-28",23863.25,{"v":23915.11666666667,"d":"23915.12"},{"v":23749.283333333336,"d":"23749.28"},{"v":23635.31666666667,"d":"23635.32"},{"v":23469.483333333337,"d":"23469.48"},{"v":24029.083333333336,"d":"24029.08"},{"v":24194.916666666664,"d":"24194.92"},{"v":24308.883333333335,"d":"24308.88"},24080.95,23801.15,72080,{"v":0.01065619742007852,"d":"1.07%"}]
[8,"Others","ABCAPITAL","2023-12-28",{"v":170.9,"d":"170.90"},{"v":171.6,"d":"171.60"},{"v":169.7,"d":"169.70"},{"v":168.5,"d":"168.50"},{"v":166.6,"d":"166.60"},{"v":172.79999999999998,"d":"172.80"},{"v":174.70000000000002,"d":"174.70"},{"v":175.89999999999998,"d":"175.90"},173.5,170.4,64044000,{"v":0.04282071573023828,"d":"4.28%"}]
[9,"Textile","ABFRL","2023-12-28",{"v":232.8,"d":"232.80"},{"v":234.43333333333337,"d":"234.43"},{"v":230.46666666666673,"d":"230.47"},{"v":228.13333333333335,"d":"228.13"},{"v":224.1666666666667,"d":"224.17"},{"v":236.76666666666674,"d":"236.77"},{"v":240.73333333333338,"d":"240.73"},{"v":243.06666666666675,"d":"243.07"},238.4,232.1,27476800,{"v":-0.01150500420914788,"d":"-1.15%"}]
[10,"Cement","ACC","2023-12-28",1909.75,{"v":1910.3999999999999,"d":"1910.40"},{"v":1896.7999999999997,"d":"1896.80"},1883.85,{"v":1870.2499999999998,"d":"1870.25"},{"v":1923.3499999999997,"d":"1923.35"},{"v":1936.9499999999996,"d":"1936.95"},{"v":1949.8999999999996,"d":"1949.90"},1924,1897.45,5146800,{"v":-1.6294227188081937E-3,"d":"-0.16%"}]
{"$rows_left_out":196}
{"sheet":"Cash Intra","index":2,"n_rows":245,"n_cols":13,"rows_kept":245,"merged":[[7,0,8,0],[7,1,8,1],[7,2,8,2],[7,3,8,3],[7,4,7,6],[7,7,7,9]]}
[]
[]
[]
[]
[{"$nulls":12},"Back to Main Page"]
["FOR INTRA DAY TRADING",{"$nulls":9},{"$f":"Main!B10","v":"2023-12-04"}]
[]
["Sr.no",null,"CLOSE RATE","Pivot Point","Supports",null,null,"Resistances"]
[{"$nulls":4},"S1","S2","S3","R1","R2","R3","HIGH","LOW","Total Trade Quanity in Lakhs"]
[1,"Nifty 50",{"v":20267.9,"d":"20267.90"},{"v":20247.716666666664,"d":"20247.72"},{"v":20203.883333333328,"d":"20203.88"},{"v":20139.866666666665,"d":"20139.87"},{"v":20096.03333333333,"d":"20096.03"},{"v":20311.733333333326,"d":"20311.73"},{"v":20355.566666666662,"d":"20355.57"},{"v":20419.583333333325,"d":"20419.58"},20291.55,{"v":20183.7,"d":"20183.70"}]
[2,"Nifty Bank",{"v":44814.2,"d":"44814.20"},{"v":44765.68333333333,"d":"44765.68"},{"v":44580.266666666656,"d":"44580.27"},{"v":44346.33333333333,"d":"44346.33"},{"v":44160.91666666666,"d":"44160.92"},{"v":44999.616666666654,"d":"44999.62"},{"v":45185.033333333326,"d":"45185.03"},{"v":45418.96666666665,"d":"45418.97"},{"v":44951.1,"d":"44951.10"},44531.75]
[3,"Nifty CPSE",4291.65,{"v":4300.133333333333,"d":"4300.13"},{"v":4260.116666666667,"d":"4260.12"},{"v":4228.583333333334,"d":"4228.58"},{"v":4188.5666666666675,"d":"4188.57"},{"v":4331.666666666666,"d":"4331.67"},{"v":4371.6833333333325,"d":"4371.68"},{"v":4403.216666666665,"d":"4403.22"},4340.15,{"v":4268.6,"d":"4268.60"}]
[4,"Nifty Infra",6651.65,{"v":6641.883333333332,"d":"6641.88"},{"v":6622.316666666665,"d":"6622.32"},{"v":6592.983333333333,"d":"6592.98"},{"v":6573.416666666665,"d":"6573.42"},{"v":6671.216666666664,"d":"6671.22"},{"v":6690.783333333332,"d":"6690.78"},{"v":6720.116666666664,"d":"6720.12"},6661.45,6612.55]
[5,"Nifty IT",{"v":32598.7,"d":"32598.70"},{"v":32602.416666666668,"d":"32602.42"},{"v":32475.033333333336,"d":"32475.03"},{"v":32351.36666666667,"d":"32351.37"},{"v":32223.983333333337,"d":"32223.98"},{"v":32726.083333333336,"d":"32726.08"},{"v":32853.46666666667,"d":"32853.47"},{"v":32977.13333333333,"d":"32977.13"},{"v":32729.8,"d":"32729.80"},32478.75]
[6,"Nifty PSE",6911.85,{"v":6907.349999999999,"d":"6907.35"},{"v":6840.299999999999,"d":"6840.30"},6768.75,{"v":6701.7,"d":"6701.70"},{"v":6978.899999999999,"d":"6978.90"},7045.95,{"v":7117.499999999998,"d":"7117.50"},{"v":6974.4,"d":"6974.40"},{"v":6835.8,"d":"6835.80"}]
[7,"Nifty Midcap 50",{"v":12334.5,"d":"12334.50"},{"v":12319.716666666667,"d":"12319.72"},{"v":12280.233333333334,"d":"12280.23"},{"v":12225.966666666667,"d":"12225.97"},{"v":12186.483333333334,"d":"12186.48"},{"v":12373.983333333334,"d":"12373.98"},{"v":12413.466666666667,"d":"12413.47"},{"v":12467.733333333334,"d":"12467.73"},{"v":12359.2,"d":"12359.20"},12265.45]
[8,"ABB",4387.25,{"v":4404.016666666666,"d":"4404.02"},{"v":4359.033333333333,"d":"4359.03"},{"v":4330.816666666667,"d":"4330.82"},{"v":4285.833333333333,"d":"4285.83"},{"v":4432.233333333333,"d":"4432.23"},{"v":4477.216666666666,"d":"4477.22"},{"v":4505.4333333333325,"d":"4505.43"},4449,4375.8,1.50704]
[9,"ABBOTINDIA",23679.5,{"v":23739.86666666667,"d":"23739.87"},{"v":23553.833333333336,"d":"23553.83"},{"v":23428.166666666668,"d":"23428.17"},{"v":23242.133333333335,"d":"23242.13"},{"v":23865.533333333336,"d":"23865.53"},{"v":24051.56666666667,"d":"24051.57"},{"v":24177.233333333337,"d":"24177.23"},23925.9,23614.2,0.06396]
[10,"ABCAPITAL",169.9,{"v":170.38333333333333,"d":"170.38"},{"v":168.51666666666665,"d":"168.52"},{"v":167.13333333333333,"d":"167.13"},{"v":165.26666666666665,"d":"165.27"},{"v":171.76666666666665,"d":"171.77"},{"v":173.63333333333333,"d":"173.63"},{"v":175.01666666666665,"d":"175.02"},172.25,169,77.9361]
[11,"ABFRL",231.4,{"v":233.0666666666667,"d":"233.07"},{"v":229.33333333333337,"d":"229.33"},{"v":227.26666666666668,"d":"227.27"},{"v":223.53333333333336,"d":"223.53"},{"v":235.13333333333338,"d":"235.13"},{"v":238.86666666666667,"d":"238.87"},{"v":240.9333333333334,"d":"240.93"},236.8,231,30.27206]
{"$rows_left_out":226}
{"sheet":"MidCap Intra","index":3,"n_rows":530,"n_cols":13,"rows_kept":530,"merged":[[0,0,0,1],[8,0,9,0],[8,1,9,1],[8,2,9,2],[8,3,9,3],[8,4,8,6],[8,7,8,9]]}
[]
[]
[]
[]
[{"$nulls":11},"Back To Main Page"]
["FOR INTRA DAY TRADING",{"$nulls":9},{"$f":"Main!B10","v":"2023-12-04"}]
[null,null," "]
[]
["Sr.no","Scrip","CLOSE RATE","Pivot Point","Supports",null,null,"Resistances"]
[{"$nulls":4},"S1","S2","S3","R1","R2","R3","HIGH","LOW","Total Trade Quanity in Lakhs"]
[1,"360ONE",585.8,582.75,{"v":577.5,"d":"577.50"},{"v":569.2,"d":"569.20"},563.95,591.05,{"v":596.3,"d":"596.30"},{"v":604.5999999999999,"d":"604.60"},588,574.45,4.6802]
[2,"3MINDIA",31088.45,{"v":31058.466666666664,"d":"31058.47"},{"v":30629.983333333326,"d":"30629.98"},{"v":30171.516666666663,"d":"30171.52"},{"v":29743.033333333326,"d":"29743.03"},{"v":31516.933333333327,"d":"31516.93"},{"v":31945.416666666664,"d":"31945.42"},{"v":32403.883333333328,"d":"32403.88"},31486.95,30600,0.03005]
[3,"AARTIDRUGS",485.6,{"v":489.6666666666667,"d":"489.67"},{"v":480.9333333333334,"d":"480.93"},{"v":476.2666666666667,"d":"476.27"},{"v":467.5333333333334,"d":"467.53"},{"v":494.33333333333337,"d":"494.33"},{"v":503.0666666666666,"d":"503.07"},{"v":507.73333333333335,"d":"507.73"},498.4,485,1.51693]
[4,"AARTIIND",553.3,{"v":553.5,"d":"553.50"},{"v":546,"d":"546.00"},{"v":538.7,"d":"538.70"},{"v":531.2,"d":"531.20"},{"v":560.8,"d":"560.80"},{"v":568.3,"d":"568.30"},{"v":575.5999999999999,"d":"575.60"},561,546.2,28.7148]
[5,"AAVAS",1425.75,{"v":1432.7666666666664,"d":"1432.77"},{"v":1412.5833333333328,"d":"1412.58"},{"v":1399.4166666666663,"d":"1399.42"},{"v":1379.2333333333327,"d":"1379.23"},{"v":1445.933333333333,"d":"1445.93"},{"v":1466.1166666666663,"d":"1466.12"},{"v":1479.283333333333,"d":"1479.28"},1452.95,1419.6,2.40903]
[6,"ABB",4387.25,{"v":4404.016666666666,"d":"4404.02"},{"v":4359.033333333333,"d":"4359.03"},{"v":4330.816666666667,"d":"4330.82"},{"v":4285.833333333333,"d":"4285.83"},{"v":4432.233333333333,"d":"4432.23"},{"v":4477.216666666666,"d":"4477.22"},{"v":4505.4333333333325,"d":"4505.43"},4449,4375.8,1.50704]
[7,"ABBOTINDIA",23679.5,{"v":23739.86666666667,"d":"23739.87"},{"v":23553.833333333336,"d":"23553.83"},{"v":23428.166666666668,"d":"23428.17"},{"v":23242.133333333335,"d":"23242.13"},{"v":23865.533333333336,"d":"23865.53"},{"v":24051.56666666667,"d":"24051.57"},{"v":24177.233333333337,"d":"24177.23"},23925.9,23614.2,0.06396]
[8,"ACC",1900.25,{"v":1899.1166666666668,"d":"1899.12"},{"v":1887.0333333333335,"d":"1887.03"},{"v":1873.8166666666668,"d":"1873.82"},{"v":1861.7333333333336,"d":"1861.73"},{"v":1912.3333333333335,"d":"1912.33"},{"v":1924.4166666666665,"d":"1924.42"},{"v":1937.6333333333334,"d":"1937.63"},1911.2,1885.9,4.65342]
[9,"ADANIENT",2362.7,{"v":2373.383333333333,"d":"2373.38"},{"v":2343.4166666666665,"d":"2343.42"},{"v":2324.133333333333,"d":"2324.13"},{"v":2294.1666666666665,"d":"2294.17"},{"v":2392.6666666666665,"d":"2392.67"},{"v":2422.6333333333337,"d":"2422.63"},{"v":2441.9166666666665,"d":"2441.92"},2403.35,2354.1,17.92983]
[10,"ADANIGREEN",1026.5,{"v":1030.5,"d":"1030.50"},{"v":1016,"d":"1016.00"},{"v":1005.5,"d":"1005.50"},{"v":991,"d":"991.00"},{"v":1041,"d":"1041.00"},{"v":1055.5,"d":"1055.50"},{"v":1066,"d":"1066.00"},1045,1020,11.81792]
{"$rows_left_out":511}
{"sheet":"Bulk Deals","index":4,"n_rows":134,"n_cols":8,"rows_kept":134,"merged":[[4,0,4,1],[4,2,4,3],[6,1,6,2]]}
[" "]
[]
[]
[]
[]
[{"$nulls":4},"Back To Main Page"]
["Subject :","BULK DEAL",null,{"$f":"Main!B10","v":"2023-12-04"}]
[]
["Date","Scrip code","Scrip Name","Client Name","Buy / Sell","Quantity Traded","Trade Price / Wt.Avg.trade price","Exchange  "]
["2023-12-01",539773,"ADVIKCA","SILVERTOSS SHOPPERS PRIVATE LIMITED","SELL",{"v":2702782,"d":"2,702,782"},2.45,"BSE"]
["2023-12-01",534733,"AERPACE","VINITAJAIN","SELL",{"v":161392,"d":"161,392"},4.08,"BSE"]
["2023-12-01",543926,"BIZOTIC","VIKASKUMAR CHHAGANBHAI LAKHANKIYA","SELL",{"v":58400,"d":"58,400"},49.07,"BSE"]
["2023-12-01",543926,"BIZOTIC","VIKASKUMAR CHHAGANBHAI LAKHANKIYA","BUY",{"v":16000,"d":"16,000"},54.19,"BSE"]
["2023-12-01",504340,"CONFINT","STANLEY EVEREST ANTONY MENEZES","BUY",{"v":100000,"d":"100,000"},8.49,"BSE"]
["2023-12-01",504340,"CONFINT","SETU SECURITIES PVT. LTD.","SELL",{"v":150000,"d":"150,000"},8.49,"BSE"]
["2023-12-01",504340,"CONFINT","VISHANKVILASPATIL","SELL",{"v":203561,"d":"203,561"},8.49,"BSE"]
["2023-12-01",504340,"CONFINT","GLADISMENEZES","BUY",{"v":100000,"d":"100,000"},8.49,"BSE"]
["2023-12-01",530825,"DAIKAFFI","JAINAM UDAY SHAH","BUY",{"v":54919,"d":"54,919"},72.24,"BSE"]
["2023-12-01",530825,"DAIKAFFI","MULTIPLIER SHARE & STOCK ADVISORS PRIVATE LIMITED","SELL",{"v":103596,"d":"103,596"},72.2,"BSE"]
["2023-12-01",543516,"DHYAANI","SOMANI VENTURES AND INNOVATIONS LIMITED","SELL",{"v":19000,"d":"19,000"},91.16,"BSE"]
{"$rows_left_out":115}
{"sheet":"Call Tracker (Equity & F&O)","index":5,"n_rows":271,"n_cols":19,"rows_kept":271}
[]
[]
[]
[]
[{"$nulls":12},"Back To Main Page"]
["Retail Research Technical Calls & Fundamental Performance Report for the month of December-2023"]
[{"$nulls":12},{"$f":"Main!B10","v":"2023-12-04"}]
[null,"Positional  Call"]
["Sr.no","Date",null,"Company","Rec","Rec Price","Stop Loss***","Call Closed At","Target","Remark","Profit / Loss per Share","All charges","Net Gain / Loss  %","Status","Closed Date","Market Closing Price","Second Buying Date"]
[1,"2023-09-20",null,"RELIANCE","Accu","2285-2385",2235,null,"2550-2700","Open",{"$nulls":5},{"$f":"VLOOKUP(D10,'MidCap Intra'!$B$11:$C$568,2,0)","v":{"v":2394.3,"d":"2394.30"}},"2023-10-04",null,"H"]
[2,"2023-09-21",null,"VGUARD","Accu","285-305",276,null,"330-350","Open",{"$nulls":5},{"$f":"VLOOKUP(D11,'MidCap Intra'!$B$11:$C$568,2,0)","v":{"v":296.9,"d":"296.90"}},"2023-10-09",null,"K"]
[3,"2023-10-13",null,"TCS","Accu <>","3441-3541",3321,null,"3800-4000","Open",{"$nulls":5},{"$f":"VLOOKUP(D12,'MidCap Intra'!$B$11:$C$568,2,0)","v":3511.65},"2023-10-19",null,"H"]
[4,"2023-10-25",null,"ICICIBANK","Accu","903-929",870,null,"990-1050","Open",{"$nulls":5},{"$f":"VLOOKUP(D13,'MidCap Intra'!$B$11:$C$568,2,0)","v":{"v":946.7,"d":"946.70"}},"2023-10-26",null,"H"]
[5,"2023-11-06",null,"HEIDELBERG","Accu",189.5,177,200,"204-214","Profit of Rs.15.5/-",{"$f":"H14-F14","v":10.5},{"$f":"(F14*-0.3)/100","v":{"v":-0.5685,"d":"-0.57"}},{"$f":"(K14+L14)/F14","v":{"v":0.0524089709762533,"d":"5.24%"}},"Successful","2023-11-08",{"$nulls":3},"H"]
[6,"2023-11-08",null,"JAMNAAUTO","Accu<>","106.40-111.40",102.9,null,"119-125","Open",{"$nulls":5},{"$f":"VLOOKUP(D15,'MidCap Intra'!$B$11:$C$568,2,0)","v":111.65},null,null,"H"]
[7,"2023-11-17",null,"ASHOKLEY","Accu","169-174",163,null,"185-195","Open",{"$nulls":5},{"$f":"VLOOKUP(D16,'MidCap Intra'!$B$11:$C$568,2,0)","v":{"v":176.3,"d":"176.30"}},null,null,"K"]
[8,"2023-11-17",null,"AMBUJACEM","Accu","402.5-422.5",390,null,"450-470","Open",{"$nulls":5},{"$f":"VLOOKUP(D17,'MidCap Intra'!$B$11:$C$568,2,0)","v":{"v":442,"d":"442.00"}},null,null,"H"]
[9,"2023-11-20",null,"TRIDENT","Accu","35.9-37",34.35,null,"40-42","Open",{"$nulls":5},{"$f":"VLOOKUP(D18,'MidCap Intra'!$B$11:$C$568,2,0)","v":{"v":36.3,"d":"36.30"}},null,null,"H"]
[10,"2023-11-20",null,"RVNL","Accu","159-164",152,null,"174-185","Open",{"$nulls":5},{"$f":"VLOOKUP(D19,'MidCap Intra'!$B$11:$C$568,2,0)","v":{"v":165,"d":"165.00"}},null,null,"H"]
[11,"2023-11-22",null,"SCHAEFFLER","Accu","2705-2805",2540,null,"3100-3200","Open",{"$nulls":5},{"$f":"VLOOKUP(D20,'MidCap Intra'!$B$11:$C$568,2,0)","v":{"v":2867.6,"d":"2867.60"}},null,null,"H"]
{"$rows_left_out":244}