{"text_format":"3","workbook":"xlsx","n_sheets":11,"sheets":["Main","Future Intra","Cash Intra","MidCap Intra","Bulk Deals","Call Tracker (Equity & F&O)","Sheet2","Sheet1","Sheet3","Sheet4","Sheet5"],"not_rendered":{"images":4,"defined_names":5},"read":"whole","date_system":"1900"}

{"sheet":"Main","index":0,"n_rows":27,"n_cols":11,"rows_kept":27}
[null,"                                                                                                 "]
{"$rows_empty":8}
[null,"2019-11-05"]
[]
[null,"Sheet No.","Template Name","Summary"]
[null,1,"Future Intra","For Intraday trading in F&O segment"]
[null,2,"Cash Intra","For Intraday trading in cash market segment"]
[null,3,"Mid-cap Intra","For Intraday trading in Mid-cap stocks"]
[null,4,"Bulk Deals","Reveals Bulk Deals carried on NSE & BSE"]
[null,5,"Call Tracker"]
{"$rows_empty":9}
[{"$nulls":10},"`"]

{"sheet":"Future Intra","index":1,"n_rows":193,"n_cols":15,"rows_kept":193,"merged":[[8,0,9,0],[8,1,9,1],[8,2,9,2],[8,5,8,7],[8,8,8,10]]}
[]
[]
[]
[]
[{"$nulls":12},"Back to Main Page"]
["FOR INTRA DAY TRADING",{"$nulls":10},{"$f":"Main!B10","v":"2019-11-05"}]
[]
[]
["Sr.no","Sector","Scrip","CLOSE RATE","Pivot Point","Supports",null,null,"Resistances"]
[null,"Sector",null,"Point","Point","S1","S2","S3","R1","R2","R3","HIGH","LOW","OI","% Change in OI"]
[1,"Index","BANKNIFTY",30396.05,{"v":30440.350000000002,"d":"30440.35"},{"v":30222.700000000004,"d":"30222.70"},{"v":30049.350000000002,"d":"30049.35"},{"v":29831.700000000004,"d":"29831.70"},{"v":30613.700000000004,"d":"30613.70"},{"v":30831.350000000006,"d":"30831.35"},{"v":31004.700000000004,"d":"31004.70"},30658,30267,1095200,{"v":0.11352868210748927,"d":"11.35%"}]
[2,"Index","NIFTY",{"v":11979.7,"d":"11979.70"},{"v":11976.216666666667,"d":"11976.22"},{"v":11939.633333333335,"d":"11939.63"},{"v":11899.566666666668,"d":"11899.57"},{"v":11862.983333333335,"d":"11862.98"},{"v":12016.283333333335,"d":"12016.28"},{"v":12052.866666666667,"d":"12052.87"},{"v":12092.933333333334,"d":"12092.93"},12012.8,11936.15,15341475,{"v":0.009405517969671399,"d":"0.94%"}]
[3,"Index","NIFTYIT",{"v":15720,"d":"15720.00"},{"v":15710.333333333334,"d":"15710.33"},{"v":15559.666666666668,"d":"15559.67"},{"v":15399.333333333334,"d":"15399.33"},{"v":15248.666666666668,"d":"15248.67"},{"v":15870.666666666668,"d":"15870.67"},{"v":16021.333333333336,"d":"16021.33"},{"v":16181.666666666668,"d":"16181.67"},15861,15550,7350,{"v":-0.045454545454545456,"d":"-4.55%"}]
[4,"Cement","ACC",{"v":1571.6,"d":"1571.60"},{"v":1572.8666666666668,"d":"1572.87"},{"v":1546.8333333333335,"d":"1546.83"},{"v":1522.0666666666666,"d":"1522.07"},{"v":1496.0333333333333,"d":"1496.03"},{"v":1597.6333333333337,"d":"1597.63"},{"v":1623.666666666667,"d":"1623.67"},{"v":1648.4333333333338,"d":"1648.43"},1598.9,1548.1,2603600,{"v":0.02941641625810533,"d":"2.94%"}]
[5,"Others","ADANIENT",{"v":201.2,"d":"201.20"},{"v":201.51666666666665,"d":"201.52"},{"v":198.2333333333333,"d":"198.23"},{"v":195.26666666666665,"d":"195.27"},{"v":191.9833333333333,"d":"191.98"},{"v":204.4833333333333,"d":"204.48"},{"v":207.76666666666665,"d":"207.77"},{"v":210.7333333333333,"d":"210.73"},204.8,198.55,29544000,{"v":6.7741498441945534E-4,"d":"0.07%"}]
[6,"Others","ADANIPORTS",392.95,{"v":393.4666666666667,"d":"393.47"},{"v":389.83333333333337,"d":"389.83"},{"v":386.7166666666667,"d":"386.72"},{"v":383.08333333333337,"d":"383.08"},{"v":396.58333333333337,"d":"396.58"},{"v":400.2166666666667,"d":"400.22"},{"v":403.33333333333337,"d":"403.33"},397.1,390.35,15965000,{"v":0.04929346040092014,"d":"4.93%"}]
[7,"Power","ADANIPOWER",71.85,{"v":71.43333333333334,"d":"71.43"},{"v":68.91666666666667,"d":"68.92"},{"v":65.98333333333333,"d":"65.98"},{"v":63.46666666666667,"d":"63.47"},{"v":74.36666666666667,"d":"74.37"},{"v":76.88333333333333,"d":"76.88"},{"v":79.81666666666668,"d":"79.82"},73.95,68.5,80760000,{"v":-0.015362106803218726,"d":"-1.54%"}]
[8,"Automobile","AMARAJABAT",659.05,{"v":669.4833333333333,"d":"669.48"},{"v":644.7666666666667,"d":"644.77"},{"v":630.4833333333333,"d":"630.48"},{"v":605.7666666666667,"d":"605.77"},{"v":683.7666666666667,"d":"683.77"},{"v":708.4833333333333,"d":"708.48"},{"v":722.7666666666667,"d":"722.77"},694.2,655.2,1398000,{"v":-0.050400760766200245,"d":"-5.04%"}]
[9,"Cement","AMBUJACEM",{"v":203.9,"d":"203.90"},{"v":204.91666666666666,"d":"204.92"},{"v":202.13333333333333,"d":"202.13"},{"v":200.36666666666667,"d":"200.37"},{"v":197.58333333333334,"d":"197.58"},{"v":206.6833333333333,"d":"206.68"},{"v":209.46666666666667,"d":"209.47"},{"v":211.2333333333333,"d":"211.23"},207.7,203.15,20392500,{"v":0.003938461538461538,"d":"0.39%"}]
[10,"Others","APOLLOHOSP",1421.35,{"v":1438.1000000000001,"d":"1438.10"},{"v":1401.2500000000002,"d":"1401.25"},1381.15,{"v":1344.3000000000002,"d":"1344.30"},{"v":1458.2000000000003,"d":"1458.20"},{"v":1495.0500000000002,"d":"1495.05"},{"v":1515.1500000000003,"d":"1515.15"},1474.95,1418,1660500,{"v":0.09495548961424333,"d":"9.50%"}]
{"$rows_left_out":159}
{"sheet":"Cash Intra","index":2,"n_rows":247,"n_cols":13,"rows_kept":247,"merged":[[7,0,8,0],[7,1,8,1],[7,2,8,2],[7,3,8,3],[7,4,7,6],[7,7,7,9]]}
[]
[]
[]
[]
[{"$nulls":12},"Back to Main Page"]
["FOR INTRA DAY TRADING",{"$nulls":9},{"$f":"Main!B10","v":"2019-11-05"}]
[]
["Sr.no","Scrip","CLOSE RATE","Pivot Point","Supports",null,null,"Resistances"]
[null,null,"Point",null,"S1","S2","S3","R1","R2","R3","HIGH","LOW","Total Trade Quanity in Lakhs"]
[1,"Nifty 50",11941.3,{"v":11945.266666666665,"d":"11945.27"},{"v":11901.38333333333,"d":"11901.38"},{"v":11861.466666666665,"d":"11861.47"},{"v":11817.58333333333,"d":"11817.58"},{"v":11985.183333333329,"d":"11985.18"},{"v":12029.066666666664,"d":"12029.07"},{"v":12068.983333333328,"d":"12068.98"},11989.15,11905.35]
[2,"Nifty Bank",30333.1,{"v":30389.13333333333,"d":"30389.13"},{"v":30171.216666666664,"d":"30171.22"},{"v":30009.333333333332,"d":"30009.33"},{"v":29791.416666666664,"d":"29791.42"},{"v":30551.016666666663,"d":"30551.02"},{"v":30768.933333333334,"d":"30768.93"},{"v":30930.816666666662,"d":"30930.82"},30607.05,30227.25]
[3,"Nifty CPSE",2067.4,{"v":2064.5333333333333,"d":"2064.53"},{"v":2055.866666666667,"d":"2055.87"},{"v":2044.3333333333335,"d":"2044.33"},{"v":2035.666666666667,"d":"2035.67"},{"v":2076.0666666666666,"d":"2076.07"},{"v":2084.7333333333336,"d":"2084.73"},{"v":2096.2666666666664,"d":"2096.27"},2073.2,2053]
[4,"Nifty Infra",3309.5,{"v":3316.1666666666665,"d":"3316.17"},{"v":3298.483333333333,"d":"3298.48"},{"v":3287.4666666666667,"d":"3287.47"},{"v":3269.7833333333333,"d":"3269.78"},{"v":3327.183333333333,"d":"3327.18"},{"v":3344.8666666666663,"d":"3344.87"},{"v":3355.8833333333328,"d":"3355.88"},3333.85,3305.15]
[5,"Nifty IT",15591.3,{"v":15607.716666666667,"d":"15607.72"},{"v":15412.083333333334,"d":"15412.08"},{"v":15232.866666666667,"d":"15232.87"},{"v":15037.233333333334,"d":"15037.23"},{"v":15786.933333333334,"d":"15786.93"},{"v":15982.566666666666,"d":"15982.57"},{"v":16161.783333333335,"d":"16161.78"},15803.35,15428.5]
[6,"Nifty PSE",3437.6,{"v":3440.566666666666,"d":"3440.57"},{"v":3424.9333333333325,"d":"3424.93"},{"v":3412.2666666666664,"d":"3412.27"},{"v":3396.6333333333328,"d":"3396.63"},{"v":3453.233333333332,"d":"3453.23"},{"v":3468.8666666666663,"d":"3468.87"},{"v":3481.533333333332,"d":"3481.53"},3456.2,3427.9]
[7,"Nifty Midcap 50",4654.95,{"v":4669.516666666666,"d":"4669.52"},{"v":4630.383333333333,"d":"4630.38"},{"v":4605.816666666667,"d":"4605.82"},{"v":4566.683333333333,"d":"4566.68"},{"v":4694.083333333333,"d":"4694.08"},{"v":4733.216666666666,"d":"4733.22"},{"v":4757.783333333333,"d":"4757.78"},4708.65,4644.95]
[8,"ACC",1564.65,{"v":1565.7833333333335,"d":"1565.78"},{"v":1541.066666666667,"d":"1541.07"},{"v":1517.4833333333336,"d":"1517.48"},{"v":1492.766666666667,"d":"1492.77"},{"v":1589.366666666667,"d":"1589.37"},{"v":1614.0833333333337,"d":"1614.08"},{"v":1637.666666666667,"d":"1637.67"},1590.5,1542.2,10.94603]
[9,"AUBANK",686.8,{"v":687.4166666666666,"d":"687.42"},{"v":682.3833333333332,"d":"682.38"},{"v":677.9666666666666,"d":"677.97"},{"v":672.9333333333332,"d":"672.93"},{"v":691.8333333333333,"d":"691.83"},{"v":696.8666666666668,"d":"696.87"},{"v":701.2833333333333,"d":"701.28"},692.45,683,3.28041]
[10,"ADANIPORTS",391,{"v":391.90000000000003,"d":"391.90"},{"v":388.8500000000001,"d":"388.85"},{"v":386.70000000000005,"d":"386.70"},{"v":383.6500000000001,"d":"383.65"},{"v":394.05000000000007,"d":"394.05"},{"v":397.1,"d":"397.10"},{"v":399.25000000000006,"d":"399.25"},394.95,389.75,31.46855]
[11,"ADANIPOWER",71.6,{"v":71.18333333333332,"d":"71.18"},{"v":68.56666666666665,"d":"68.57"},{"v":65.53333333333333,"d":"65.53"},{"v":62.91666666666666,"d":"62.92"},{"v":74.21666666666664,"d":"74.22"},{"v":76.83333333333331,"d":"76.83"},{"v":79.86666666666663,"d":"79.87"},73.8,68.15,326.91051]
{"$rows_left_out":228}
{"sheet":"MidCap Intra","index":3,"n_rows":545,"n_cols":13,"rows_kept":545,"merged":[[0,0,0,1],[8,0,9,0],[8,1,9,1],[8,2,9,2],[8,3,9,3],[8,4,8,6],[8,7,8,9]]}
[]
[]
[]
[]
[{"$nulls":11},"Back To Main Page"]
["FOR INTRA DAY TRADING",{"$nulls":9},{"$f":"Main!B10","v":"2019-11-05"}]
[null,null," "]
[]
["Sr.no","Scrip","CLOSE RATE","Pivot Point","Supports",null,null,"Resistances"]
[null,null,"Point",null,"S1","S2","S3","R1","R2","R3","HIGH","LOW","Total Trade Quanity in Lakhs"]
[1,"3MINDIA",22314.85,22288.95,{"v":22027.9,"d":"22027.90"},21740.95,{"v":21479.9,"d":"21479.90"},{"v":22575.9,"d":"22575.90"},{"v":22836.949999999997,"d":"22836.95"},{"v":23123.9,"d":"23123.90"},22550,22002,0.01559]
[2,"ACC",1564.65,{"v":1565.7833333333335,"d":"1565.78"},{"v":1541.066666666667,"d":"1541.07"},{"v":1517.4833333333336,"d":"1517.48"},{"v":1492.766666666667,"d":"1492.77"},{"v":1589.366666666667,"d":"1589.37"},{"v":1614.0833333333337,"d":"1614.08"},{"v":1637.666666666667,"d":"1637.67"},1590.5,1542.2,10.94603]
[3,"AIAENG",1677.4,1681.45,1656.95,{"v":1636.5,"d":"1636.50"},{"v":1612,"d":"1612.00"},{"v":1701.9,"d":"1701.90"},{"v":1726.4,"d":"1726.40"},{"v":1746.8500000000001,"d":"1746.85"},1705.95,1661,0.05411]
[4,"APLAPOLLO",1505.55,{"v":1496.0833333333333,"d":"1496.08"},{"v":1474.9666666666665,"d":"1474.97"},{"v":1444.3833333333332,"d":"1444.38"},{"v":1423.2666666666664,"d":"1423.27"},{"v":1526.6666666666665,"d":"1526.67"},{"v":1547.7833333333333,"d":"1547.78"},{"v":1578.3666666666666,"d":"1578.37"},1517.2,1465.5,0.16414]
[5,"AUBANK",686.8,{"v":687.4166666666666,"d":"687.42"},{"v":682.3833333333332,"d":"682.38"},{"v":677.9666666666666,"d":"677.97"},{"v":672.9333333333332,"d":"672.93"},{"v":691.8333333333333,"d":"691.83"},{"v":696.8666666666668,"d":"696.87"},{"v":701.2833333333333,"d":"701.28"},692.45,683,3.28041]
[6,"AAVAS",1532.55,{"v":1555.8833333333332,"d":"1555.88"},{"v":1501.7666666666664,"d":"1501.77"},{"v":1470.9833333333331,"d":"1470.98"},{"v":1416.8666666666663,"d":"1416.87"},{"v":1586.6666666666665,"d":"1586.67"},{"v":1640.7833333333333,"d":"1640.78"},{"v":1671.5666666666666,"d":"1671.57"},1610,1525.1,0.24641]
[7,"ABBOTINDIA",11987.25,{"v":12052.416666666666,"d":"12052.42"},{"v":11704.833333333332,"d":"11704.83"},{"v":11422.416666666666,"d":"11422.42"},{"v":11074.833333333332,"d":"11074.83"},{"v":12334.833333333332,"d":"12334.83"},{"v":12682.416666666664,"d":"12682.42"},{"v":12964.833333333332,"d":"12964.83"},12400,11770,0.12263]
[8,"ADANIGAS",147.9,{"v":147.79999999999998,"d":"147.80"},{"v":146.69999999999996,"d":"146.70"},{"v":145.49999999999997,"d":"145.50"},{"v":144.39999999999995,"d":"144.40"},{"v":148.99999999999997,"d":"149.00"},{"v":150.1,"d":"150.10"},{"v":151.29999999999998,"d":"151.30"},148.9,146.6,8.06625]
[9,"ADANIGREEN",92.65,{"v":92.7,"d":"92.70"},{"v":89.55000000000001,"d":"89.55"},86.45,{"v":83.30000000000001,"d":"83.30"},{"v":95.80000000000001,"d":"95.80"},{"v":98.95000000000002,"d":"98.95"},{"v":102.05000000000001,"d":"102.05"},95.85,89.6,32.84998]
[10,"ADANIPORTS",391,{"v":391.90000000000003,"d":"391.90"},{"v":388.8500000000001,"d":"388.85"},{"v":386.70000000000005,"d":"386.70"},{"v":383.6500000000001,"d":"383.65"},{"v":394.05000000000007,"d":"394.05"},{"v":397.1,"d":"397.10"},{"v":399.25000000000006,"d":"399.25"},394.95,389.75,31.46855]
{"$rows_left_out":513}
{"sheet":"Bulk Deals","index":4,"n_rows":68,"n_cols":8,"rows_kept":68,"merged":[[4,0,4,1],[4,2,4,3],[6,1,6,2]]}
[" "]
[]
[]
[]
[]
[{"$nulls":4},"Back To Main Page"]
["Subject :","BULK DEAL",null,{"$f":"Main!B10","v":"2019-11-05"}]
[]
["Date","Scrip code","Scrip Name","Client Name","Buy / Sell","Quantity Traded","Trade Price / Wt.Avg.trade price","Exchange  "]
["2019-11-04",538716,"ARYACAPM","PARESH BABULAL SHAH","SELL",{"v":65000,"d":"65,000"},{"v":30,"d":"30.00"},"BSE"]
["2019-11-04",538716,"ARYACAPM","VARSHABEN J THOBHANI","BUY",{"v":160000,"d":"160,000"},{"v":30.7,"d":"30.70"},"BSE"]
["2019-11-04",500093,"CGPOWER","L&T FINANCE LIMITED","BUY",{"v":62600000,"d":"62,600,000"},13.97,"BSE"]
["2019-11-04",500093,"CGPOWER","VISTRA ITCL INDIA LIMITED","SELL",{"v":62600000,"d":"62,600,000"},13.97,"BSE"]
["2019-11-04",533144,"COX&KINGS","ALPHA LEON ENTERPRISES LLP","BUY",{"v":6111816,"d":"6,111,816"},1.46,"BSE"]
["2019-11-04",533144,"COX&KINGS","ALPHA LEON ENTERPRISES LLP","SELL",{"v":2531816,"d":"2,531,816"},1.53,"BSE"]
["2019-11-04",533144,"COX&KINGS","TANISH TRADEFIN LLP","BUY",{"v":1500000,"d":"1,500,000"},1.48,"BSE"]
["2019-11-04",533144,"COX&KINGS","TANISH TRADEFIN LLP","SELL",{"v":303313,"d":"303,313"},1.53,"BSE"]
["2019-11-04",533144,"COX&KINGS","SWAPNIL MEHTA","BUY",{"v":2527006,"d":"2,527,006"},1.51,"BSE"]
["2019-11-04",533144,"COX&KINGS","SWAPNIL MEHTA","SELL",{"v":527006,"d":"527,006"},1.47,"BSE"]
["2019-11-04",533144,"COX&KINGS","MULTIPLIER SHARE & STOCK ADVISORS PRIVATE LIMITED","BUY",{"v":2556236,"d":"2,556,236"},1.49,"BSE"]
{"$rows_left_out":49}
{"sheet":"Call Tracker (Equity & F&O)","index":5,"n_rows":278,"n_cols":18,"rows_kept":278,"merged":[[57,0,58,0],[57,1,58,1],[57,9,58,9],[57,11,58,11],[57,12,58,12],[57,13,58,13],[57,14,58,14],[59,0,60,0],[59,1,60,1],[59,9,60,9],[59,11,60,11],[59,12,60,12],[59,13,60,13],[59,14,60,14],[61,0,62,0],[61,1,62,1],[61,9,62,9],[61,11,62,11],[61,12,62,12],[61,13,62,13],[61,14,62,14],[63,0,64,0],[63,1,64,1],[63,9,64,9],[63,11,64,11],[63,12,64,12],[63,13,64,13],[63,14,64,14],[65,0,66,0],[65,1,66,1],[65,9,66,9],[65,11,66,11],[65,12,66,12],[65,13,66,13],[65,14,66,14],[67,0,68,0],[67,1,68,1],[67,9,68,9],[67,11,68,11],[67,12,68,12],[67,13,68,13],[67,14,68,14],[69,0,70,0],[69,1,70,1],[69,9,70,9],[69,11,70,11],[69,12,70,12],[69,13,70,13],[69,14,70,14],[71,0,72,0],[71,1,72,1],[71,9,72,9],[71,11,72,11],[71,12,72,12],[71,13,72,13],[71,14,72,14],[73,0,74,0],[73,1,74,1],[73,9,74,9],[73,11,74,11],[73,12,74,12],[73,13,74,13],[73,14,74,14],[75,0,76,0],[75,1,76,1],[75,9,76,9],[75,11,76,11],[75,12,76,12],[75,13,76,13],[75,14,76,14],[77,0,78,0],[77,1,78,1],[77,9,78,9],[77,11,78,11],[77,12,78,12],[77,13,78,13],[77,14,78,14],[79,0,80,0],[79,1,80,1],[79,9,80,9],[79,11,80,11],[79,12,80,12],[79,13,80,13],[79,14,80,14],[81,0,82,0],[81,1,82,1],[81,9,82,9],[81,11,82,11],[81,12,82,12],[81,13,82,13],[81,14,82,14],[83,0,84,0],[83,1,84,1],[83,9,84,9],[83,11,84,11],[83,12,84,12],[83,13,84,13],[83,14,84,14],[85,0,86,0],[85,1,86,1],[85,9,86,9],[85,11,86,11],[85,12,86,12],[85,13,86,13],[85,14,86,14],[92,0,93,0],[92,1,93,1],[92,9,93,9],[92,11,93,11],[92,12,93,12],[92,13,93,13],[92,14,93,14],[94,0,95,0],[94,1,95,1],[94,9,95,9],[94,11,95,11],[94,12,95,12],[94,13,95,13],[94,14,95,14],[97,0,98,0],[97,1,98,1],[97,9,98,9],[97,11,98,11],[97,12,98,12],[97,13,98,13],[97,14,98,14],[99,0,100,0],[99,1,100,1],[99,9,100,9],[99,11,100,11],[99,12,100,12],[99,13,100,13],[99,14,100,14]]}
[]
[]
[]
[]
[{"$nulls":12},"Back To Main Page"]
["Retail Research Technical Calls & Fundamental Performance Report for the month of November-2019 "]
[{"$nulls":12},{"$f":"Main!B10","v":"2019-11-05"}]
[null,"Positional  Call"]
["Sr.no","Date",null,"Company","Rec","Rec Price","Stop Loss***","Call Closed At","Target","Remark","Profit / Loss per Share","Gain / Loss  %","Status","Closed Date","NSE Closed Price"]
[1,"2019-09-26",null,"HDFC","Buy",2070,1940,2165,"2250-2300","Profit of Rs.95/-",{"$f":"H10-F10","v":95},{"$f":"K10/F10","v":{"v":0.04589371980676329,"d":"4.59%"}},"Successful","2019-11-01",{"$f":"VLOOKUP(D10,Sheet2!A43:M1682,6,0)","v":2181.3},null,null,"H"]
[2,"2019-10-01",null,"UPL","Buy","592-598",564,null,"650-660","Open",{"$nulls":4},{"$f":"VLOOKUP(D11,Sheet2!A47:M1686,6,0)","v":594.25},null,null,"R"]
[3,"2019-10-07",null,"PIDILITIND","Buy",1367.5,1297,1413.5,"1500-1520","Part Profit of Rs.46/-",{"$f":"H12-F12","v":46},{"$f":"K12/F12","v":{"v":0.03363802559414991,"d":"3.36%"}},"Successful","2019-10-31",{"$f":"VLOOKUP(D12,Sheet2!A51:M1690,6,0)","v":1399.45},null,null,"R"]
[4,"2019-10-22",null,"HEIDELBERG","Buy","187.50-189.50",178,null,"205-210","Open",{"$nulls":4},{"$f":"VLOOKUP(D13,Sheet2!A58:M1697,6,0)","v":191},null,null,"H"]
[5,"2019-10-27",null,"AMBUJACEM","Buy",197,185.4,203.5,"216-220","Part Profit of Rs.6.5/-",{"$f":"H14-F14","v":6.5},{"$f":"K14/F14","v":{"v":0.03299492385786802,"d":"3.30%"}},"Successful","2019-10-30",{"$f":"VLOOKUP(D14,Sheet2!A60:M1699,6,0)","v":203.35},null,null,"R"]
[6,"2019-11-04",null,"UBL","Buy","1237-1243",1178,null,"1340-1360","Open",{"$nulls":4},{"$f":"VLOOKUP(D15,Sheet2!A60:M1699,6,0)","v":1233.7},null,null,"H"]
{"$rows_empty":14}
["CLBS = Closing Basis ***"]
["Dividend adjusted <>",{"$nulls":4},"Reinitiated $"]
["Part book {}",{"$nulls":4},"Revised stoploss #"]
[]
{"$rows_left_out":218}
{"sheet":"Sheet2","index":6,"n_rows":1899,"n_cols":14,"rows_kept":1899,"hidden":true}
["SYMBOL","SERIES","OPEN","HIGH","LOW","CLOSE","LAST","PREVCLOSE","TOTTRDQTY","TOTTRDVAL","TIMESTAMP","TOTALTRADES","ISIN","ISIN"]
["20MICRONS","EQ",38.3,38.6,37.3,37.35,37.3,37.7,30798,1163619.1,"2019-11-04",319,"INE144J01027"]
["21STCENMGM","EQ",13.25,13.5,13.25,13.5,13.5,13.25,171,2283.5,"2019-11-04",6,"INE253B01015"]
["3IINFOTECH","EQ",2,2.05,1.95,2,2,2,988118,1971743.9,"2019-11-04",590,"INE748C01020"]
["3MINDIA","EQ",22399,22550,22002,22314.85,22300,22202.1,1559,34867768.45,"2019-11-04",783,"INE470A01017"]
["3PLAND","EQ",6.5,6.5,6.5,6.5,6.5,6.2,125,812.5,"2019-11-04",2,"INE105C01023"]
["5PAISA","EQ",170.5,171,164.7,166.25,167.95,169.65,11522,1931269.9,"2019-11-04",197,"INE618L01018"]
["63MOONS","EQ",120.45,122,116.1,117.6,118.5,119.8,152881,18184136.35,"2019-11-04",2021,"INE111B01023"]
["A2ZINFRA","EQ",10.8,11.2,9.9,10,9.95,10.7,1288068,13508375,"2019-11-04",2638,"INE619I01012"]
["AARTIDRUGS","EQ",541,541.15,524.4,526.6,528,532,8039,4265228.95,"2019-11-04",702,"INE767A01016"]
["AARTIIND","EQ",870,879.95,850,852.1,853.5,877.4,78171,67534572.95,"2019-11-04",7109,"INE769A01020"]
["AARVEEDEN","EQ",14.15,15.15,14.05,14.3,14.75,14.1,4203,60605.65,"2019-11-04",97,"INE273D01019"]
["AAVAS","EQ",1610,1610,1525.1,1532.55,1529,1582.75,24641,38178670.5,"2019-11-04",3066,"INE216P01012"]
["ABAN","BE",28.95,29.4,28.1,29.4,29.4,28,38984,1139413.6,"2019-11-04",394,"INE421A01028"]
["ABB","EQ",1467.7,1478.4,1452.7,1456.7,1459,1458.85,35652,52149016.3,"2019-11-04",2423,"INE117A01022"]
["ABBOTINDIA","EQ",11770,12400,11770,11987.25,11950,11620.15,12263,147671894.35,"2019-11-04",3728,"INE358A01014"]
["ABCAPITAL","EQ",83.2,86.2,82.8,83.35,83.45,83,2829489,238568477.55,"2019-11-04",27788,"INE674K01013"]
["ABFRL","EQ",212,214.95,210.05,213.7,213.85,211,202328,43127883.35,"2019-11-04",5287,"INE647O01011"]
["ABMINTLTD","BE",14.1,14.1,14.1,14.1,14.1,14.1,26,366.6,"2019-11-04",1,"INE251C01017"]
["ABSLBANETF","EQ",330,330,330,330,330,330,91,30030,"2019-11-04",3,"INF209KB1O58"]
{"$rows_left_out":1701}
{"sheet":"Sheet1","index":7,"n_rows":0,"n_cols":0,"rows_kept":0,"hidden":true}

{"sheet":"Sheet3","index":8,"n_rows":0,"n_cols":0,"rows_kept":0,"hidden":true}

{"sheet":"Sheet4","index":9,"n_rows":0,"n_cols":0,"rows_kept":0,"hidden":true}

{"sheet":"Sheet5","index":10,"n_rows":0,"n_cols":0,"rows_kept":0,"hidden":true}