{"text_format":"3","workbook":"xlsx","n_sheets":10,"sheets":["Main","Future Intra","Cash Intra","MidCap Intra","Bulk Deals","Call Tracker (Equity & F&O)","Sheet2","Sheet1","Sheet3","Sheet4"],"not_rendered":{"images":4,"defined_names":5},"read":"whole","date_system":"1900"}

{"sheet":"Main","index":0,"n_rows":27,"n_cols":11,"rows_kept":27}
[null,"                                                                                                 "]
{"$rows_empty":8}
[null,"2019-08-03"]
[]
[null,"Sheet No.","Template Name","Summary"]
[null,1,"Future Intra","For Intraday trading in F&O segment"]
[null,2,"Cash Intra","For Intraday trading in cash market segment"]
[null,3,"Mid-cap Intra","For Intraday trading in Mid-cap stocks"]
[null,4,"Bulk Deals","Reveals Bulk Deals carried on NSE & BSE"]
[null,5,"Call Tracker"]
{"$rows_empty":9}
[{"$nulls":10},"`"]

{"sheet":"Future Intra","index":1,"n_rows":205,"n_cols":15,"rows_kept":205,"merged":[[8,0,9,0],[8,1,9,1],[8,2,9,2],[8,5,8,7],[8,8,8,10]]}
[]
[]
[]
[]
[{"$nulls":12},"Back to Main Page"]
["FOR INTRA DAY TRADING",{"$nulls":10},{"$f":"Main!B10","v":"2019-08-03"}]
[]
[]
["Sr.no","Sector","Scrip","CLOSE RATE","Pivot Point","Supports",null,null,"Resistances"]
[null,"Sector",null,"Point","Point","S1","S2","S3","R1","R2","R3","HIGH","LOW","OI","% Change in OI"]
[1,"Index","BANKNIFTY",{"v":28327.3,"d":"28327.30"},{"v":28354.38333333333,"d":"28354.38"},{"v":28023.816666666662,"d":"28023.82"},{"v":27720.333333333332,"d":"27720.33"},{"v":27389.766666666663,"d":"27389.77"},{"v":28657.86666666666,"d":"28657.87"},{"v":28988.433333333327,"d":"28988.43"},{"v":29291.91666666666,"d":"29291.92"},28684.95,28050.9,1795540,{"v":0.03391606780910263,"d":"3.39%"}]
[2,"Index","NIFTY",11024.05,{"v":11011.833333333334,"d":"11011.83"},{"v":10898.266666666668,"d":"10898.27"},{"v":10772.483333333334,"d":"10772.48"},{"v":10658.916666666668,"d":"10658.92"},{"v":11137.616666666669,"d":"11137.62"},{"v":11251.183333333334,"d":"11251.18"},{"v":11376.966666666669,"d":"11376.97"},11125.4,10886.05,20253975,{"v":0.012154716839698662,"d":"1.22%"}]
[3,"Index","NIFTYIT",{"v":15524,"d":"15524.00"},{"v":15456,"d":"15456.00"},{"v":15359,"d":"15359.00"},{"v":15194,"d":"15194.00"},{"v":15097,"d":"15097.00"},{"v":15621,"d":"15621.00"},{"v":15718,"d":"15718.00"},{"v":15883,"d":"15883.00"},15553,15291,13800,{"v":-0.010752688172043012,"d":"-1.08%"}]
[4,"Cement","ACC",{"v":1524.4,"d":"1524.40"},{"v":1523.0166666666667,"d":"1523.02"},{"v":1503.0333333333333,"d":"1503.03"},{"v":1481.6666666666667,"d":"1481.67"},{"v":1461.6833333333334,"d":"1461.68"},{"v":1544.3833333333332,"d":"1544.38"},{"v":1564.3666666666663,"d":"1564.37"},{"v":1585.7333333333331,"d":"1585.73"},1543,1501.65,2291600,{"v":-0.004863644259162758,"d":"-0.49%"}]
[5,"Others","ADANIENT",{"v":128.5,"d":"128.50"},{"v":127.51666666666667,"d":"127.52"},{"v":124.53333333333333,"d":"124.53"},{"v":120.56666666666666,"d":"120.57"},{"v":117.58333333333333,"d":"117.58"},{"v":131.48333333333335,"d":"131.48"},{"v":134.46666666666664,"d":"134.47"},{"v":138.43333333333334,"d":"138.43"},130.5,123.55,29348000,{"v":-0.01238390092879257,"d":"-1.24%"}]
[6,"Others","ADANIPORTS",377.15,{"v":374.5833333333333,"d":"374.58"},{"v":367.51666666666665,"d":"367.52"},{"v":357.8833333333333,"d":"357.88"},{"v":350.81666666666666,"d":"350.82"},{"v":384.21666666666664,"d":"384.22"},{"v":391.28333333333336,"d":"391.28"},{"v":400.91666666666663,"d":"400.92"},381.65,364.95,15147500,{"v":0.003976801988400994,"d":"0.40%"}]
[7,"Power","ADANIPOWER",61.35,61.15,{"v":58.8,"d":"58.80"},56.25,{"v":53.9,"d":"53.90"},{"v":63.699999999999996,"d":"63.70"},{"v":66.05000000000001,"d":"66.05"},{"v":68.6,"d":"68.60"},63.5,58.6,111200000,{"v":-3.595828838547285E-4,"d":"-0.04%"}]
[8,"Automobile","AMARAJABAT",{"v":657,"d":"657.00"},{"v":656.6333333333333,"d":"656.63"},{"v":650.4166666666666,"d":"650.42"},{"v":643.8333333333333,"d":"643.83"},{"v":637.6166666666666,"d":"637.62"},{"v":663.2166666666667,"d":"663.22"},{"v":669.4333333333334,"d":"669.43"},{"v":676.0166666666668,"d":"676.02"},662.85,650.05,1769600,{"v":-0.004724409448818898,"d":"-0.47%"}]
[9,"Cement","AMBUJACEM",{"v":200,"d":"200.00"},{"v":199.36666666666667,"d":"199.37"},{"v":195.93333333333334,"d":"195.93"},{"v":191.86666666666667,"d":"191.87"},{"v":188.43333333333334,"d":"188.43"},{"v":203.43333333333334,"d":"203.43"},{"v":206.86666666666667,"d":"206.87"},{"v":210.93333333333334,"d":"210.93"},202.8,195.3,21337500,{"v":-9.3643918998010062E-4,"d":"-0.09%"}]
[10,"Others","APOLLOHOSP",1310.85,{"v":1313.6666666666667,"d":"1313.67"},{"v":1270.4833333333336,"d":"1270.48"},{"v":1230.1166666666668,"d":"1230.12"},{"v":1186.9333333333336,"d":"1186.93"},{"v":1354.0333333333335,"d":"1354.03"},{"v":1397.2166666666665,"d":"1397.22"},{"v":1437.5833333333335,"d":"1437.58"},1356.85,1273.3,1130500,{"v":-0.11645173896053146,"d":"-11.65%"}]
{"$rows_left_out":172}
{"sheet":"Cash Intra","index":2,"n_rows":247,"n_cols":13,"rows_kept":247,"merged":[[7,0,8,0],[7,1,8,1],[7,2,8,2],[7,3,8,3],[7,4,7,6],[7,7,7,9]]}
[]
[]
[]
[]
[{"$nulls":12},"Back to Main Page"]
["FOR INTRA DAY TRADING",{"$nulls":9},{"$f":"Main!B10","v":"2019-08-03"}]
[]
["Sr.no","Scrip","CLOSE RATE","Pivot Point","Supports",null,null,"Resistances"]
[null,null,"Point",null,"S1","S2","S3","R1","R2","R3","HIGH","LOW","Total Trade Quanity in Lakhs"]
[1,"Nifty 50",10997.35,{"v":10975.483333333332,"d":"10975.48"},{"v":10870.816666666664,"d":"10870.82"},{"v":10744.283333333333,"d":"10744.28"},{"v":10639.616666666665,"d":"10639.62"},{"v":11102.016666666663,"d":"11102.02"},{"v":11206.68333333333,"d":"11206.68"},{"v":11333.216666666662,"d":"11333.22"},11080.15,10848.95]
[2,"Nifty Bank",28204.95,{"v":28228.61666666667,"d":"28228.62"},{"v":27912.683333333338,"d":"27912.68"},{"v":27620.416666666668,"d":"27620.42"},{"v":27304.483333333337,"d":"27304.48"},{"v":28520.88333333334,"d":"28520.88"},{"v":28836.816666666673,"d":"28836.82"},{"v":29129.08333333334,"d":"29129.08"},28544.55,27936.35]
[3,"Nifty CPSE",1953.35,{"v":1962.8999999999999,"d":"1962.90"},{"v":1939.1499999999996,"d":"1939.15"},{"v":1924.9499999999998,"d":"1924.95"},{"v":1901.1999999999996,"d":"1901.20"},{"v":1977.0999999999997,"d":"1977.10"},{"v":2000.8500000000001,"d":"2000.85"},{"v":2015.0499999999997,"d":"2015.05"},1986.65,1948.7]
[4,"Nifty Infra",3060.15,{"v":3056.5333333333333,"d":"3056.53"},{"v":3025.6666666666665,"d":"3025.67"},{"v":2991.1833333333334,"d":"2991.18"},{"v":2960.3166666666666,"d":"2960.32"},{"v":3091.0166666666664,"d":"3091.02"},{"v":3121.883333333333,"d":"3121.88"},{"v":3156.3666666666663,"d":"3156.37"},3087.4,3022.05]
[5,"Nifty IT",15422.1,{"v":15363.983333333332,"d":"15363.98"},{"v":15266.916666666664,"d":"15266.92"},{"v":15111.733333333332,"d":"15111.73"},{"v":15014.666666666664,"d":"15014.67"},{"v":15519.166666666664,"d":"15519.17"},{"v":15616.233333333334,"d":"15616.23"},{"v":15771.416666666664,"d":"15771.42"},15461.05,15208.8]
[6,"Nifty PSE",3143.55,{"v":3153.183333333333,"d":"3153.18"},{"v":3118.366666666666,"d":"3118.37"},{"v":3093.183333333333,"d":"3093.18"},{"v":3058.366666666666,"d":"3058.37"},{"v":3178.366666666666,"d":"3178.37"},{"v":3213.1833333333325,"d":"3213.18"},{"v":3238.366666666666,"d":"3238.37"},3188,3128]
[7,"Nifty Midcap 50",4294.3,{"v":4285.916666666667,"d":"4285.92"},{"v":4231.433333333334,"d":"4231.43"},{"v":4168.5666666666675,"d":"4168.57"},{"v":4114.083333333335,"d":"4114.08"},{"v":4348.783333333334,"d":"4348.78"},{"v":4403.2666666666655,"d":"4403.27"},{"v":4466.133333333333,"d":"4466.13"},4340.4,4223.05]
[8,"ABB",1367.8,{"v":1365.9333333333334,"d":"1365.93"},{"v":1341.8666666666668,"d":"1341.87"},{"v":1315.9333333333334,"d":"1315.93"},{"v":1291.8666666666668,"d":"1291.87"},{"v":1391.8666666666668,"d":"1391.87"},{"v":1415.9333333333334,"d":"1415.93"},{"v":1441.8666666666668,"d":"1441.87"},1390,1340,0.45918]
[9,"ACC",1517.45,1515.45,{"v":1496,"d":"1496.00"},1474.55,{"v":1455.1,"d":"1455.10"},{"v":1536.9,"d":"1536.90"},{"v":1556.3500000000004,"d":"1556.35"},{"v":1577.8000000000002,"d":"1577.80"},1534.9,1494,7.79585]
[10,"AUBANK",668.95,{"v":665.6166666666667,"d":"665.62"},{"v":653.4333333333334,"d":"653.43"},{"v":637.9166666666667,"d":"637.92"},{"v":625.7333333333335,"d":"625.73"},{"v":681.1333333333333,"d":"681.13"},{"v":693.3166666666665,"d":"693.32"},{"v":708.8333333333333,"d":"708.83"},677.8,650.1,0.99212]
[11,"ADANIPORTS",375.45,372.95,366.15,{"v":356.84999999999997,"d":"356.85"},{"v":350.04999999999995,"d":"350.05"},382.25,{"v":389.05000000000007,"d":"389.05"},398.35,379.75,363.65,30.29294]
{"$rows_left_out":228}
{"sheet":"MidCap Intra","index":3,"n_rows":545,"n_cols":13,"rows_kept":545,"merged":[[0,0,0,1],[8,0,9,0],[8,1,9,1],[8,2,9,2],[8,3,9,3],[8,4,8,6],[8,7,8,9]]}
[]
[]
[]
[]
[{"$nulls":11},"Back To Main Page"]
["FOR INTRA DAY TRADING",{"$nulls":9},{"$f":"Main!B10","v":"2019-08-03"}]
[null,null," "]
[]
["Sr.no","Scrip","CLOSE RATE","Pivot Point","Supports",null,null,"Resistances"]
[null,null,"Point",null,"S1","S2","S3","R1","R2","R3","HIGH","LOW","Total Trade Quanity in Lakhs"]
[1,"3MINDIA",20842.65,{"v":20771,"d":"20771.00"},{"v":20577.7,"d":"20577.70"},20312.75,20119.45,21035.95,{"v":21229.250000000004,"d":"21229.25"},{"v":21494.2,"d":"21494.20"},20964.3,20506.05,0.00727]
[2,"ABB",1367.8,{"v":1365.9333333333334,"d":"1365.93"},{"v":1341.8666666666668,"d":"1341.87"},{"v":1315.9333333333334,"d":"1315.93"},{"v":1291.8666666666668,"d":"1291.87"},{"v":1391.8666666666668,"d":"1391.87"},{"v":1415.9333333333334,"d":"1415.93"},{"v":1441.8666666666668,"d":"1441.87"},1390,1340,0.45918]
[3,"ACC",1517.45,1515.45,{"v":1496,"d":"1496.00"},1474.55,{"v":1455.1,"d":"1455.10"},{"v":1536.9,"d":"1536.90"},{"v":1556.3500000000004,"d":"1556.35"},{"v":1577.8000000000002,"d":"1577.80"},1534.9,1494,7.79585]
[4,"AIAENG",1709.4,{"v":1710.3833333333332,"d":"1710.38"},{"v":1681.5166666666664,"d":"1681.52"},{"v":1653.6333333333332,"d":"1653.63"},{"v":1624.7666666666664,"d":"1624.77"},{"v":1738.2666666666664,"d":"1738.27"},{"v":1767.1333333333332,"d":"1767.13"},{"v":1795.0166666666664,"d":"1795.02"},1739.25,1682.5,0.06081]
[5,"APLAPOLLO",1344.45,{"v":1366.4833333333333,"d":"1366.48"},{"v":1307.9666666666667,"d":"1307.97"},{"v":1271.4833333333333,"d":"1271.48"},{"v":1212.9666666666667,"d":"1212.97"},{"v":1402.9666666666667,"d":"1402.97"},{"v":1461.4833333333336,"d":"1461.48"},{"v":1497.9666666666667,"d":"1497.97"},1425,1330,0.88236]
[6,"AUBANK",668.95,{"v":665.6166666666667,"d":"665.62"},{"v":653.4333333333334,"d":"653.43"},{"v":637.9166666666667,"d":"637.92"},{"v":625.7333333333335,"d":"625.73"},{"v":681.1333333333333,"d":"681.13"},{"v":693.3166666666665,"d":"693.32"},{"v":708.8333333333333,"d":"708.83"},677.8,650.1,0.99212]
[7,"AAVAS",1467.85,{"v":1454.3833333333332,"d":"1454.38"},{"v":1433.7666666666664,"d":"1433.77"},{"v":1399.6833333333332,"d":"1399.68"},{"v":1379.0666666666664,"d":"1379.07"},{"v":1488.4666666666665,"d":"1488.47"},{"v":1509.0833333333333,"d":"1509.08"},{"v":1543.1666666666665,"d":"1543.17"},1475,1420.3,0.14439]
[8,"ADANIGREEN",46.85,{"v":46.666666666666664,"d":"46.67"},{"v":45.18333333333333,"d":"45.18"},{"v":43.516666666666666,"d":"43.52"},{"v":42.03333333333333,"d":"42.03"},{"v":48.33333333333333,"d":"48.33"},{"v":49.81666666666666,"d":"49.82"},{"v":51.48333333333333,"d":"51.48"},48.15,45,9.32015]
[9,"ADANIPORTS",375.45,372.95,366.15,{"v":356.84999999999997,"d":"356.85"},{"v":350.04999999999995,"d":"350.05"},382.25,{"v":389.05000000000007,"d":"389.05"},398.35,379.75,363.65,30.29294]
[10,"ADANIPOWER",61.45,{"v":61.1,"d":"61.10"},{"v":58.7,"d":"58.70"},55.95,{"v":53.550000000000004,"d":"53.55"},63.85,66.25,{"v":69,"d":"69.00"},63.5,58.35,188.06303]
{"$rows_left_out":513}
{"sheet":"Bulk Deals","index":4,"n_rows":51,"n_cols":8,"rows_kept":51,"merged":[[4,0,4,1],[4,2,4,3],[6,1,6,2]]}
[" "]
[]
[]
[]
[]
[{"$nulls":4},"Back To Main Page"]
["Subject :","BULK DEAL",null,{"$f":"Main!B10","v":"2019-08-03"}]
[]
["Date","Scrip code","Scrip Name","Client Name","Buy / Sell","Quantity Traded","Trade Price / Wt.Avg.trade price","Exchange  "]
["2019-08-02",522073,"HITECHGEAR","HITEN ANANTRAI SHETH","BUY",{"v":195000,"d":"195,000"},170.93,"BSE"]
["2019-08-02",539225,"JIYAECO","SANTOSH KUMAR AGARWAL","BUY",{"v":228806,"d":"228,806"},49.24,"BSE"]
["2019-08-02",539225,"JIYAECO","SANTOSH KUMAR AGARWAL","SELL",{"v":228806,"d":"228,806"},49.43,"BSE"]
["2019-08-02",503772,"MODWOOL","LIFE INSURANCE CORPORATION OF INDIA","SELL",{"v":5108,"d":"5,108"},22.5,"BSE"]
["2019-08-02",503772,"MODWOOL","SHRIHAS PANDHARKAR","BUY",{"v":5000,"d":"5,000"},22.5,"BSE"]
["2019-08-02",540243,"NEWLIGHT","MANISH NITIN THAKUR","BUY",{"v":2000,"d":"2,000"},34,"BSE"]
["2019-08-02",540243,"NEWLIGHT","MANISH NITIN THAKUR","SELL",{"v":11582,"d":"11,582"},35.44,"BSE"]
["2019-08-02",530367,"NRBBEARING","BAJAJ FINANCE LIMITED","SELL",{"v":608891,"d":"608,891"},{"v":76.1,"d":"76.10"},"BSE"]
["2019-08-02",536659,"PVVINFRA","CTIL MEDIA PRIVATE LIMITED","BUY",{"v":70000,"d":"70,000"},23.95,"BSE"]
["2019-08-02",536659,"PVVINFRA","GKML SOFTWARE TECHNOLOGIES PRIVATE LIMITED","SELL",{"v":70000,"d":"70,000"},23.95,"BSE"]
["2019-08-02",539814,"RADHEY","RAJESH SHANTILAL VAKHARIA","BUY",{"v":19051,"d":"19,051"},17.57,"BSE"]
{"$rows_left_out":32}
{"sheet":"Call Tracker (Equity & F&O)","index":5,"n_rows":248,"n_cols":18,"rows_kept":248,"merged":[[54,0,55,0],[54,1,55,1],[54,9,55,9],[54,11,55,11],[54,12,55,12],[54,13,55,13],[54,14,55,14],[56,0,57,0],[56,1,57,1],[56,9,57,9],[56,11,57,11],[56,12,57,12],[56,13,57,13],[56,14,57,14]]}
[]
[]
[]
[]
[{"$nulls":12},"Back To Main Page"]
["Retail Research Technical Calls & Fundamental Performance Report for the month of August-2019 "]
[{"$nulls":12},{"$f":"Main!B10","v":"2019-08-03"}]
[null,"Positional  Call"]
["Sr.no","Date",null,"Company","Rec","Rec Price","Stop Loss***","Call Closed At","Target","Remark","Profit / Loss per Share","Gain / Loss  %","Status","Closed Date","NSE Closed Price"]
[1,"2019-07-10",null,"TCS","Buy",2110,1973,2211,"2295-2345","Profit of Rs.101/-",{"$f":"H10-F10","v":101},{"$f":"K10/F10","v":{"v":0.047867298578199054,"d":"4.79%"}},"Successful","2019-08-01",{"$nulls":3},"H"]
[2,"2019-07-12",null,"LT","Buy<>",1457,1353,1352.5,"1630-1680","Loss of Rs.104.50/-",{"$f":"H11-F11","v":-104.5},{"$f":"K11/F11","v":{"v":-0.07172271791352093,"d":"-7.17%"}},"Unsuccessful","2019-08-01",{"$nulls":3},"H"]
[3,"2019-07-17",null,"BHARTIARTL","Buy","347-349",322,null,"392 -396","Open",{"$nulls":4},{"$f":"VLOOKUP(D12,Sheet2!A14:M1653,6,0)","v":343.55},null,null,"R"]
[4,"2019-07-18",null,"NAVINFLUOR","Buy",612,570,647,"680 -700","Profit of Rs.35/-",{"$f":"H13-F13","v":35},{"$f":"K13/F13","v":{"v":0.05718954248366013,"d":"5.72%"}},"Successful","2019-08-02",{"$nulls":3},"H"]
[5,"2019-07-19",null,"ACC","Buy",1620,1518,1515,"1750-1800","Loss of Rs.105/-",-105,{"v":-0.06481481481481481,"d":"-6.48%"},"Unsuccessful","2019-08-01",{"$nulls":3},"H"]
[6,"2019-07-22",null,"MOTHERSUMI","Buy","109-111",103,null,"121-123","Open",{"$nulls":4},{"$f":"VLOOKUP(D15,Sheet2!A18:M1657,6,0)","v":103},null,null,"R"]
[7,"2019-07-26",null,"M&M","Buy","550-555",530,null,"590-600","Open",{"$nulls":4},{"$f":"VLOOKUP(D16,Sheet2!A19:M1658,6,0)","v":556.45},null,null,"H"]
[8,"2019-07-26",null,"GLENMARK","Buy","424-427",395,null,"490-500","Open",{"$nulls":4},{"$f":"VLOOKUP(D17,Sheet2!A20:M1659,6,0)","v":424.95},null,null,"H"]
[9,"2019-07-31",null,"BANKBARODA","Buy","105.50-107.50",99,null,"120-122","Open",{"$nulls":4},{"$f":"VLOOKUP(D18,Sheet2!A21:M1660,6,0)","v":104.9},null,null,"H"]
[10,"2019-08-01",null,"WIPRO","Sell",276,292,265,"250-240","Profit of Rs.11/-",{"$f":"F19-H19","v":11},{"$f":"K19/F19","v":{"v":0.03985507246376811,"d":"3.99%"}},"Successful","2019-08-02",{"$nulls":3},"H"]
[11,"2019-08-01",null,"TATASTEEL","Buy","427-430",405,null,"470-475","Open",{"$nulls":4},{"$f":"VLOOKUP(D20,Sheet2!A23:M1662,6,0)","v":409.1},null,null,"R"]
{"$rows_left_out":205}
{"sheet":"Sheet2","index":6,"n_rows":1899,"n_cols":14,"rows_kept":1899,"hidden":true}
["SYMBOL","SERIES","OPEN","HIGH","LOW","CLOSE","LAST","PREVCLOSE","TOTTRDQTY","TOTTRDVAL","TIMESTAMP","TOTALTRADES","ISIN","ISIN"]
["20MICRONS","EQ",33.35,34.4,32.55,33.55,34.2,33.35,36902,1224396.15,"2019-08-02",225,"INE144J01027"]
["21STCENMGM","EQ",14.5,14.5,14.5,14.5,14.5,14.75,111,1609.5,"2019-08-02",4,"INE253B01015"]
["3IINFOTECH","EQ",2.3,2.35,2.15,2.2,2.25,2.25,2365169,5296892.7,"2019-08-02",1144,"INE748C01020"]
["3MINDIA","EQ",20733.25,20964.3,20506.05,20842.65,20800,20704.1,727,15072744.65,"2019-08-02",378,"INE470A01017"]
["3PLAND","EQ",7.25,7.6,7.25,7.6,7.6,7.25,274,2034.45,"2019-08-02",2,"INE105C01023"]
["5PAISA","EQ",160,162,154,159.35,158,161.3,7757,1225617.65,"2019-08-02",502,"INE618L01018"]
["63MOONS","EQ",100,104.9,98,100.6,99.45,100.15,226709,23085578.55,"2019-08-02",2553,"INE111B01023"]
["8KMILES","EQ",51.55,56.95,51.55,56.95,56.95,54.25,248255,13549077.9,"2019-08-02",2126,"INE650K01021"]
["A2ZINFRA","EQ",10.2,10.7,9.85,10.55,10.65,10.15,302001,3073259.9,"2019-08-02",469,"INE619I01012"]
["AARTIDRUGS","EQ",450.5,453.3,441.35,442.3,442,453.35,14645,6567768.5,"2019-08-02",613,"INE767A01016"]
["AARTIIND","EQ",1667,1709.05,1640.05,1666.85,1670,1666.65,44896,75002017.65,"2019-08-02",6620,"INE769A01020"]
["AARVEEDEN","EQ",16.4,16.95,15.05,16.75,16.65,15.35,5179,84573.9,"2019-08-02",106,"INE273D01019"]
["AAVAS","EQ",1450,1475,1420.3,1467.85,1470,1466.5,14439,20997954.3,"2019-08-02",1588,"INE216P01012"]
["ABAN","EQ",27.3,28,26.75,26.8,26.75,28.15,107580,2907337.8,"2019-08-02",1679,"INE421A01028"]
["ABB","EQ",1355.5,1390,1340,1367.8,1374,1352.65,45918,62311246.8,"2019-08-02",3601,"INE117A01022"]
["ABBOTINDIA","EQ",8485,8529,8351.25,8499.3,8455,8447.95,3332,28119075.2,"2019-08-02",555,"INE358A01014"]
["ABCAPITAL","EQ",82,83,80.1,81.7,82.4,82.4,955173,78061651.95,"2019-08-02",13836,"INE674K01013"]
["ABFRL","EQ",185.1,188.3,181.5,187.75,187.65,187.25,754440,140630176.15,"2019-08-02",36450,"INE647O01011"]
["ABSLNN50ET","EQ",259.7,259.7,254.5,257.41,257.41,261.16,10372,2645034.67,"2019-08-02",20,"INF209KB1B87"]
{"$rows_left_out":1684}
{"sheet":"Sheet1","index":7,"n_rows":0,"n_cols":0,"rows_kept":0,"hidden":true}

{"sheet":"Sheet3","index":8,"n_rows":0,"n_cols":0,"rows_kept":0,"hidden":true}

{"sheet":"Sheet4","index":9,"n_rows":0,"n_cols":0,"rows_kept":0,"hidden":true}