{"text_format":"3","workbook":"xlsx","n_sheets":6,"sheets":["Main","Future Intra","Cash Intra","MidCap Intra","Bulk Deals","Call Tracker (Equity & F&O)"],"not_rendered":{"images":2,"defined_names":3},"read":"whole","date_system":"1900"}

{"sheet":"Main","index":0,"n_rows":27,"n_cols":11,"rows_kept":27}
[null,"                                                                                                 "]
{"$rows_empty":8}
[null,"2023-06-05"]
[]
[null,"Sheet No.","Template Name","Summary"]
[null,1,"Future Intra","For Intraday trading in F&O segment"]
[null,2,"Cash Intra","For Intraday trading in cash market segment"]
[null,3,"Mid-cap Intra","For Intraday trading in Mid-cap stocks"]
[null,4,"Bulk Deals","Reveals Bulk Deals carried on NSE & BSE"]
[null,5,"Call Tracker"]
{"$rows_empty":9}
[{"$nulls":10},"`"]

{"sheet":"Future Intra","index":1,"n_rows":236,"n_cols":16,"rows_kept":236,"merged":[[8,0,9,0],[8,1,9,1],[8,2,9,2],[8,3,9,3],[8,6,8,8],[8,9,8,11]]}
[]
[]
[]
[]
[{"$nulls":12},"Back to Main Page"]
["FOR INTRA DAY TRADING",{"$nulls":10},{"$f":"Main!B10","v":"2023-06-05"}]
[]
[]
["Sr.no","Sector","Scrip","Expiry Date","CLOSE RATE","Pivot Point","Supports",null,null,"Resistances"]
[{"$nulls":4},"Point","Point","S1","S2","S3","R1","R2","R3","HIGH","LOW","OI","% Change in OI"]
[1,"Index","NIFTY","2023-06-29",18635.95,{"v":18622.6,"d":"18622.60"},{"v":18569.699999999997,"d":"18569.70"},{"v":18503.449999999997,"d":"18503.45"},{"v":18450.549999999996,"d":"18450.55"},18688.85,18741.75,{"v":18808,"d":"18808.00"},18675.5,18556.35,10022300,{"v":0.027727929941857483,"d":"2.77%"}]
[2,"Index","BANKNIFTY","2023-06-29",{"v":44110.6,"d":"44110.60"},{"v":44110.68333333333,"d":"44110.68"},{"v":43949.91666666666,"d":"43949.92"},{"v":43789.23333333333,"d":"43789.23"},{"v":43628.46666666666,"d":"43628.47"},{"v":44271.366666666654,"d":"44271.37"},{"v":44432.13333333333,"d":"44432.13"},{"v":44592.81666666665,"d":"44592.82"},44271.45,43950,2501395,{"v":0.021127594258748224,"d":"2.11%"}]
[3,"Index","FINNIFTY","2023-06-27",19482.65,19477.55,{"v":19421.1,"d":"19421.10"},19359.55,{"v":19303.1,"d":"19303.10"},{"v":19539.1,"d":"19539.10"},{"v":19595.550000000003,"d":"19595.55"},{"v":19657.1,"d":"19657.10"},19534,19416,44520,{"v":0.1557632398753894,"d":"15.58%"}]
[4,"Index","MIDCPNIFTY","2023-06-27",{"v":7893,"d":"7893.00"},{"v":7885.333333333333,"d":"7885.33"},{"v":7871.666666666666,"d":"7871.67"},{"v":7850.333333333333,"d":"7850.33"},{"v":7836.666666666666,"d":"7836.67"},{"v":7906.666666666666,"d":"7906.67"},{"v":7920.333333333332,"d":"7920.33"},{"v":7941.666666666666,"d":"7941.67"},7899,7864,1050,{"v":0.2727272727272727,"d":"27.27%"}]
[5,"Chemical","AARTIIND","2023-06-29",517.45,{"v":519.0333333333333,"d":"519.03"},{"v":514.0666666666666,"d":"514.07"},{"v":510.6833333333333,"d":"510.68"},{"v":505.7166666666666,"d":"505.72"},{"v":522.4166666666666,"d":"522.42"},{"v":527.3833333333333,"d":"527.38"},{"v":530.7666666666667,"d":"530.77"},524,515.65,5452200,{"v":0.02522541157003037,"d":"2.52%"}]
[6,"Capital_Goods","ABB","2023-06-29",{"v":4022,"d":"4022.00"},{"v":3995.5,"d":"3995.50"},{"v":3962,"d":"3962.00"},{"v":3902,"d":"3902.00"},{"v":3868.5,"d":"3868.50"},{"v":4055.5,"d":"4055.50"},{"v":4089,"d":"4089.00"},{"v":4149,"d":"4149.00"},4029,3935.5,1442000,{"v":-0.00534574926711502,"d":"-0.53%"}]
[7,"Pharma","ABBOTINDIA","2023-06-29",{"v":22097.4,"d":"22097.40"},{"v":21954.13333333333,"d":"21954.13"},{"v":21761.266666666663,"d":"21761.27"},{"v":21425.13333333333,"d":"21425.13"},{"v":21232.266666666663,"d":"21232.27"},{"v":22290.266666666663,"d":"22290.27"},{"v":22483.13333333333,"d":"22483.13"},{"v":22819.266666666663,"d":"22819.27"},22147,21618,70880,{"v":0.040516735173223725,"d":"4.05%"}]
[8,"Others","ABCAPITAL","2023-06-29",{"v":173.9,"d":"173.90"},{"v":174.63333333333333,"d":"174.63"},{"v":171.41666666666666,"d":"171.42"},{"v":168.93333333333334,"d":"168.93"},{"v":165.71666666666667,"d":"165.72"},{"v":177.11666666666665,"d":"177.12"},{"v":180.33333333333334,"d":"180.33"},{"v":182.81666666666663,"d":"182.82"},177.85,172.15,30418200,{"v":0.04936661698956781,"d":"4.94%"}]
[9,"Textile","ABFRL","2023-06-29",203.75,{"v":204.29999999999998,"d":"204.30"},{"v":202.69999999999996,"d":"202.70"},{"v":201.64999999999998,"d":"201.65"},{"v":200.04999999999995,"d":"200.05"},{"v":205.34999999999997,"d":"205.35"},206.95,{"v":207.99999999999997,"d":"208.00"},205.9,203.25,28722200,{"v":0.005003639010189229,"d":"0.50%"}]
[10,"Cement","ACC","2023-06-29",{"v":1823.9,"d":"1823.90"},{"v":1816.2833333333335,"d":"1816.28"},{"v":1805.066666666667,"d":"1805.07"},{"v":1786.2333333333336,"d":"1786.23"},{"v":1775.016666666667,"d":"1775.02"},{"v":1835.116666666667,"d":"1835.12"},{"v":1846.3333333333337,"d":"1846.33"},{"v":1865.166666666667,"d":"1865.17"},1827.5,1797.45,4674200,{"v":-0.07400326878312119,"d":"-7.40%"}]
[11,"Others","ADANIENT","2023-06-29",2462.75,{"v":2485.2000000000003,"d":"2485.20"},{"v":2420.4000000000005,"d":"2420.40"},2378.05,{"v":2313.2500000000005,"d":"2313.25"},{"v":2527.5500000000006,"d":"2527.55"},{"v":2592.350000000001,"d":"2592.35"},{"v":2634.7000000000007,"d":"2634.70"},2550,2442.85,9824600,{"v":0.04746013892072563,"d":"4.75%"}]
[12,"Others","ADANIPORTS","2023-06-29",739.85,{"v":741.6666666666666,"d":"741.67"},{"v":735.7333333333332,"d":"735.73"},{"v":731.6166666666666,"d":"731.62"},{"v":725.6833333333332,"d":"725.68"},{"v":745.7833333333333,"d":"745.78"},{"v":751.7166666666667,"d":"751.72"},{"v":755.8333333333334,"d":"755.83"},747.6,737.55,37205150,{"v":-0.040712507557855465,"d":"-4.07%"}]
[13,"Pharma","ALKEM","2023-06-29",3391.75,{"v":3390.3333333333335,"d":"3390.33"},{"v":3370.166666666667,"d":"3370.17"},{"v":3348.5833333333335,"d":"3348.58"},{"v":3328.416666666667,"d":"3328.42"},{"v":3411.916666666667,"d":"3411.92"},{"v":3432.083333333334,"d":"3432.08"},{"v":3453.666666666667,"d":"3453.67"},3410.5,3368.75,592000,{"v":0.0281347690170198,"d":"2.81%"}]
[14,"Cement","AMBUJACEM","2023-06-29",440.15,{"v":439.1666666666667,"d":"439.17"},{"v":435.03333333333336,"d":"435.03"},{"v":429.9166666666667,"d":"429.92"},{"v":425.78333333333336,"d":"425.78"},{"v":444.28333333333336,"d":"444.28"},{"v":448.4166666666667,"d":"448.42"},{"v":453.53333333333336,"d":"453.53"},443.3,434.05,58953600,{"v":8.436480078822587E-3,"d":"0.84%"}]
[15,"Others","APOLLOHOSP","2023-06-29",4992.05,{"v":4949.866666666668,"d":"4949.87"},{"v":4876.633333333335,"d":"4876.63"},{"v":4761.216666666667,"d":"4761.22"},{"v":4687.9833333333345,"d":"4687.98"},{"v":5065.283333333336,"d":"5065.28"},{"v":5138.516666666667,"d":"5138.52"},{"v":5253.933333333336,"d":"5253.93"},5023.1,4834.45,2192250,{"v":0.014578271433530025,"d":"1.46%"}]
[16,"Automobile","APOLLOTYRE","2023-06-29",391.15,389.75,{"v":387.8,"d":"387.80"},384.45,{"v":382.5,"d":"382.50"},{"v":393.1,"d":"393.10"},{"v":395.05000000000007,"d":"395.05"},{"v":398.40000000000003,"d":"398.40"},391.7,386.4,12975600,{"v":-0.01015356213812201,"d":"-1.02%"}]
[17,"Automobile","ASHOKLEY","2023-06-29",{"v":147,"d":"147.00"},{"v":146.6,"d":"146.60"},{"v":145.39999999999998,"d":"145.40"},{"v":143.79999999999998,"d":"143.80"},{"v":142.59999999999997,"d":"142.60"},{"v":148.2,"d":"148.20"},{"v":149.39999999999998,"d":"149.40"},{"v":151,"d":"151.00"},147.8,145,70465000,{"v":-2.4773499433748585E-3,"d":"-0.25%"}]
[18,"FMCG","ASIANPAINT","2023-06-29",3235.35,{"v":3228.933333333333,"d":"3228.93"},{"v":3213.866666666666,"d":"3213.87"},{"v":3192.3833333333328,"d":"3192.38"},{"v":3177.3166666666657,"d":"3177.32"},{"v":3250.416666666666,"d":"3250.42"},{"v":3265.4833333333327,"d":"3265.48"},{"v":3286.9666666666662,"d":"3286.97"},3244,3207.45,5223600,{"v":1.2650948821161588E-3,"d":"0.13%"}]
[19,"Others","ASTRAL","2023-06-29",1874.75,{"v":1862.5666666666668,"d":"1862.57"},{"v":1835.3333333333337,"d":"1835.33"},{"v":1795.916666666667,"d":"1795.92"},{"v":1768.6833333333338,"d":"1768.68"},{"v":1901.9833333333336,"d":"1901.98"},{"v":1929.2166666666667,"d":"1929.22"},{"v":1968.6333333333334,"d":"1968.63"},1889.8,1823.15,1565989,{"v":-0.016140189070786258,"d":"-1.61%"}]
[20,"Others","ATUL","2023-06-29",6763.75,{"v":6793.716666666667,"d":"6793.72"},{"v":6697.433333333334,"d":"6697.43"},{"v":6631.116666666667,"d":"6631.12"},{"v":6534.833333333334,"d":"6534.83"},{"v":6860.033333333335,"d":"6860.03"},{"v":6956.3166666666675,"d":"6956.32"},{"v":7022.633333333335,"d":"7022.63"},6890,6727.4,198000,{"v":0.007633587786259542,"d":"0.76%"}]
{"$rows_left_out":192}
{"sheet":"Cash Intra","index":2,"n_rows":246,"n_cols":13,"rows_kept":246,"merged":[[7,0,8,0],[7,1,8,1],[7,2,8,2],[7,3,8,3],[7,4,7,6],[7,7,7,9]]}
[]
[]
[]
[]
[{"$nulls":12},"Back to Main Page"]
["FOR INTRA DAY TRADING",{"$nulls":9},{"$f":"Main!B10","v":"2023-06-05"}]
[]
["Sr.no",null,"CLOSE RATE","Pivot Point","Supports",null,null,"Resistances"]
[{"$nulls":4},"S1","S2","S3","R1","R2","R3","HIGH","LOW","Total Trade Quanity in Lakhs"]
[1,"Nifty 50",{"v":18534.1,"d":"18534.10"},{"v":18528.733333333334,"d":"18528.73"},{"v":18483.766666666666,"d":"18483.77"},{"v":18433.433333333334,"d":"18433.43"},{"v":18388.466666666667,"d":"18388.47"},{"v":18579.066666666666,"d":"18579.07"},{"v":18624.033333333333,"d":"18624.03"},{"v":18674.366666666665,"d":"18674.37"},{"v":18573.7,"d":"18573.70"},{"v":18478.4,"d":"18478.40"}]
[2,"Nifty Bank",43937.85,{"v":43946.43333333333,"d":"43946.43"},{"v":43803.96666666665,"d":"43803.97"},{"v":43670.08333333333,"d":"43670.08"},{"v":43527.616666666654,"d":"43527.62"},{"v":44080.31666666665,"d":"44080.32"},{"v":44222.783333333326,"d":"44222.78"},{"v":44356.66666666665,"d":"44356.67"},{"v":44088.9,"d":"44088.90"},43812.55]
[3,"Nifty CPSE",3074.85,{"v":3073.5,"d":"3073.50"},3066.25,3057.65,{"v":3050.4,"d":"3050.40"},{"v":3082.1,"d":"3082.10"},3089.35,3097.95,3080.75,{"v":3064.9,"d":"3064.90"}]
[4,"Nifty Infra",{"v":5472.4,"d":"5472.40"},{"v":5468.766666666666,"d":"5468.77"},{"v":5457.383333333333,"d":"5457.38"},{"v":5442.366666666667,"d":"5442.37"},{"v":5430.983333333334,"d":"5430.98"},{"v":5483.783333333333,"d":"5483.78"},{"v":5495.166666666666,"d":"5495.17"},{"v":5510.1833333333325,"d":"5510.18"},5480.15,5453.75]
[5,"Nifty IT",29328.15,{"v":29383.61666666667,"d":"29383.62"},{"v":29217.083333333336,"d":"29217.08"},{"v":29106.016666666666,"d":"29106.02"},{"v":28939.483333333334,"d":"28939.48"},{"v":29494.683333333338,"d":"29494.68"},{"v":29661.21666666667,"d":"29661.22"},{"v":29772.28333333334,"d":"29772.28"},29550.15,29272.55]
[6,"Nifty PSE",{"v":4798.7,"d":"4798.70"},{"v":4797.566666666667,"d":"4797.57"},{"v":4787.183333333333,"d":"4787.18"},{"v":4775.666666666667,"d":"4775.67"},{"v":4765.283333333334,"d":"4765.28"},{"v":4809.083333333333,"d":"4809.08"},{"v":4819.466666666666,"d":"4819.47"},{"v":4830.983333333333,"d":"4830.98"},4807.95,4786.05]
[7,"Nifty Midcap 50",9629.65,9618.15,{"v":9598.5,"d":"9598.50"},9567.35,{"v":9547.7,"d":"9547.70"},{"v":9649.3,"d":"9649.30"},{"v":9668.949999999997,"d":"9668.95"},{"v":9700.099999999999,"d":"9700.10"},{"v":9637.8,"d":"9637.80"},{"v":9587,"d":"9587.00"}]
[8,"ABB",4021.55,{"v":3996.0833333333335,"d":"3996.08"},{"v":3963.966666666667,"d":"3963.97"},{"v":3906.3833333333337,"d":"3906.38"},{"v":3874.2666666666673,"d":"3874.27"},{"v":4053.666666666667,"d":"4053.67"},{"v":4085.783333333333,"d":"4085.78"},{"v":4143.366666666667,"d":"4143.37"},4028.2,3938.5,3.97566]
[9,"ACC",1815.6,{"v":1808.2833333333335,"d":"1808.28"},{"v":1797.566666666667,"d":"1797.57"},{"v":1779.5333333333335,"d":"1779.53"},{"v":1768.816666666667,"d":"1768.82"},{"v":1826.316666666667,"d":"1826.32"},{"v":1837.0333333333338,"d":"1837.03"},{"v":1855.066666666667,"d":"1855.07"},1819,1790.25,8.19953]
[10,"AUBANK",773.45,{"v":774.1166666666668,"d":"774.12"},{"v":768.2833333333335,"d":"768.28"},{"v":763.1166666666668,"d":"763.12"},{"v":757.2833333333335,"d":"757.28"},{"v":779.2833333333335,"d":"779.28"},{"v":785.1166666666668,"d":"785.12"},{"v":790.2833333333335,"d":"790.28"},779.95,768.95,19.27608]
[11,"ABBOTINDIA",21927.25,{"v":21808.733333333334,"d":"21808.73"},{"v":21621.516666666666,"d":"21621.52"},{"v":21315.783333333333,"d":"21315.78"},{"v":21128.566666666666,"d":"21128.57"},{"v":22114.466666666667,"d":"22114.47"},{"v":22301.683333333334,"d":"22301.68"},{"v":22607.416666666668,"d":"22607.42"},21995.95,21503,0.10784]
[12,"ADANIENT",2445.05,2469.65,{"v":2400.4,"d":"2400.40"},2355.75,{"v":2286.5,"d":"2286.50"},{"v":2514.3,"d":"2514.30"},2583.55,{"v":2628.2000000000003,"d":"2628.20"},2538.9,2425,55.43791]
[13,"ADANIGREEN",983.55,{"v":983.8166666666666,"d":"983.82"},{"v":975.6333333333332,"d":"975.63"},{"v":967.7166666666666,"d":"967.72"},{"v":959.5333333333332,"d":"959.53"},{"v":991.7333333333332,"d":"991.73"},{"v":999.9166666666666,"d":"999.92"},{"v":1007.8333333333333,"d":"1007.83"},992,975.9,37.07803]
[14,"ADANIPORTS",736.6,{"v":738.1999999999999,"d":"738.20"},{"v":732.3999999999999,"d":"732.40"},{"v":728.1999999999999,"d":"728.20"},{"v":722.3999999999999,"d":"722.40"},{"v":742.3999999999999,"d":"742.40"},{"v":748.1999999999998,"d":"748.20"},{"v":752.3999999999999,"d":"752.40"},744,734,55.54473]
[15,"ATGL",674.4,{"v":681.6,"d":"681.60"},{"v":660.8000000000001,"d":"660.80"},{"v":647.2,"d":"647.20"},{"v":626.4000000000001,"d":"626.40"},{"v":695.2,"d":"695.20"},{"v":716,"d":"716.00"},{"v":729.6,"d":"729.60"},702.4,668,43.73895]
[16,"ADANITRANS",794.65,{"v":808.1999999999999,"d":"808.20"},{"v":777.6999999999998,"d":"777.70"},{"v":760.7499999999999,"d":"760.75"},{"v":730.2499999999998,"d":"730.25"},{"v":825.1499999999999,"d":"825.15"},{"v":855.6500000000001,"d":"855.65"},{"v":872.5999999999999,"d":"872.60"},838.7,791.25,29.33]
[17,"AWL",437.55,{"v":440.0833333333333,"d":"440.08"},{"v":433.46666666666664,"d":"433.47"},{"v":429.3833333333333,"d":"429.38"},{"v":422.76666666666665,"d":"422.77"},{"v":444.16666666666663,"d":"444.17"},{"v":450.7833333333333,"d":"450.78"},{"v":454.8666666666666,"d":"454.87"},446.7,436,12.15288]
[18,"ABCAPITAL",172.55,{"v":173.73333333333335,"d":"173.73"},{"v":170.8666666666667,"d":"170.87"},{"v":169.18333333333337,"d":"169.18"},{"v":166.31666666666672,"d":"166.32"},{"v":175.41666666666669,"d":"175.42"},{"v":178.28333333333336,"d":"178.28"},{"v":179.96666666666667,"d":"179.97"},176.6,172.05,66.48877]
[19,"ABFRL",202.6,{"v":203.23333333333335,"d":"203.23"},{"v":201.5666666666667,"d":"201.57"},{"v":200.53333333333333,"d":"200.53"},{"v":198.86666666666667,"d":"198.87"},{"v":204.2666666666667,"d":"204.27"},{"v":205.93333333333334,"d":"205.93"},{"v":206.96666666666673,"d":"206.97"},204.9,202.2,16.76562]
[20,"ALKEM",3363.75,{"v":3367.316666666667,"d":"3367.32"},{"v":3337.533333333334,"d":"3337.53"},{"v":3311.316666666667,"d":"3311.32"},{"v":3281.533333333334,"d":"3281.53"},{"v":3393.533333333334,"d":"3393.53"},{"v":3423.316666666667,"d":"3423.32"},{"v":3449.533333333334,"d":"3449.53"},3397.1,3341.1,0.63221]
[21,"AMBUJACEM",438.05,{"v":436.5,"d":"436.50"},{"v":433,"d":"433.00"},427.95,424.45,441.55,445.05,{"v":450.1,"d":"450.10"},440,431.45,54.25758]
{"$rows_left_out":217}
{"sheet":"MidCap Intra","index":3,"n_rows":532,"n_cols":13,"rows_kept":532,"merged":[[0,0,0,1],[8,0,9,0],[8,1,9,1],[8,2,9,2],[8,3,9,3],[8,4,8,6],[8,7,8,9]]}
[]
[]
[]
[]
[{"$nulls":11},"Back To Main Page"]
["FOR INTRA DAY TRADING",{"$nulls":9},{"$f":"Main!B10","v":"2023-06-05"}]
[null,null," "]
[]
["Sr.no","Scrip","CLOSE RATE","Pivot Point","Supports",null,null,"Resistances"]
[{"$nulls":4},"S1","S2","S3","R1","R2","R3","HIGH","LOW","Total Trade Quanity in Lakhs"]
[1,"360ONE",419.1,{"v":420.40000000000003,"d":"420.40"},{"v":414.80000000000007,"d":"414.80"},{"v":410.50000000000006,"d":"410.50"},{"v":404.9000000000001,"d":"404.90"},{"v":424.70000000000005,"d":"424.70"},{"v":430.30000000000007,"d":"430.30"},{"v":434.6,"d":"434.60"},426,416.1,2.69471]
[2,"3MINDIA",26253.95,{"v":26270.433333333334,"d":"26270.43"},{"v":26038.966666666667,"d":"26038.97"},{"v":25823.983333333334,"d":"25823.98"},{"v":25592.516666666666,"d":"25592.52"},{"v":26485.416666666668,"d":"26485.42"},{"v":26716.883333333335,"d":"26716.88"},{"v":26931.86666666667,"d":"26931.87"},26501.9,26055.45,0.0507]
[3,"ABB",4021.55,{"v":3996.0833333333335,"d":"3996.08"},{"v":3963.966666666667,"d":"3963.97"},{"v":3906.3833333333337,"d":"3906.38"},{"v":3874.2666666666673,"d":"3874.27"},{"v":4053.666666666667,"d":"4053.67"},{"v":4085.783333333333,"d":"4085.78"},{"v":4143.366666666667,"d":"4143.37"},4028.2,3938.5,3.97566]
[4,"ACC",1815.6,{"v":1808.2833333333335,"d":"1808.28"},{"v":1797.566666666667,"d":"1797.57"},{"v":1779.5333333333335,"d":"1779.53"},{"v":1768.816666666667,"d":"1768.82"},{"v":1826.316666666667,"d":"1826.32"},{"v":1837.0333333333338,"d":"1837.03"},{"v":1855.066666666667,"d":"1855.07"},1819,1790.25,8.19953]
[5,"AIAENG",3058.35,{"v":3042.2333333333336,"d":"3042.23"},{"v":3010.466666666667,"d":"3010.47"},{"v":2962.5833333333335,"d":"2962.58"},{"v":2930.816666666667,"d":"2930.82"},{"v":3090.1166666666672,"d":"3090.12"},{"v":3121.8833333333337,"d":"3121.88"},{"v":3169.7666666666673,"d":"3169.77"},3074,2994.35,0.85352]
[6,"APLAPOLLO",1135.45,{"v":1134.2833333333333,"d":"1134.28"},{"v":1125.5666666666666,"d":"1125.57"},{"v":1115.6833333333334,"d":"1115.68"},{"v":1106.9666666666667,"d":"1106.97"},{"v":1144.1666666666665,"d":"1144.17"},{"v":1152.8833333333332,"d":"1152.88"},{"v":1162.7666666666664,"d":"1162.77"},1143,1124.4,5.39678]
[7,"AUBANK",773.45,{"v":774.1166666666668,"d":"774.12"},{"v":768.2833333333335,"d":"768.28"},{"v":763.1166666666668,"d":"763.12"},{"v":757.2833333333335,"d":"757.28"},{"v":779.2833333333335,"d":"779.28"},{"v":785.1166666666668,"d":"785.12"},{"v":790.2833333333335,"d":"790.28"},779.95,768.95,19.27608]
[8,"AARTIDRUGS",456.35,{"v":455.26666666666665,"d":"455.27"},{"v":451.6333333333333,"d":"451.63"},{"v":446.9166666666667,"d":"446.92"},{"v":443.28333333333336,"d":"443.28"},{"v":459.9833333333333,"d":"459.98"},{"v":463.6166666666666,"d":"463.62"},{"v":468.33333333333326,"d":"468.33"},458.9,450.55,1.20933]
[9,"AAVAS",1394.05,{"v":1394,"d":"1394.00"},{"v":1386,"d":"1386.00"},1377.95,1369.95,1402.05,1410.05,{"v":1418.1,"d":"1418.10"},1402,1385.95,1.87697]
[10,"ABBOTINDIA",21927.25,{"v":21808.733333333334,"d":"21808.73"},{"v":21621.516666666666,"d":"21621.52"},{"v":21315.783333333333,"d":"21315.78"},{"v":21128.566666666666,"d":"21128.57"},{"v":22114.466666666667,"d":"22114.47"},{"v":22301.683333333334,"d":"22301.68"},{"v":22607.416666666668,"d":"22607.42"},21995.95,21503,0.10784]
[11,"ADANIENT",2445.05,2469.65,{"v":2400.4,"d":"2400.40"},2355.75,{"v":2286.5,"d":"2286.50"},{"v":2514.3,"d":"2514.30"},2583.55,{"v":2628.2000000000003,"d":"2628.20"},2538.9,2425,55.43791]
[12,"ADANIGREEN",983.55,{"v":983.8166666666666,"d":"983.82"},{"v":975.6333333333332,"d":"975.63"},{"v":967.7166666666666,"d":"967.72"},{"v":959.5333333333332,"d":"959.53"},{"v":991.7333333333332,"d":"991.73"},{"v":999.9166666666666,"d":"999.92"},{"v":1007.8333333333333,"d":"1007.83"},992,975.9,37.07803]
[13,"ADANIPORTS",736.6,{"v":738.1999999999999,"d":"738.20"},{"v":732.3999999999999,"d":"732.40"},{"v":728.1999999999999,"d":"728.20"},{"v":722.3999999999999,"d":"722.40"},{"v":742.3999999999999,"d":"742.40"},{"v":748.1999999999998,"d":"748.20"},{"v":752.3999999999999,"d":"752.40"},744,734,55.54473]
[14,"ATGL",674.4,{"v":681.6,"d":"681.60"},{"v":660.8000000000001,"d":"660.80"},{"v":647.2,"d":"647.20"},{"v":626.4000000000001,"d":"626.40"},{"v":695.2,"d":"695.20"},{"v":716,"d":"716.00"},{"v":729.6,"d":"729.60"},702.4,668,43.73895]
[15,"ADANITRANS",794.65,{"v":808.1999999999999,"d":"808.20"},{"v":777.6999999999998,"d":"777.70"},{"v":760.7499999999999,"d":"760.75"},{"v":730.2499999999998,"d":"730.25"},{"v":825.1499999999999,"d":"825.15"},{"v":855.6500000000001,"d":"855.65"},{"v":872.5999999999999,"d":"872.60"},838.7,791.25,29.33]
[16,"AWL",437.55,{"v":440.0833333333333,"d":"440.08"},{"v":433.46666666666664,"d":"433.47"},{"v":429.3833333333333,"d":"429.38"},{"v":422.76666666666665,"d":"422.77"},{"v":444.16666666666663,"d":"444.17"},{"v":450.7833333333333,"d":"450.78"},{"v":454.8666666666666,"d":"454.87"},446.7,436,12.15288]
[17,"ABCAPITAL",172.55,{"v":173.73333333333335,"d":"173.73"},{"v":170.8666666666667,"d":"170.87"},{"v":169.18333333333337,"d":"169.18"},{"v":166.31666666666672,"d":"166.32"},{"v":175.41666666666669,"d":"175.42"},{"v":178.28333333333336,"d":"178.28"},{"v":179.96666666666667,"d":"179.97"},176.6,172.05,66.48877]
[18,"ABFRL",202.6,{"v":203.23333333333335,"d":"203.23"},{"v":201.5666666666667,"d":"201.57"},{"v":200.53333333333333,"d":"200.53"},{"v":198.86666666666667,"d":"198.87"},{"v":204.2666666666667,"d":"204.27"},{"v":205.93333333333334,"d":"205.93"},{"v":206.96666666666673,"d":"206.97"},204.9,202.2,16.76562]
[19,"ABSLAMC",359.25,{"v":358.2833333333333,"d":"358.28"},{"v":356.0166666666666,"d":"356.02"},{"v":352.7833333333333,"d":"352.78"},{"v":350.5166666666666,"d":"350.52"},{"v":361.5166666666666,"d":"361.52"},{"v":363.78333333333325,"d":"363.78"},{"v":367.0166666666666,"d":"367.02"},360.55,355.05,0.3515]
[20,"AEGISCHEM",333.7,337.85,{"v":325.95000000000005,"d":"325.95"},{"v":318.20000000000005,"d":"318.20"},{"v":306.30000000000007,"d":"306.30"},{"v":345.6,"d":"345.60"},{"v":357.5,"d":"357.50"},365.25,349.75,330.1,12.91793]
{"$rows_left_out":503}
{"sheet":"Bulk Deals","index":4,"n_rows":135,"n_cols":8,"rows_kept":135,"merged":[[4,0,4,1],[4,2,4,3],[6,1,6,2]]}
[" "]
[]
[]
[]
[]
[{"$nulls":4},"Back To Main Page"]
["Subject :","BULK DEAL",null,{"$f":"Main!B10","v":"2023-06-05"}]
[]
["Date","Scrip code","Scrip Name","Client Name","Buy / Sell","Quantity Traded","Trade Price / Wt.Avg.trade price","Exchange  "]
["2023-06-02",539115,"ALAN SCOTT","SURESHKUMAR PUKHRAJ JAIN","BUY",{"v":15067,"d":"15,067"},45.06,"BSE"]
["2023-06-02",539115,"ALAN SCOTT","SUJITH IMMANUEL GEORGE","SELL",{"v":14223,"d":"14,223"},45,"BSE"]
["2023-06-02",517546,"ALFATRAN","RAGHAV KAROL HUF","BUY",{"v":56639,"d":"56,639"},30.5,"BSE"]
["2023-06-02",517546,"ALFATRAN","ALPANA MUNDRA","SELL",{"v":61900,"d":"61,900"},30.5,"BSE"]
["2023-06-02",539277,"ALSTONE","PASCHIM FINANCE & CHIT FUND PVT LTD","SELL",{"v":12843739,"d":"12,843,739"},0.64,"BSE"]
["2023-06-02",537069,"ARNOLD","VAISHALI SHEKHAR CHANNE","SELL",{"v":200000,"d":"200,000"},22.5,"BSE"]
["2023-06-02",537069,"ARNOLD","CHAITANYA DILIP CHANDAN","BUY",{"v":193381,"d":"193,381"},22.5,"BSE"]
["2023-06-02",541865,"ASRL","VIVEK MEHROTRA","SELL",{"v":169998,"d":"169,998"},36.26,"BSE"]
["2023-06-02",538734,"CEINSYSTECH","ZODIUS TECHNOLOGY FUND","SELL",{"v":180000,"d":"180,000"},168.25,"BSE"]
["2023-06-02",543435,"CLARA","ZYANA STOCKS AND COMMODITIES","SELL",{"v":17430,"d":"17,430"},210,"BSE"]
["2023-06-02",533149,"ESSARSEC","ANAND MOHAN","BUY",{"v":73287,"d":"73,287"},5.86,"BSE"]
["2023-06-02",543895,"EXHICON","VIJAY KUMAR PAHWA","BUY",{"v":64000,"d":"64,000"},138.91,"BSE"]
["2023-06-02",532467,"HAZOOR","BP EQUITIES PVT. LTD.","BUY",{"v":50127,"d":"50,127"},161.26,"BSE"]
["2023-06-02",532467,"HAZOOR","BP EQUITIES PVT. LTD.","SELL",{"v":54233,"d":"54,233"},160.6,"BSE"]
["2023-06-02",532467,"HAZOOR","RAUDRAMUKHI COMMERCE PVT LTD","SELL",{"v":65300,"d":"65,300"},161.33,"BSE"]
["2023-06-02",532467,"HAZOOR","WESSEL CONSULTANCY PRIVATE LIMITED","SELL",{"v":75000,"d":"75,000"},161.35,"BSE"]
["2023-06-02",526967,"HEERAISP","SUDHA SHANTILAL SHAH","SELL",{"v":68400,"d":"68,400"},10.88,"BSE"]
["2023-06-02",542935,"ICLORGANIC","KAUSHIK MAHESH WAGHELA","BUY",{"v":34000,"d":"34,000"},66.51,"BSE"]
["2023-06-02",542935,"ICLORGANIC","KAUSHIK MAHESH WAGHELA","SELL",{"v":10000,"d":"10,000"},71.5,"BSE"]
["2023-06-02",542935,"ICLORGANIC","MEGHA DINESH SINGH","SELL",{"v":50000,"d":"50,000"},65.8,"BSE"]
["2023-06-02",542935,"ICLORGANIC","YELLOWSTONE VENTURES LLP","BUY",{"v":60000,"d":"60,000"},67.51,"BSE"]
{"$rows_left_out":106}
{"sheet":"Call Tracker (Equity & F&O)","index":5,"n_rows":257,"n_cols":18,"rows_kept":257}
[]
[]
[]
[]
[{"$nulls":12},"Back To Main Page"]
["Retail Research Technical Calls & Fundamental Performance Report for the month of June-2023"]
[{"$nulls":12},{"$f":"Main!B10","v":"2023-06-05"}]
[null,"Positional  Call"]
["Sr.no","Date",null,"Company","Rec","Rec Price","Stop Loss***","Call Closed At","Target","Remark","Profit / Loss per Share","All charges","Net Gain / Loss  %","Status","Closed Date","Market Closing Price"]
[1,"2023-05-12",null,"SBIN","Accu","562-574",538,null,"600-630","Open",{"$nulls":5},{"$f":"VLOOKUP(D10,'MidCap Intra'!B39:C539,2,0)","v":{"v":587.2,"d":"587.20"}},null,"H"]
[2,"2023-05-22",null,"JSWSTEEL","Accu","665-691",637,null,"740-780","Open",{"$nulls":5},{"$f":"VLOOKUP(D11,'MidCap Intra'!B40:C540,2,0)","v":{"v":706.6,"d":"706.60"}},null,"H"]
[3,"2023-05-31",null,"GSFC","Accu","152-157",144,null,"170-175","Open",{"$nulls":5},{"$f":"VLOOKUP(D12,'MidCap Intra'!B41:C541,2,0)","v":{"v":160.3,"d":"160.30"}},null,"H"]
[]
[]
[]
["CLBS = Closing Basis ***"]
["Dividend adjusted <>",{"$nulls":4},"Reinitiated $"]
["Part book {}",null,null,"s",null,"Revised stoploss #"]
[]
[null,"Momentum Call"]
["Sr.no","Date",null,"Company","Rec","Rec Price","Stop Loss","Call Closed At","Target","Remark","Profit / Loss per Share/Lot","All charges","Net Gain / Loss  %","Status","Closed Date"]
[1,"2023-05-23",null,"ACC","Buy","1807-1815",1750,null,"1900-1920","Open",{"$nulls":7},"H"]
[2,"2023-06-01",null,"MARICO","Buy","554-557",539,null,"590-600","Open",{"$nulls":7},"H"]
[3,"2023-06-01",null,"COALINDIA","Buy","228.5-230.5",222,null,"240-244","Open",{"$nulls":7},"H"]
[4,"2023-06-02",null,"MINDACORP","Buy","292-294",284,null,"305-315","Open",{"$nulls":7},"H"]
[]
["CLBS = Closing Basis ***",{"$nulls":6},"*"]
["Dividend adjusted <>",{"$nulls":4},"Reinitiated $"]
[{"$nulls":5},"Revised stoploss #"]
[]
{"$rows_left_out":220}