{"text_format":"3","workbook":"xlsx","n_sheets":11,"sheets":["Main","Future Intra","Cash Intra","MidCap Intra","Bulk Deals","Call Tracker (Equity & F&O)","Sheet2","Sheet1","Sheet3","Sheet4","Sheet5"],"not_rendered":{"images":4,"defined_names":5},"read":"whole","date_system":"1900"}

{"sheet":"Main","index":0,"n_rows":27,"n_cols":11,"rows_kept":27}
[null,"                                                                                                 "]
{"$rows_empty":8}
[null,"2019-11-04"]
[]
[null,"Sheet No.","Template Name","Summary"]
[null,1,"Future Intra","For Intraday trading in F&O segment"]
[null,2,"Cash Intra","For Intraday trading in cash market segment"]
[null,3,"Mid-cap Intra","For Intraday trading in Mid-cap stocks"]
[null,4,"Bulk Deals","Reveals Bulk Deals carried on NSE & BSE"]
[null,5,"Call Tracker"]
{"$rows_empty":9}
[{"$nulls":10},"`"]

{"sheet":"Future Intra","index":1,"n_rows":193,"n_cols":15,"rows_kept":193,"merged":[[8,0,9,0],[8,1,9,1],[8,2,9,2],[8,5,8,7],[8,8,8,10]]}
[]
[]
[]
[]
[{"$nulls":12},"Back to Main Page"]
["FOR INTRA DAY TRADING",{"$nulls":10},{"$f":"Main!B10","v":"2019-11-04"}]
[]
[]
["Sr.no","Sector","Scrip","CLOSE RATE","Pivot Point","Supports",null,null,"Resistances"]
[null,"Sector",null,"Point","Point","S1","S2","S3","R1","R2","R3","HIGH","LOW","OI","% Change in OI"]
[1,"Index","BANKNIFTY",{"v":30374.1,"d":"30374.10"},30295.55,{"v":30141.649999999998,"d":"30141.65"},{"v":29909.199999999997,"d":"29909.20"},{"v":29755.299999999996,"d":"29755.30"},{"v":30528,"d":"30528.00"},{"v":30681.9,"d":"30681.90"},{"v":30914.350000000002,"d":"30914.35"},30449.45,30063.1,983540,{"v":0.21634924560969576,"d":"21.63%"}]
[2,"Index","NIFTY",11928.25,{"v":11917.050000000001,"d":"11917.05"},{"v":11889.200000000003,"d":"11889.20"},{"v":11850.150000000001,"d":"11850.15"},{"v":11822.300000000003,"d":"11822.30"},{"v":11956.100000000002,"d":"11956.10"},11983.95,{"v":12023.000000000002,"d":"12023.00"},11944.9,11878,15198525,{"v":0.016773371332236182,"d":"1.68%"}]
[3,"Index","NIFTYIT",{"v":15600,"d":"15600.00"},{"v":15619,"d":"15619.00"},{"v":15513,"d":"15513.00"},{"v":15426,"d":"15426.00"},{"v":15320,"d":"15320.00"},{"v":15706,"d":"15706.00"},{"v":15812,"d":"15812.00"},{"v":15899,"d":"15899.00"},15725,15532,7700,{"v":0.16666666666666666,"d":"16.67%"}]
[4,"Cement","ACC",{"v":1549.4,"d":"1549.40"},{"v":1556.6499999999999,"d":"1556.65"},{"v":1528.2499999999998,"d":"1528.25"},{"v":1507.1,"d":"1507.10"},{"v":1478.6999999999998,"d":"1478.70"},{"v":1577.7999999999997,"d":"1577.80"},{"v":1606.1999999999998,"d":"1606.20"},{"v":1627.3499999999997,"d":"1627.35"},1585.05,1535.5,2529200,{"v":0.02997230819351686,"d":"3.00%"}]
[5,"Others","ADANIENT",201.25,{"v":200.4666666666667,"d":"200.47"},{"v":197.5833333333334,"d":"197.58"},{"v":193.9166666666667,"d":"193.92"},{"v":191.03333333333342,"d":"191.03"},{"v":204.13333333333338,"d":"204.13"},{"v":207.0166666666667,"d":"207.02"},{"v":210.68333333333337,"d":"210.68"},203.35,196.8,29524000,{"v":8.1355932203389829E-4,"d":"0.08%"}]
[6,"Others","ADANIPORTS",391.65,{"v":393.1166666666666,"d":"393.12"},{"v":387.6833333333332,"d":"387.68"},{"v":383.7166666666666,"d":"383.72"},{"v":378.2833333333332,"d":"378.28"},{"v":397.08333333333326,"d":"397.08"},{"v":402.51666666666665,"d":"402.52"},{"v":406.4833333333333,"d":"406.48"},398.55,389.15,15215000,{"v":0.10997629035199709,"d":"11.00%"}]
[7,"Power","ADANIPOWER",68.15,{"v":67.53333333333335,"d":"67.53"},{"v":66.36666666666669,"d":"66.37"},{"v":64.58333333333334,"d":"64.58"},{"v":63.416666666666686,"d":"63.42"},{"v":69.31666666666669,"d":"69.32"},{"v":70.48333333333335,"d":"70.48"},{"v":72.2666666666667,"d":"72.27"},68.7,65.75,82020000,{"v":0.026019514635976983,"d":"2.60%"}]
[8,"Automobile","AMARAJABAT",690.55,{"v":689.3000000000001,"d":"689.30"},{"v":681.3500000000001,"d":"681.35"},{"v":672.1500000000001,"d":"672.15"},{"v":664.2000000000002,"d":"664.20"},{"v":698.5000000000001,"d":"698.50"},{"v":706.4500000000002,"d":"706.45"},{"v":715.6500000000001,"d":"715.65"},697.25,680.1,1472200,{"v":0.027929060187124703,"d":"2.79%"}]
[9,"Cement","AMBUJACEM",202.05,{"v":202.26666666666668,"d":"202.27"},{"v":199.88333333333335,"d":"199.88"},{"v":197.71666666666667,"d":"197.72"},{"v":195.33333333333334,"d":"195.33"},{"v":204.43333333333337,"d":"204.43"},{"v":206.8166666666667,"d":"206.82"},{"v":208.98333333333338,"d":"208.98"},204.65,200.1,20312500,{"v":0.008314718292380244,"d":"0.83%"}]
[10,"Others","APOLLOHOSP",1466.45,{"v":1477.0833333333333,"d":"1477.08"},{"v":1445.5166666666664,"d":"1445.52"},{"v":1424.5833333333333,"d":"1424.58"},{"v":1393.0166666666664,"d":"1393.02"},{"v":1498.0166666666664,"d":"1498.02"},{"v":1529.5833333333335,"d":"1529.58"},{"v":1550.5166666666664,"d":"1550.52"},1508.65,1456.15,1516500,{"v":0.035506998975759645,"d":"3.55%"}]
{"$rows_left_out":159}
{"sheet":"Cash Intra","index":2,"n_rows":247,"n_cols":13,"rows_kept":247,"merged":[[7,0,8,0],[7,1,8,1],[7,2,8,2],[7,3,8,3],[7,4,7,6],[7,7,7,9]]}
[]
[]
[]
[]
[{"$nulls":12},"Back to Main Page"]
["FOR INTRA DAY TRADING",{"$nulls":9},{"$f":"Main!B10","v":"2019-11-04"}]
[]
["Sr.no","Scrip","CLOSE RATE","Pivot Point","Supports",null,null,"Resistances"]
[null,null,"Point",null,"S1","S2","S3","R1","R2","R3","HIGH","LOW","Total Trade Quanity in Lakhs"]
[1,"Nifty 50",11890.6,{"v":11884.083333333334,"d":"11884.08"},{"v":11849.866666666669,"d":"11849.87"},{"v":11809.133333333335,"d":"11809.13"},{"v":11774.91666666667,"d":"11774.92"},{"v":11924.816666666668,"d":"11924.82"},{"v":11959.033333333331,"d":"11959.03"},{"v":11999.766666666666,"d":"11999.77"},11918.3,11843.35]
[2,"Nifty Bank",30330.55,{"v":30256.150000000005,"d":"30256.15"},{"v":30103.30000000001,"d":"30103.30"},{"v":29876.050000000007,"d":"29876.05"},{"v":29723.20000000001,"d":"29723.20"},{"v":30483.40000000001,"d":"30483.40"},{"v":30636.250000000007,"d":"30636.25"},{"v":30863.500000000007,"d":"30863.50"},30409,30028.9]
[3,"Nifty CPSE",2054.85,{"v":2047.3166666666666,"d":"2047.32"},{"v":2036.4833333333331,"d":"2036.48"},{"v":2018.1166666666666,"d":"2018.12"},{"v":2007.283333333333,"d":"2007.28"},{"v":2065.6833333333334,"d":"2065.68"},{"v":2076.5166666666673,"d":"2076.52"},{"v":2094.883333333333,"d":"2094.88"},2058.15,2028.95]
[4,"Nifty Infra",3302.45,{"v":3307.7666666666664,"d":"3307.77"},{"v":3295.683333333333,"d":"3295.68"},{"v":3288.9166666666665,"d":"3288.92"},{"v":3276.833333333333,"d":"3276.83"},{"v":3314.533333333333,"d":"3314.53"},{"v":3326.616666666667,"d":"3326.62"},{"v":3333.3833333333328,"d":"3333.38"},3319.85,3301]
[5,"Nifty IT",15471.2,{"v":15506.433333333334,"d":"15506.43"},{"v":15376.56666666667,"d":"15376.57"},{"v":15281.933333333334,"d":"15281.93"},{"v":15152.06666666667,"d":"15152.07"},{"v":15601.06666666667,"d":"15601.07"},{"v":15730.933333333334,"d":"15730.93"},{"v":15825.56666666667,"d":"15825.57"},15636.3,15411.8]
[6,"Nifty PSE",3430.85,{"v":3427.9666666666667,"d":"3427.97"},{"v":3416.5333333333333,"d":"3416.53"},{"v":3402.2166666666667,"d":"3402.22"},{"v":3390.7833333333333,"d":"3390.78"},{"v":3442.2833333333333,"d":"3442.28"},{"v":3453.7166666666667,"d":"3453.72"},{"v":3468.0333333333333,"d":"3468.03"},3439.4,3413.65]
[7,"Nifty Midcap 50",4657.45,{"v":4661.316666666667,"d":"4661.32"},{"v":4636.883333333333,"d":"4636.88"},{"v":4616.316666666667,"d":"4616.32"},{"v":4591.883333333333,"d":"4591.88"},{"v":4681.883333333333,"d":"4681.88"},{"v":4706.316666666666,"d":"4706.32"},{"v":4726.883333333333,"d":"4726.88"},4685.75,4640.75]
[8,"ACC",1542.2,{"v":1548.6000000000001,"d":"1548.60"},{"v":1521.6000000000004,"d":"1521.60"},{"v":1501.0000000000002,"d":"1501.00"},{"v":1474.0000000000005,"d":"1474.00"},{"v":1569.2000000000003,"d":"1569.20"},{"v":1596.1999999999998,"d":"1596.20"},{"v":1616.8000000000002,"d":"1616.80"},1575.6,1528,8.87153]
[9,"AUBANK",688.4,683.15,{"v":671.3,"d":"671.30"},{"v":654.1999999999999,"d":"654.20"},{"v":642.3499999999999,"d":"642.35"},700.25,{"v":712.1000000000001,"d":"712.10"},{"v":729.2,"d":"729.20"},695,666.05,4.77756]
[10,"ADANIPORTS",389.75,{"v":391.6166666666666,"d":"391.62"},{"v":385.98333333333323,"d":"385.98"},{"v":382.21666666666664,"d":"382.22"},{"v":376.58333333333326,"d":"376.58"},{"v":395.3833333333332,"d":"395.38"},{"v":401.01666666666654,"d":"401.02"},{"v":404.7833333333332,"d":"404.78"},397.25,387.85,36.65336]
[11,"ADANIPOWER",67.9,67.35,{"v":66.14999999999999,"d":"66.15"},{"v":64.39999999999999,"d":"64.40"},{"v":63.19999999999999,"d":"63.20"},{"v":69.1,"d":"69.10"},{"v":70.29999999999998,"d":"70.30"},72.05,68.55,65.6,98.22268]
{"$rows_left_out":228}
{"sheet":"MidCap Intra","index":3,"n_rows":545,"n_cols":13,"rows_kept":545,"merged":[[0,0,0,1],[8,0,9,0],[8,1,9,1],[8,2,9,2],[8,3,9,3],[8,4,8,6],[8,7,8,9]]}
[]
[]
[]
[]
[{"$nulls":11},"Back To Main Page"]
["FOR INTRA DAY TRADING",{"$nulls":9},{"$f":"Main!B10","v":"2019-11-04"}]
[null,null," "]
[]
["Sr.no","Scrip","CLOSE RATE","Pivot Point","Supports",null,null,"Resistances"]
[null,null,"Point",null,"S1","S2","S3","R1","R2","R3","HIGH","LOW","Total Trade Quanity in Lakhs"]
[1,"3MINDIA",22202.1,{"v":22271.38333333333,"d":"22271.38"},{"v":22030.716666666664,"d":"22030.72"},{"v":21859.333333333332,"d":"21859.33"},{"v":21618.666666666664,"d":"21618.67"},{"v":22442.766666666663,"d":"22442.77"},{"v":22683.433333333334,"d":"22683.43"},{"v":22854.816666666662,"d":"22854.82"},22512.05,22100,0.01793]
[2,"ACC",1542.2,{"v":1548.6000000000001,"d":"1548.60"},{"v":1521.6000000000004,"d":"1521.60"},{"v":1501.0000000000002,"d":"1501.00"},{"v":1474.0000000000005,"d":"1474.00"},{"v":1569.2000000000003,"d":"1569.20"},{"v":1596.1999999999998,"d":"1596.20"},{"v":1616.8000000000002,"d":"1616.80"},1575.6,1528,8.87153]
[3,"AIAENG",1679.85,{"v":1697.3,"d":"1697.30"},{"v":1654.6,"d":"1654.60"},1629.35,{"v":1586.6499999999999,"d":"1586.65"},1722.55,{"v":1765.2500000000002,"d":"1765.25"},{"v":1790.5,"d":"1790.50"},1740,1672.05,0.15833]
[4,"APLAPOLLO",1481.15,{"v":1478.8166666666666,"d":"1478.82"},{"v":1457.6333333333332,"d":"1457.63"},{"v":1434.1166666666666,"d":"1434.12"},{"v":1412.9333333333332,"d":"1412.93"},{"v":1502.3333333333333,"d":"1502.33"},{"v":1523.5166666666667,"d":"1523.52"},{"v":1547.0333333333333,"d":"1547.03"},1500,1455.3,0.0822]
[5,"AUBANK",688.4,683.15,{"v":671.3,"d":"671.30"},{"v":654.1999999999999,"d":"654.20"},{"v":642.3499999999999,"d":"642.35"},700.25,{"v":712.1000000000001,"d":"712.10"},{"v":729.2,"d":"729.20"},695,666.05,4.77756]
[6,"AAVAS",1582.75,{"v":1587.5833333333333,"d":"1587.58"},{"v":1568.1666666666665,"d":"1568.17"},{"v":1553.5833333333333,"d":"1553.58"},{"v":1534.1666666666665,"d":"1534.17"},{"v":1602.1666666666665,"d":"1602.17"},{"v":1621.583333333333,"d":"1621.58"},{"v":1636.1666666666665,"d":"1636.17"},1607,1573,0.07173]
[7,"ABBOTINDIA",11620.15,{"v":11700.733333333332,"d":"11700.73"},{"v":11516.416666666664,"d":"11516.42"},{"v":11412.683333333332,"d":"11412.68"},{"v":11228.366666666665,"d":"11228.37"},{"v":11804.466666666664,"d":"11804.47"},{"v":11988.783333333333,"d":"11988.78"},{"v":12092.516666666663,"d":"12092.52"},11885.05,11597,0.08388]
[8,"ADANIGAS",146.85,147.35,{"v":146.29999999999998,"d":"146.30"},145.75,{"v":144.7,"d":"144.70"},{"v":147.89999999999998,"d":"147.90"},148.95,{"v":149.49999999999997,"d":"149.50"},148.4,146.8,3.81934]
[9,"ADANIGREEN",89.95,{"v":89.68333333333332,"d":"89.68"},{"v":88.36666666666665,"d":"88.37"},{"v":86.78333333333332,"d":"86.78"},{"v":85.46666666666664,"d":"85.47"},{"v":91.26666666666665,"d":"91.27"},{"v":92.58333333333334,"d":"92.58"},{"v":94.16666666666666,"d":"94.17"},91,88.1,9.37093]
[10,"ADANIPORTS",389.75,{"v":391.6166666666666,"d":"391.62"},{"v":385.98333333333323,"d":"385.98"},{"v":382.21666666666664,"d":"382.22"},{"v":376.58333333333326,"d":"376.58"},{"v":395.3833333333332,"d":"395.38"},{"v":401.01666666666654,"d":"401.02"},{"v":404.7833333333332,"d":"404.78"},397.25,387.85,36.65336]
{"$rows_left_out":513}
{"sheet":"Bulk Deals","index":4,"n_rows":75,"n_cols":8,"rows_kept":75,"merged":[[4,0,4,1],[4,2,4,3],[6,1,6,2]]}
[" "]
[]
[]
[]
[]
[{"$nulls":4},"Back To Main Page"]
["Subject :","BULK DEAL",null,{"$f":"Main!B10","v":"2019-11-04"}]
[]
["Date","Scrip code","Scrip Name","Client Name","Buy / Sell","Quantity Traded","Trade Price / Wt.Avg.trade price","Exchange  "]
["2019-11-01",531508,"EVEREADY","ADITYA BIRLA FINANCE LIMITED","SELL",{"v":2500000,"d":"2,500,000"},{"v":59.6,"d":"59.60"},"BSE"]
["2019-11-01",531508,"EVEREADY","ICM FINANCE PRIVATE LIMITED","BUY",{"v":750000,"d":"750,000"},{"v":59.6,"d":"59.60"},"BSE"]
["2019-11-01",531508,"EVEREADY","ICM FINANCE PRIVATE LIMITED","BUY",{"v":1100000,"d":"1,100,000"},59.6,"BSE"]
["2019-11-01",531508,"EVEREADY","NARAVI INFRA AND UTILITIES PRIVATELIMITED","BUY",{"v":600000,"d":"600,000"},59.6,"BSE"]
["2019-11-01",533212,"GKB","HARTMUT JOHANNES WURSTER .","BUY",{"v":50000,"d":"50,000"},30.29,"BSE"]
["2019-11-01",533212,"GKB","HDFC BANK LIMITED","SELL",{"v":50748,"d":"50,748"},30.3,"BSE"]
["2019-11-01",538765,"JSHL","RAM SAGAR TIWARI","SELL",{"v":90000,"d":"90,000"},10.25,"BSE"]
["2019-11-01",542459,"KRANTI","SMC GLOBAL SECURITIES LIMITED","SELL",{"v":51000,"d":"51,000"},{"v":30,"d":"30.00"},"BSE"]
["2019-11-01",542459,"KRANTI","YOGESH CHOUDHARY","BUY",{"v":51000,"d":"51,000"},{"v":30,"d":"30.00"},"BSE"]
["2019-11-01",530733,"NOVAPUB","EPOCH MERCANTILES PVT LTD","SELL",{"v":39900,"d":"39,900"},12.49,"BSE"]
["2019-11-01",530733,"NOVAPUB","SEKH GOLAMAHEMAD RAZA","BUY",{"v":40000,"d":"40,000"},12.49,"BSE"]
{"$rows_left_out":56}
{"sheet":"Call Tracker (Equity & F&O)","index":5,"n_rows":283,"n_cols":18,"rows_kept":283,"merged":[[57,0,58,0],[57,1,58,1],[57,9,58,9],[57,11,58,11],[57,12,58,12],[57,13,58,13],[57,14,58,14],[59,0,60,0],[59,1,60,1],[59,9,60,9],[59,11,60,11],[59,12,60,12],[59,13,60,13],[59,14,60,14],[61,0,62,0],[61,1,62,1],[61,9,62,9],[61,11,62,11],[61,12,62,12],[61,13,62,13],[61,14,62,14],[63,0,64,0],[63,1,64,1],[63,9,64,9],[63,11,64,11],[63,12,64,12],[63,13,64,13],[63,14,64,14],[65,0,66,0],[65,1,66,1],[65,9,66,9],[65,11,66,11],[65,12,66,12],[65,13,66,13],[65,14,66,14],[67,0,68,0],[67,1,68,1],[67,9,68,9],[67,11,68,11],[67,12,68,12],[67,13,68,13],[67,14,68,14],[69,0,70,0],[69,1,70,1],[69,9,70,9],[69,11,70,11],[69,12,70,12],[69,13,70,13],[69,14,70,14],[71,0,72,0],[71,1,72,1],[71,9,72,9],[71,11,72,11],[71,12,72,12],[71,13,72,13],[71,14,72,14],[73,0,74,0],[73,1,74,1],[73,9,74,9],[73,11,74,11],[73,12,74,12],[73,13,74,13],[73,14,74,14],[75,0,76,0],[75,1,76,1],[75,9,76,9],[75,11,76,11],[75,12,76,12],[75,13,76,13],[75,14,76,14],[77,0,78,0],[77,1,78,1],[77,9,78,9],[77,11,78,11],[77,12,78,12],[77,13,78,13],[77,14,78,14],[79,0,80,0],[79,1,80,1],[79,9,80,9],[79,11,80,11],[79,12,80,12],[79,13,80,13],[79,14,80,14],[81,0,82,0],[81,1,82,1],[81,9,82,9],[81,11,82,11],[81,12,82,12],[81,13,82,13],[81,14,82,14],[83,0,84,0],[83,1,84,1],[83,9,84,9],[83,11,84,11],[83,12,84,12],[83,13,84,13],[83,14,84,14],[85,0,86,0],[85,1,86,1],[85,9,86,9],[85,11,86,11],[85,12,86,12],[85,13,86,13],[85,14,86,14],[92,0,93,0],[92,1,93,1],[92,9,93,9],[92,11,93,11],[92,12,93,12],[92,13,93,13],[92,14,93,14],[94,0,95,0],[94,1,95,1],[94,9,95,9],[94,11,95,11],[94,12,95,12],[94,13,95,13],[94,14,95,14],[98,0,99,0],[98,1,99,1],[98,9,99,9],[98,11,99,11],[98,12,99,12],[98,13,99,13],[98,14,99,14]]}
[]
[]
[]
[]
[{"$nulls":12},"Back To Main Page"]
["Retail Research Technical Calls & Fundamental Performance Report for the month of November-2019 "]
[{"$nulls":12},{"$f":"Main!B10","v":"2019-11-04"}]
[null,"Positional  Call"]
["Sr.no","Date",null,"Company","Rec","Rec Price","Stop Loss***","Call Closed At","Target","Remark","Profit / Loss per Share","Gain / Loss  %","Status","Closed Date","NSE Closed Price"]
[1,"2019-09-26",null,"HDFC","Buy",2070,1940,2165,"2250-2300","Profit of Rs.95/-",{"$f":"H10-F10","v":95},{"$f":"K10/F10","v":{"v":0.04589371980676329,"d":"4.59%"}},"Successful","2019-11-01",{"$f":"VLOOKUP(D10,Sheet2!A43:M1682,6,0)","v":2128.6},null,null,"H"]
[2,"2019-10-01",null,"UPL","Buy","592-598",564,null,"650-660","Open",{"$nulls":4},{"$f":"VLOOKUP(D11,Sheet2!A47:M1686,6,0)","v":588.55},null,null,"R"]
[3,"2019-10-07",null,"PIDILITIND","Buy",1367.5,1297,1413.5,"1500-1520","Part Profit of Rs.46/-",{"$f":"H12-F12","v":46},{"$f":"K12/F12","v":{"v":0.03363802559414991,"d":"3.36%"}},"Successful","2019-10-31",{"$f":"VLOOKUP(D12,Sheet2!A51:M1690,6,0)","v":1397.95},null,null,"R"]
[4,"2019-10-22",null,"HEIDELBERG","Buy","187.50-189.50",178,null,"205-210","Open",{"$nulls":4},{"$f":"VLOOKUP(D13,Sheet2!A58:M1697,6,0)","v":186},null,null,"H"]
[5,"2019-10-27",null,"AMBUJACEM","Buy",197,185.4,203.5,"216-220","Part Profit of Rs.6.5/-",{"$f":"H14-F14","v":6.5},{"$f":"K14/F14","v":{"v":0.03299492385786802,"d":"3.30%"}},"Successful","2019-10-30",{"$f":"VLOOKUP(D14,Sheet2!A60:M1699,6,0)","v":201.6},null,null,"R"]
[6]
{"$rows_empty":14}
["CLBS = Closing Basis ***"]
["Dividend adjusted <>",{"$nulls":4},"Reinitiated $"]
["Part book {}",{"$nulls":4},"Revised stoploss #"]
[]
{"$rows_left_out":210}
{"sheet":"Sheet2","index":6,"n_rows":1899,"n_cols":14,"rows_kept":1899,"hidden":true}
["SYMBOL","SERIES","OPEN","HIGH","LOW","CLOSE","LAST","PREVCLOSE","TOTTRDQTY","TOTTRDVAL","TIMESTAMP","TOTALTRADES","ISIN","ISIN"]
["20MICRONS","EQ",38.8,38.9,37.3,37.7,37.65,38.35,39480,1510023.9,"2019-11-01",289,"INE144J01027"]
["21STCENMGM","EQ",13.25,13.25,13.25,13.25,13.25,13.25,15,198.75,"2019-11-01",3,"INE253B01015"]
["3IINFOTECH","EQ",2,2.05,1.95,2,2,2,2597619,5196924.7,"2019-11-01",710,"INE748C01020"]
["3MINDIA","EQ",22497.5,22512.05,22100,22202.1,22175,22488.2,1793,39889301.1,"2019-11-01",875,"INE470A01017"]
["3PLAND","EQ",6.2,6.2,6.2,6.2,6.2,6.2,1028,6373.6,"2019-11-01",5,"INE105C01023"]
["5PAISA","EQ",170.55,173,169.05,169.65,169.65,170.55,3624,619659.65,"2019-11-01",142,"INE618L01018"]
["63MOONS","EQ",122.05,123.8,119.1,119.8,119.5,121.2,104787,12669337.9,"2019-11-01",1326,"INE111B01023"]
["A2ZINFRA","EQ",8.95,10.7,8.7,10.7,10.7,8.95,1497561,15641063.95,"2019-11-01",2147,"INE619I01012"]
["AARTIDRUGS","EQ",540,545,529,532,529,537.95,6779,3646507,"2019-11-01",1243,"INE767A01016"]
["AARTIIND","EQ",881.95,881.95,870,877.4,872,876.5,53188,46597507.4,"2019-11-01",4797,"INE769A01020"]
["AARVEEDEN","EQ",14.45,14.95,13.9,14.1,14.15,14.15,8165,118734.3,"2019-11-01",122,"INE273D01019"]
["AAVAS","EQ",1607,1607,1573,1582.75,1573,1591.6,7173,11386167.75,"2019-11-01",1062,"INE216P01012"]
["ABAN","BE",26.75,28.05,26.3,28,28,26.75,48916,1344664.75,"2019-11-01",507,"INE421A01028"]
["ABB","EQ",1458.6,1480,1451.65,1458.85,1457,1458.6,74552,109034209.45,"2019-11-01",5969,"INE117A01022"]
["ABBOTINDIA","EQ",11750,11885.05,11597,11620.15,11630,11774.4,8388,98260816.55,"2019-11-01",3068,"INE358A01014"]
["ABCAPITAL","EQ",82.2,84.7,82.2,83,83.15,81.85,3673750,306793374.95,"2019-11-01",18964,"INE674K01013"]
["ABFRL","EQ",213.25,213.25,209.15,211,210.5,212.2,237461,50069734.1,"2019-11-01",6407,"INE647O01011"]
["ABSLNN50ET","EQ",283,292.44,277.7,287.62,287.62,290.54,1154,332764.91,"2019-11-01",29,"INF209KB1B87"]
["ACC","EQ",1573,1575.6,1528,1542.2,1542.05,1568.05,887153,1378006992.75,"2019-11-01",24635,"INE012A01025"]
{"$rows_left_out":1701}
{"sheet":"Sheet1","index":7,"n_rows":0,"n_cols":0,"rows_kept":0,"hidden":true}

{"sheet":"Sheet3","index":8,"n_rows":0,"n_cols":0,"rows_kept":0,"hidden":true}

{"sheet":"Sheet4","index":9,"n_rows":0,"n_cols":0,"rows_kept":0,"hidden":true}

{"sheet":"Sheet5","index":10,"n_rows":0,"n_cols":0,"rows_kept":0,"hidden":true}