{"text_format":"3","workbook":"xlsx","n_sheets":7,"sheets":["Main","Future Intra","Cash Intra","MidCap Intra","Bulk Deals","Call Tracker (Equity)","Call Tracker (F&O)"],"not_rendered":{"images":4,"external_links":1,"defined_names":1},"read":"whole","date_system":"1900"}

{"sheet":"Main","index":0,"n_rows":27,"n_cols":11,"rows_kept":27}
[null,"                                                                                                 "]
[]
[]
[]
[]
[{"$nulls":6}," "]
[]
[]
[]
[null,"2024-09-04"]
[]
[null,"Sheet No.","Template Name","Summary"]
[null,1,"Future Intra","For Intraday trading in F&O segment"]
[null,2,"Cash Intra","For Intraday trading in cash market segment"]
[null,3,"Mid-cap Intra","For Intraday trading in Mid-cap stocks"]
[null,4,"Bulk Deals","Reveals Bulk Deals carried on NSE & BSE"]
[null,5,"Call Tracker"]
{"$rows_empty":9}
[{"$nulls":10},"`"]

{"sheet":"Future Intra","index":1,"n_rows":225,"n_cols":16,"rows_kept":225,"merged":[[8,0,9,0],[8,1,9,1],[8,2,9,2],[8,3,9,3],[8,6,8,8],[8,9,8,11]]}
[]
[]
[]
[]
[{"$nulls":12},"Back to Main Page"]
["FOR INTRA DAY TRADING",{"$nulls":10},{"$f":"Main!B10","v":"2024-09-04"}]
[]
[]
["Sr.no","Sector","Scrip","Expiry Date","CLOSE RATE","Pivot Point","Supports",null,null,"Resistances"]
[{"$nulls":4},"Point","Point","S1","S2","S3","R1","R2","R3","HIGH","LOW","OI","% Change in OI"]
[1,"Index","NIFTY","2024-09-26",25354.55,{"v":25335.88333333333,"d":"25335.88"},{"v":25273.766666666663,"d":"25273.77"},{"v":25192.98333333333,"d":"25192.98"},{"v":25130.86666666666,"d":"25130.87"},{"v":25416.666666666664,"d":"25416.67"},{"v":25478.783333333333,"d":"25478.78"},{"v":25559.566666666666,"d":"25559.57"},25398,25255.1,16277250,{"v":0.009704853357153492,"d":"0.97%"}]
[2,"Index","BANKNIFTY","2024-09-25",{"v":51834.1,"d":"51834.10"},{"v":51748.03333333333,"d":"51748.03"},{"v":51611.066666666666,"d":"51611.07"},{"v":51388.03333333333,"d":"51388.03"},{"v":51251.066666666666,"d":"51251.07"},{"v":51971.066666666666,"d":"51971.07"},{"v":52108.033333333326,"d":"52108.03"},{"v":52331.066666666666,"d":"52331.07"},51885,51525,2541960,{"v":3.5769276323581664E-3,"d":"0.36%"}]
[3,"Index","FINNIFTY","2024-09-24",{"v":23960.4,"d":"23960.40"},{"v":23886.383333333335,"d":"23886.38"},{"v":23788.06666666667,"d":"23788.07"},{"v":23615.733333333334,"d":"23615.73"},{"v":23517.416666666668,"d":"23517.42"},{"v":24058.71666666667,"d":"24058.72"},{"v":24157.033333333336,"d":"24157.03"},{"v":24329.366666666672,"d":"24329.37"},23984.7,23714.05,125925,{"v":0.6531014112241549,"d":"65.31%"}]
[4,"Index","MIDCPNIFTY","2024-09-30",13259.95,{"v":13243.949999999999,"d":"13243.95"},{"v":13208.099999999999,"d":"13208.10"},13156.25,{"v":13120.4,"d":"13120.40"},{"v":13295.799999999997,"d":"13295.80"},13331.65,{"v":13383.499999999996,"d":"13383.50"},13279.8,13192.1,2243600,{"v":-0.002356707723776068,"d":"-0.24%"}]
[5,"Index","NIFTYNXT50","2024-09-27",{"v":75542.8,"d":"75542.80"},{"v":75483.06666666667,"d":"75483.07"},{"v":75366.13333333333,"d":"75366.13"},{"v":75189.46666666666,"d":"75189.47"},{"v":75072.53333333333,"d":"75072.53"},{"v":75659.73333333334,"d":"75659.73"},{"v":75776.66666666666,"d":"75776.67"},{"v":75953.33333333334,"d":"75953.33"},75600,75306.4,15180,{"v":0.057103064066852366,"d":"5.71%"}]
[6,"Chemicals","AARTIIND","2024-09-26",{"v":626.7,"d":"626.70"},{"v":629.5500000000001,"d":"629.55"},{"v":622.8000000000002,"d":"622.80"},{"v":618.9000000000001,"d":"618.90"},{"v":612.1500000000002,"d":"612.15"},{"v":633.4500000000002,"d":"633.45"},{"v":640.1999999999999,"d":"640.20"},{"v":644.1000000000001,"d":"644.10"},636.3,625.65,13703000,{"v":0.0553758471965496,"d":"5.54%"}]
[7,"Capital_Goods","ABB","2024-09-26",{"v":7797.6,"d":"7797.60"},{"v":7792.3,"d":"7792.30"},7720.35,{"v":7643.1,"d":"7643.10"},{"v":7571.150000000001,"d":"7571.15"},7869.55,{"v":7941.499999999999,"d":"7941.50"},8018.75,7864.25,7715.05,1517500,{"v":-0.007926779439405084,"d":"-0.79%"}]
[8,"Pharma","ABBOTINDIA","2024-09-26",29848.35,{"v":30056.11666666667,"d":"30056.12"},{"v":29592.233333333337,"d":"29592.23"},{"v":29336.11666666667,"d":"29336.12"},{"v":28872.233333333337,"d":"28872.23"},{"v":30312.233333333337,"d":"30312.23"},{"v":30776.11666666667,"d":"30776.12"},{"v":31032.233333333337,"d":"31032.23"},30520,29800,115260,{"v":-0.020064614861418126,"d":"-2.01%"}]
[9,"Finance","ABCAPITAL","2024-09-26",226.14,{"v":226.82333333333335,"d":"226.82"},{"v":223.5166666666667,"d":"223.52"},{"v":220.89333333333335,"d":"220.89"},{"v":217.5866666666667,"d":"217.59"},{"v":229.44666666666672,"d":"229.45"},{"v":232.7533333333334,"d":"232.75"},{"v":235.37666666666672,"d":"235.38"},230.13,224.2,70615800,{"v":0.013485235991629853,"d":"1.35%"}]
[10,"Textile","ABFRL","2024-09-26",{"v":317.7,"d":"317.70"},320.05,{"v":314.8,"d":"314.80"},{"v":311.9,"d":"311.90"},306.65,{"v":322.95000000000005,"d":"322.95"},{"v":328.20000000000005,"d":"328.20"},{"v":331.1000000000001,"d":"331.10"},325.3,317.15,61068800,{"v":0.050870207149568254,"d":"5.09%"}]
{"$rows_left_out":194}
{"sheet":"Cash Intra","index":2,"n_rows":243,"n_cols":13,"rows_kept":243,"merged":[[7,0,8,0],[7,1,8,1],[7,2,8,2],[7,3,8,3],[7,4,7,6],[7,7,7,9]]}
[]
[]
[]
[]
[{"$nulls":12},"Back to Main Page"]
["FOR INTRA DAY TRADING",{"$nulls":9},{"$f":"Main!B10","v":"2024-09-04"}]
[]
["Sr.no",null,"CLOSE RATE","Pivot Point","Supports",null,null,"Resistances"]
[{"$nulls":4},"S1","S2","S3","R1","R2","R3","HIGH","LOW","Total Trade Quanity in Lakhs"]
[1,"Nifty 50",25279.85,{"v":25279.11666666667,"d":"25279.12"},{"v":25236.533333333336,"d":"25236.53"},{"v":25193.216666666667,"d":"25193.22"},{"v":25150.633333333335,"d":"25150.63"},{"v":25322.433333333338,"d":"25322.43"},{"v":25365.016666666666,"d":"25365.02"},{"v":25408.33333333334,"d":"25408.33"},{"v":25321.7,"d":"25321.70"},{"v":25235.8,"d":"25235.80"}]
[2,"Nifty Bank",{"v":51689.1,"d":"51689.10"},51559.75,{"v":51369.4,"d":"51369.40"},{"v":51049.700000000004,"d":"51049.70"},{"v":50859.350000000006,"d":"50859.35"},51879.45,{"v":52069.8,"d":"52069.80"},{"v":52389.49999999999,"d":"52389.50"},{"v":51750.1,"d":"51750.10"},51240.05]
[3,"Nifty CPSE",7307.05,{"v":7325.666666666667,"d":"7325.67"},{"v":7279.533333333334,"d":"7279.53"},{"v":7252.016666666666,"d":"7252.02"},{"v":7205.883333333333,"d":"7205.88"},{"v":7353.183333333334,"d":"7353.18"},{"v":7399.3166666666675,"d":"7399.32"},{"v":7426.833333333335,"d":"7426.83"},{"v":7371.8,"d":"7371.80"},7298.15]
[4,"Nifty Infra",{"v":9372.1,"d":"9372.10"},{"v":9388.933333333334,"d":"9388.93"},{"v":9348.666666666668,"d":"9348.67"},{"v":9325.233333333334,"d":"9325.23"},{"v":9284.966666666667,"d":"9284.97"},{"v":9412.366666666669,"d":"9412.37"},{"v":9452.633333333335,"d":"9452.63"},{"v":9476.06666666667,"d":"9476.07"},{"v":9429.2,"d":"9429.20"},{"v":9365.5,"d":"9365.50"}]
[5,"Nifty IT",{"v":42851.3,"d":"42851.30"},{"v":42930.86666666667,"d":"42930.87"},{"v":42667.183333333334,"d":"42667.18"},{"v":42483.066666666666,"d":"42483.07"},{"v":42219.38333333333,"d":"42219.38"},{"v":43114.98333333334,"d":"43114.98"},{"v":43378.66666666667,"d":"43378.67"},{"v":43562.78333333334,"d":"43562.78"},43194.55,42746.75]
[6,"Nifty PSE",{"v":11427.8,"d":"11427.80"},{"v":11441.766666666665,"d":"11441.77"},{"v":11390.63333333333,"d":"11390.63"},{"v":11353.466666666665,"d":"11353.47"},{"v":11302.33333333333,"d":"11302.33"},{"v":11478.933333333329,"d":"11478.93"},{"v":11530.066666666664,"d":"11530.07"},{"v":11567.233333333328,"d":"11567.23"},{"v":11492.9,"d":"11492.90"},{"v":11404.6,"d":"11404.60"}]
[7,"Nifty Midcap 50",{"v":16651.6,"d":"16651.60"},{"v":16655.8,"d":"16655.80"},{"v":16603.449999999997,"d":"16603.45"},{"v":16555.3,"d":"16555.30"},{"v":16502.949999999997,"d":"16502.95"},{"v":16703.949999999997,"d":"16703.95"},{"v":16756.299999999996,"d":"16756.30"},{"v":16804.449999999997,"d":"16804.45"},16708.15,16607.65]
[8,"ABB",7767.9,{"v":7759.133333333334,"d":"7759.13"},{"v":7689.466666666668,"d":"7689.47"},{"v":7611.033333333334,"d":"7611.03"},{"v":7541.366666666668,"d":"7541.37"},{"v":7837.566666666668,"d":"7837.57"},{"v":7907.2333333333345,"d":"7907.23"},{"v":7985.666666666669,"d":"7985.67"},7828.8,7680.7,1.99718]
[9,"ACC",2341.3,{"v":2338.9166666666665,"d":"2338.92"},{"v":2327.633333333333,"d":"2327.63"},{"v":2313.9666666666667,"d":"2313.97"},{"v":2302.6833333333334,"d":"2302.68"},{"v":2352.583333333333,"d":"2352.58"},{"v":2363.866666666667,"d":"2363.87"},{"v":2377.533333333333,"d":"2377.53"},2350.2,2325.25,2.54851]
[10,"APLAPOLLO",1429.1,{"v":1433.6333333333332,"d":"1433.63"},{"v":1418.4666666666665,"d":"1418.47"},{"v":1407.8333333333333,"d":"1407.83"},{"v":1392.6666666666665,"d":"1392.67"},{"v":1444.2666666666664,"d":"1444.27"},{"v":1459.4333333333334,"d":"1459.43"},{"v":1470.0666666666664,"d":"1470.07"},1448.8,1423,4.1303]
[11,"AUBANK",674.25,{"v":678.0333333333333,"d":"678.03"},{"v":668.2166666666666,"d":"668.22"},{"v":662.1833333333333,"d":"662.18"},{"v":652.3666666666666,"d":"652.37"},{"v":684.0666666666666,"d":"684.07"},{"v":693.8833333333332,"d":"693.88"},{"v":699.9166666666666,"d":"699.92"},687.85,672,40.0557]
{"$rows_left_out":224}
{"sheet":"MidCap Intra","index":3,"n_rows":533,"n_cols":13,"rows_kept":533,"merged":[[0,0,0,1],[8,0,9,0],[8,1,9,1],[8,2,9,2],[8,3,9,3],[8,4,8,6],[8,7,8,9]]}
[]
[]
[]
[]
[{"$nulls":11},"Back To Main Page"]
["FOR INTRA DAY TRADING",{"$nulls":9},{"$f":"Main!B10","v":"2024-09-04"}]
[null,null," "]
[]
["Sr.no","Scrip","CLOSE RATE","Pivot Point","Supports",null,null,"Resistances"]
[{"$nulls":4},"S1","S2","S3","R1","R2","R3","HIGH","LOW","Total Trade Quanity in Lakhs"]
[1,"360ONE",1095.15,1095.55,{"v":1086.1999999999998,"d":"1086.20"},{"v":1077.2499999999998,"d":"1077.25"},{"v":1067.8999999999996,"d":"1067.90"},{"v":1104.5,"d":"1104.50"},1113.85,{"v":1122.8000000000002,"d":"1122.80"},1104.9,1086.6,4.30544]
[2,"3MINDIA",35717.75,35805.25,{"v":35454.5,"d":"35454.50"},35191.25,{"v":34840.5,"d":"34840.50"},{"v":36068.5,"d":"36068.50"},36419.25,{"v":36682.5,"d":"36682.50"},36156,35542,0.02612]
[3,"ABB",7767.9,{"v":7759.133333333334,"d":"7759.13"},{"v":7689.466666666668,"d":"7689.47"},{"v":7611.033333333334,"d":"7611.03"},{"v":7541.366666666668,"d":"7541.37"},{"v":7837.566666666668,"d":"7837.57"},{"v":7907.2333333333345,"d":"7907.23"},{"v":7985.666666666669,"d":"7985.67"},7828.8,7680.7,1.99718]
[4,"ACC",2341.3,{"v":2338.9166666666665,"d":"2338.92"},{"v":2327.633333333333,"d":"2327.63"},{"v":2313.9666666666667,"d":"2313.97"},{"v":2302.6833333333334,"d":"2302.68"},{"v":2352.583333333333,"d":"2352.58"},{"v":2363.866666666667,"d":"2363.87"},{"v":2377.533333333333,"d":"2377.53"},2350.2,2325.25,2.54851]
[5,"AIAENG",4398.15,{"v":4378.083333333333,"d":"4378.08"},{"v":4339.166666666666,"d":"4339.17"},{"v":4280.183333333333,"d":"4280.18"},{"v":4241.266666666666,"d":"4241.27"},{"v":4437.066666666666,"d":"4437.07"},{"v":4475.983333333332,"d":"4475.98"},{"v":4534.966666666665,"d":"4534.97"},4417,4319.1,0.95752]
[6,"APLAPOLLO",1429.1,{"v":1433.6333333333332,"d":"1433.63"},{"v":1418.4666666666665,"d":"1418.47"},{"v":1407.8333333333333,"d":"1407.83"},{"v":1392.6666666666665,"d":"1392.67"},{"v":1444.2666666666664,"d":"1444.27"},{"v":1459.4333333333334,"d":"1459.43"},{"v":1470.0666666666664,"d":"1470.07"},1448.8,1423,4.1303]
[7,"AUBANK",674.25,{"v":678.0333333333333,"d":"678.03"},{"v":668.2166666666666,"d":"668.22"},{"v":662.1833333333333,"d":"662.18"},{"v":652.3666666666666,"d":"652.37"},{"v":684.0666666666666,"d":"684.07"},{"v":693.8833333333332,"d":"693.88"},{"v":699.9166666666666,"d":"699.92"},687.85,672,40.0557]
[8,"AARTIIND",623.1,{"v":625.9666666666667,"d":"625.97"},{"v":619.3333333333334,"d":"619.33"},{"v":615.5666666666667,"d":"615.57"},{"v":608.9333333333334,"d":"608.93"},{"v":629.7333333333333,"d":"629.73"},{"v":636.3666666666666,"d":"636.37"},{"v":640.1333333333333,"d":"640.13"},632.6,622.2,15.28248]
[9,"AAVAS",1725.75,{"v":1722.2,"d":"1722.20"},{"v":1713.4,"d":"1713.40"},1701.05,1692.25,{"v":1734.5500000000002,"d":"1734.55"},1743.35,{"v":1755.7000000000003,"d":"1755.70"},1731,1709.85,0.71942]
[10,"ABBOTINDIA",29690.45,29907.45,{"v":29434,"d":"29434.00"},29177.55,{"v":28704.1,"d":"28704.10"},{"v":30163.9,"d":"30163.90"},{"v":30637.350000000006,"d":"30637.35"},{"v":30893.800000000003,"d":"30893.80"},30380.9,29651,0.10509]
{"$rows_left_out":508}
{"sheet":"Bulk Deals","index":4,"n_rows":312,"n_cols":8,"rows_kept":312,"merged":[[4,0,4,1],[4,2,4,3],[6,1,6,2]]}
[" "]
[]
[]
[]
[]
[{"$nulls":4},"Back To Main Page"]
["Subject :","BULK DEAL",null,{"$f":"Main!B10","v":"2024-09-04"}]
[]
["Date","Scrip code","Scrip Name","Client Name","Buy / Sell","Quantity Traded","Trade Price / Wt.Avg.trade price","Exchange  "]
["2024-09-03",511463,"ALEXANDER","JAINAM SHARE CONSULTANTS PVT. LTD.","BUY",{"v":53004,"d":"53,004"},16.7,"BSE"]
["2024-09-03",540135,"ARCFIN","SKSE SECURITIES LIMITED CORP CM/TM PROP A/C","BUY",{"v":2507432,"d":"2,507,432"},1.59,"BSE"]
["2024-09-03",540135,"ARCFIN","SKSE SECURITIES LIMITED CORP CM/TM PROP A/C","SELL",{"v":2627634,"d":"2,627,634"},1.61,"BSE"]
["2024-09-03",513401,"ASHIS","SHREE GIRIRAJ SECURITIES PRIVATE LIMITED","SELL",{"v":55000,"d":"55,000"},48.39,"BSE"]
["2024-09-03",540611,"AUBANK","WESTBRIDGE AIF I","SELL",{"v":10895517,"d":"10,895,517"},676.06,"BSE"]
["2024-09-03",539621,"BCLENTERPR","GOKUL GUPTA","SELL",{"v":1400000,"d":"1,400,000"},0.94,"BSE"]
["2024-09-03",543606,"CONTAINE","GIRIJADHAVA VYAPAAR PRIVATE LIMITED","BUY",{"v":50000,"d":"50,000"},83.11,"BSE"]
["2024-09-03",539559,"DDIL","ANKURBISHT","BUY",{"v":1248991,"d":"1,248,991"},8.36,"BSE"]
["2024-09-03",539559,"DDIL","ANKURBISHT","SELL",{"v":544773,"d":"544,773"},8.76,"BSE"]
["2024-09-03",539559,"DDIL","PRASHANT GUPTA","SELL",{"v":254787,"d":"254,787"},8.38,"BSE"]
["2024-09-03",539559,"DDIL","PRASHANT GUPTA","BUY",{"v":213349,"d":"213,349"},8.36,"BSE"]
{"$rows_left_out":293}
{"sheet":"Call Tracker (Equity)","index":5,"n_rows":283,"n_cols":18,"rows_kept":283}
[]
[]
[]
[]
[{"$nulls":12},"Back To Main Page"]
["Retail Research Technical Calls & Fundamental Performance Report for the month of September-2024"]
[{"$nulls":12},{"$f":"Main!B10","v":"2024-09-04"}]
["Positional  Call (Timeframe- 1-3 Months)"]
["Sr.no","Date",null,"Company","Rec","Rec Price","Stop Loss***","Call Closed At","Target","Remark","Profit / Loss per Share","All charges","Net Gain / Loss  %","Status","Closed Date","Market Closing Price","Second Buying Date"]
[1,"2024-07-25",null,"NESTLEIND","Accu","2390-2470",2330,null,"2650-2800","Open",{"$nulls":5},{"$f":"VLOOKUP(D10,'MidCap Intra'!$B$11:$C$571,2,0)","v":2530.75},null,"H"]
[2,"2024-08-12",null,"HINDUNILVR","Accu","2650-2730",2540,null,"3000-3290","Open",{"$nulls":5},{"$f":"VLOOKUP(D11,'MidCap Intra'!$B$11:$C$571,2,0)","v":{"v":2794.3,"d":"2794.30"}},null,"K"]
[3,"2024-08-20",null,"TATAMOTORS","Accu","1048-1068.6",1090,null,"1150-1220","Open",{"$nulls":5},{"$f":"VLOOKUP(D12,'MidCap Intra'!$B$11:$C$571,2,0)","v":{"v":1085.1,"d":"1085.10"}},null,"H"]
[4,"2024-08-20",null,"TATACONSUM","Accu","1143-1173",1120,null,"1230-1300","Open",{"$nulls":5},{"$f":"VLOOKUP(D13,'MidCap Intra'!$B$11:$C$571,2,0)","v":{"v":1199,"d":"1199.00"}},null,"H"]
[5,"2024-08-20",null,"SIEMENS","Accu","6810-7010",6640,null,"7370-7700","Open",{"$nulls":5},{"$f":"VLOOKUP(D14,'MidCap Intra'!$B$11:$C$571,2,0)","v":{"v":6768.8,"d":"6768.80"}},null,"H"]
[6,"2024-08-26",null,"LATENTVIEW","Accu","480-498",468,null,"530-565","Open",{"$nulls":5},{"$f":"VLOOKUP(D15,'[1]MidCap Intra'!$B$11:$C$571,2,0)","v":{"v":510.9,"d":"510.90"}},null,"H"]
[7,"2024-08-27",null,"HINDCOPPER","Accu","321-331",310,null,"350-370","Open",{"$nulls":5},{"$f":"VLOOKUP(D16,'[1]MidCap Intra'!$B$11:$C$571,2,0)","v":318.55},null,"H"]
[8,"2024-08-27",null,"ZEEL","Accu","141-148",134.5,null,"165-185","Open",{"$nulls":5},{"$f":"VLOOKUP(D17,'[1]MidCap Intra'!$B$11:$C$571,2,0)","v":139.44},null,"H"]
[9,"2024-08-28",null,"TATATECH","Accu","1045-1081",1020,null,"1150-1220","Open",{"$nulls":5},{"$f":"VLOOKUP(D18,'[1]MidCap Intra'!$B$11:$C$571,2,0)","v":{"v":1007.2,"d":"1007.20"}},null,"H"]
[10,"2024-08-28",null,"CENTURYPLY","Accu","760-785",726,null,"845-905","Open",{"$nulls":5},{"$f":"VLOOKUP(D19,'[1]MidCap Intra'!$B$11:$C$571,2,0)","v":{"v":760.1,"d":"760.10"}},null,"K"]
[11,"2024-08-29",null,"BEL","Accu","291.5-299.5",284,null,"320-340","Open",{"$nulls":5},{"$f":"VLOOKUP(D20,'[1]MidCap Intra'!$B$11:$C$571,2,0)","v":{"v":304.5,"d":"304.50"}},null,"H"]
{"$rows_left_out":264}
{"sheet":"Call Tracker (F&O)","index":6,"n_rows":20,"n_cols":16,"rows_kept":20}
[]
[]
[]
[]
[{"$nulls":12},"Back To Main Page"]
["Retail Research Technical Calls & Fundamental Performance Report for the month of September-2024"]
[{"$nulls":12},"2024-09-04"]
["Master Trade High Risk"]
["Sr.no","Date",null,"Company","Rec","Rec Price","Stop Loss","Call Closed At","Target","Remark","Profit / Loss per share","All charges","Gain / Loss  per Lot","Lot","Status","Closed Date"]
[]
[]
[]
[]
["Master Trade Medium Risk "]
["Sr.no","Date",null,"Company","Rec","Rec Price","Stop Loss","Call Closed At","Target","Remark","Profit/ Loss per lot ","All charges","Gain / Loss  per Lot","Lot","Status","Closed Date"]
[1,"2024-08-29",null,"BANKNIFTY 51600 CE 28 AUG","Buy",225,130,172.5,350,"Loss of Rs.52.5/-",{"$f":"H16-F16","v":-52.5},{"v":25,"d":"25.00"},{"$f":"(K16*N16)-L16","v":-812.5},15,"Unsuccessful","2024-09-02"]
[2,"2024-09-02",null,"NIFTY 25300 PE 5 SEP","Buy",107.5,60,155,155,"Profit of Rs.47.5/-",{"$f":"H17-F17","v":47.5},{"v":50,"d":"50.00"},1137.5,25,"Successful","2024-09-02"]
[3,"2024-09-03",null,"NIFTY 25300 PE 5 SEP","Buy",107.5,65,null,150,"Open"]
[4,"2024-09-03",null,"TATACONSUM 1250 CE 26 SEP","Buy",15.5,7,null,28,"Open"]
[5,"2024-09-03",null,"BALKRISIND 3000 CE 26 SEP","Buy",59,40,null,90,"Open"]