{"text_format":"3","workbook":"xlsx","n_sheets":6,"sheets":["Main","Future Intra","Cash Intra","MidCap Intra","Bulk Deals","Call Tracker (Equity & F&O)"],"not_rendered":{"images":2,"defined_names":1},"read":"whole","date_system":"1900"}

{"sheet":"Main","index":0,"n_rows":27,"n_cols":11,"rows_kept":27}
[null,"                                                                                                 "]
[]
[]
[]
[]
[{"$nulls":6}," "]
[]
[]
[]
[null,"2023-09-04"]
[]
[null,"Sheet No.","Template Name","Summary"]
[null,1,"Future Intra","For Intraday trading in F&O segment"]
[null,2,"Cash Intra","For Intraday trading in cash market segment"]
[null,3,"Mid-cap Intra","For Intraday trading in Mid-cap stocks"]
[null,4,"Bulk Deals","Reveals Bulk Deals carried on NSE & BSE"]
[null,5,"Call Tracker"]
{"$rows_empty":9}
[{"$nulls":10},"`"]

{"sheet":"Future Intra","index":1,"n_rows":236,"n_cols":16,"rows_kept":236,"merged":[[8,0,9,0],[8,1,9,1],[8,2,9,2],[8,3,9,3],[8,6,8,8],[8,9,8,11]]}
[]
[]
[]
[]
[{"$nulls":12},"Back to Main Page"]
["FOR INTRA DAY TRADING",{"$nulls":10},{"$f":"Main!B10","v":"2023-09-04"}]
[]
[]
["Sr.no","Sector","Scrip","Expiry Date","CLOSE RATE","Pivot Point","Supports",null,null,"Resistances"]
[{"$nulls":4},"Point","Point","S1","S2","S3","R1","R2","R3","HIGH","LOW","OI","% Change in OI"]
[1,"Index","NIFTY","2023-09-28",{"v":19512.1,"d":"19512.10"},{"v":19472.683333333334,"d":"19472.68"},{"v":19416.416666666668,"d":"19416.42"},{"v":19320.733333333334,"d":"19320.73"},{"v":19264.466666666667,"d":"19264.47"},{"v":19568.36666666667,"d":"19568.37"},{"v":19624.63333333333,"d":"19624.63"},{"v":19720.31666666667,"d":"19720.32"},19528.95,19377,10222400,{"v":-0.03615003111505025,"d":"-4%"}]
[2,"Index","BANKNIFTY","2023-09-28",{"v":44601.5,"d":"44601.50"},{"v":44469.549999999996,"d":"44469.55"},{"v":44192.94999999999,"d":"44192.95"},{"v":43784.399999999994,"d":"43784.40"},{"v":43507.79999999999,"d":"43507.80"},{"v":44878.09999999999,"d":"44878.10"},{"v":45154.7,"d":"45154.70"},{"v":45563.24999999999,"d":"45563.25"},44746.15,44061,2333235,{"v":-0.07292666209732694,"d":"-7%"}]
[3,"Index","FINNIFTY","2023-09-26",19868.95,{"v":19816.966666666667,"d":"19816.97"},{"v":19722.383333333335,"d":"19722.38"},{"v":19575.81666666667,"d":"19575.82"},{"v":19481.233333333337,"d":"19481.23"},{"v":19963.533333333333,"d":"19963.53"},{"v":20058.11666666666,"d":"20058.12"},{"v":20204.68333333333,"d":"20204.68"},19911.55,19670.4,52120,{"v":0.03990422984836393,"d":"4%"}]
[4,"Index","MIDCPNIFTY","2023-09-25",8941.05,{"v":8917.716666666667,"d":"8917.72"},{"v":8883.233333333334,"d":"8883.23"},{"v":8825.416666666666,"d":"8825.42"},{"v":8790.933333333332,"d":"8790.93"},{"v":8975.533333333335,"d":"8975.53"},{"v":9010.016666666668,"d":"9010.02"},{"v":9067.833333333336,"d":"9067.83"},8952.2,8859.9,97875,{"v":0.17992766726943943,"d":"18%"}]
[5,"Chemical","AARTIIND","2023-09-28",494.55,{"v":496.40000000000003,"d":"496.40"},{"v":490.95000000000005,"d":"490.95"},487.35,{"v":481.90000000000003,"d":"481.90"},{"v":500.00000000000006,"d":"500.00"},505.45,{"v":509.05000000000007,"d":"509.05"},501.85,492.8,11101000,{"v":0.02653967079711485,"d":"3%"}]
[6,"Capital_Goods","ABB","2023-09-28",{"v":4307.5,"d":"4307.50"},{"v":4339.233333333334,"d":"4339.23"},{"v":4258.466666666667,"d":"4258.47"},{"v":4209.433333333333,"d":"4209.43"},{"v":4128.666666666667,"d":"4128.67"},{"v":4388.266666666667,"d":"4388.27"},{"v":4469.033333333334,"d":"4469.03"},{"v":4518.0666666666675,"d":"4518.07"},4420,4290.2,1290250,{"v":0.007810974419058777,"d":"1%"}]
[7,"Pharma","ABBOTINDIA","2023-09-28",{"v":22837.7,"d":"22837.70"},{"v":22926.666666666668,"d":"22926.67"},{"v":22547.033333333336,"d":"22547.03"},{"v":22256.36666666667,"d":"22256.37"},{"v":21876.733333333337,"d":"21876.73"},{"v":23217.333333333336,"d":"23217.33"},{"v":23596.966666666667,"d":"23596.97"},{"v":23887.633333333335,"d":"23887.63"},23306.3,22636,67200,{"v":0.04738154613466334,"d":"5%"}]
[8,"Others","ABCAPITAL","2023-09-28",{"v":185.3,"d":"185.30"},{"v":184.46666666666667,"d":"184.47"},{"v":182.73333333333335,"d":"182.73"},{"v":180.16666666666669,"d":"180.17"},{"v":178.43333333333337,"d":"178.43"},{"v":187.03333333333333,"d":"187.03"},{"v":188.76666666666662,"d":"188.77"},{"v":191.33333333333331,"d":"191.33"},186.2,181.9,35953200,{"v":0.02022678516702421,"d":"2%"}]
[9,"Textile","ABFRL","2023-09-28",{"v":219.7,"d":"219.70"},{"v":219.83333333333334,"d":"219.83"},{"v":218.11666666666667,"d":"218.12"},{"v":216.53333333333333,"d":"216.53"},{"v":214.81666666666666,"d":"214.82"},{"v":221.41666666666669,"d":"221.42"},{"v":223.13333333333333,"d":"223.13"},{"v":224.7166666666667,"d":"224.72"},221.55,218.25,25537200,{"v":0.08183720674083049,"d":"8%"}]
[10,"Cement","ACC","2023-09-28",2020.75,{"v":2023.2166666666665,"d":"2023.22"},{"v":1995.933333333333,"d":"1995.93"},{"v":1971.1166666666666,"d":"1971.12"},{"v":1943.833333333333,"d":"1943.83"},{"v":2048.033333333333,"d":"2048.03"},{"v":2075.316666666666,"d":"2075.32"},{"v":2100.1333333333328,"d":"2100.13"},2050.5,1998.4,6230100,{"v":-0.007835268262385935,"d":"-1%"}]
{"$rows_left_out":202}
{"sheet":"Cash Intra","index":2,"n_rows":245,"n_cols":13,"rows_kept":245,"merged":[[7,0,8,0],[7,1,8,1],[7,2,8,2],[7,3,8,3],[7,4,7,6],[7,7,7,9]]}
[]
[]
[]
[]
[{"$nulls":12},"Back to Main Page"]
["FOR INTRA DAY TRADING",{"$nulls":9},{"$f":"Main!B10","v":"2023-09-04"}]
[]
["Sr.no",null,"CLOSE RATE","Pivot Point","Supports",null,null,"Resistances"]
[{"$nulls":4},"S1","S2","S3","R1","R2","R3","HIGH","LOW","Total Trade Quanity in Lakhs"]
[1,"Nifty 50",{"v":19435.3,"d":"19435.30"},{"v":19383.183333333334,"d":"19383.18"},{"v":19307.81666666667,"d":"19307.82"},{"v":19180.333333333336,"d":"19180.33"},{"v":19104.96666666667,"d":"19104.97"},{"v":19510.666666666668,"d":"19510.67"},{"v":19586.033333333336,"d":"19586.03"},{"v":19713.516666666666,"d":"19713.52"},19458.55,{"v":19255.7,"d":"19255.70"}]
[2,"Nifty Bank",{"v":44436.1,"d":"44436.10"},{"v":44278.46666666667,"d":"44278.47"},{"v":43988.38333333333,"d":"43988.38"},{"v":43540.666666666664,"d":"43540.67"},{"v":43250.58333333333,"d":"43250.58"},{"v":44726.183333333334,"d":"44726.18"},{"v":45016.26666666666,"d":"45016.27"},{"v":45463.98333333334,"d":"45463.98"},44568.55,43830.75]
[3,"Nifty CPSE",3614.25,{"v":3574.4500000000003,"d":"3574.45"},{"v":3529.6000000000004,"d":"3529.60"},{"v":3444.9500000000003,"d":"3444.95"},{"v":3400.1000000000004,"d":"3400.10"},{"v":3659.1000000000004,"d":"3659.10"},3703.95,{"v":3788.6000000000004,"d":"3788.60"},{"v":3619.3,"d":"3619.30"},{"v":3489.8,"d":"3489.80"}]
[4,"Nifty Infra",6016.05,{"v":5993.783333333334,"d":"5993.78"},{"v":5966.466666666667,"d":"5966.47"},{"v":5916.883333333333,"d":"5916.88"},{"v":5889.566666666667,"d":"5889.57"},{"v":6043.366666666668,"d":"6043.37"},{"v":6070.683333333335,"d":"6070.68"},{"v":6120.266666666668,"d":"6120.27"},{"v":6021.1,"d":"6021.10"},{"v":5944.2,"d":"5944.20"}]
[5,"Nifty IT",31514.35,{"v":31404.850000000002,"d":"31404.85"},{"v":31258.750000000004,"d":"31258.75"},31003.15,{"v":30857.050000000003,"d":"30857.05"},{"v":31660.450000000004,"d":"31660.45"},{"v":31806.550000000003,"d":"31806.55"},{"v":32062.150000000005,"d":"32062.15"},31550.95,31149.25]
[6,"Nifty PSE",{"v":5621.4,"d":"5621.40"},{"v":5563.416666666667,"d":"5563.42"},{"v":5500.133333333334,"d":"5500.13"},{"v":5378.866666666667,"d":"5378.87"},{"v":5315.583333333334,"d":"5315.58"},{"v":5684.683333333334,"d":"5684.68"},{"v":5747.966666666667,"d":"5747.97"},{"v":5869.2333333333345,"d":"5869.23"},{"v":5626.7,"d":"5626.70"},5442.15]
[7,"Nifty Midcap 50",{"v":11260.6,"d":"11260.60"},{"v":11229.866666666667,"d":"11229.87"},{"v":11184.983333333334,"d":"11184.98"},{"v":11109.366666666667,"d":"11109.37"},{"v":11064.483333333334,"d":"11064.48"},{"v":11305.483333333334,"d":"11305.48"},{"v":11350.366666666669,"d":"11350.37"},{"v":11425.983333333334,"d":"11425.98"},11274.75,11154.25]
[8,"ABB",4291.45,{"v":4320.483333333334,"d":"4320.48"},{"v":4241.966666666667,"d":"4241.97"},{"v":4192.483333333334,"d":"4192.48"},{"v":4113.966666666667,"d":"4113.97"},{"v":4369.966666666667,"d":"4369.97"},{"v":4448.483333333334,"d":"4448.48"},{"v":4497.966666666667,"d":"4497.97"},4399,4271,1.64901]
[9,"ABBOTINDIA",22704.65,22825.75,22413.95,22123.25,21711.45,23116.45,{"v":23528.250000000004,"d":"23528.25"},23818.95,23237.55,22535.05,0.18058]
[10,"ABCAPITAL",184.1,{"v":183.03333333333333,"d":"183.03"},{"v":181.06666666666666,"d":"181.07"},{"v":178.03333333333333,"d":"178.03"},{"v":176.06666666666666,"d":"176.07"},{"v":186.06666666666666,"d":"186.07"},{"v":188.0333333333333,"d":"188.03"},{"v":191.06666666666666,"d":"191.07"},185,180,63.10913]
[11,"ABFRL",218.35,{"v":218.95000000000002,"d":"218.95"},{"v":216.90000000000003,"d":"216.90"},{"v":215.45000000000002,"d":"215.45"},{"v":213.40000000000003,"d":"213.40"},{"v":220.40000000000003,"d":"220.40"},{"v":222.45000000000005,"d":"222.45"},{"v":223.90000000000003,"d":"223.90"},221,217.5,17.09014]
{"$rows_left_out":226}
{"sheet":"MidCap Intra","index":3,"n_rows":530,"n_cols":13,"rows_kept":530,"merged":[[0,0,0,1],[8,0,9,0],[8,1,9,1],[8,2,9,2],[8,3,9,3],[8,4,8,6],[8,7,8,9]]}
[]
[]
[]
[]
[{"$nulls":11},"Back To Main Page"]
["FOR INTRA DAY TRADING",{"$nulls":9},{"$f":"Main!B10","v":"2023-09-04"}]
[null,null," "]
[]
["Sr.no","Scrip","CLOSE RATE","Pivot Point","Supports",null,null,"Resistances"]
[{"$nulls":4},"S1","S2","S3","R1","R2","R3","HIGH","LOW","Total Trade Quanity in Lakhs"]
[1,"360ONE",477.6,{"v":482.43333333333334,"d":"482.43"},{"v":470.1666666666667,"d":"470.17"},{"v":462.73333333333335,"d":"462.73"},{"v":450.4666666666667,"d":"450.47"},{"v":489.8666666666667,"d":"489.87"},{"v":502.1333333333333,"d":"502.13"},{"v":509.56666666666666,"d":"509.57"},494.7,475,9.69859]
[2,"3MINDIA",31151.35,{"v":31184.11666666667,"d":"31184.12"},{"v":30968.233333333337,"d":"30968.23"},{"v":30785.11666666667,"d":"30785.12"},{"v":30569.233333333337,"d":"30569.23"},{"v":31367.233333333337,"d":"31367.23"},{"v":31583.11666666667,"d":"31583.12"},{"v":31766.233333333337,"d":"31766.23"},31400,31001,0.02486]
[3,"AARTIDRUGS",569.6,{"v":571.2,"d":"571.20"},564.45,{"v":559.3,"d":"559.30"},552.55,{"v":576.3500000000001,"d":"576.35"},{"v":583.1000000000001,"d":"583.10"},{"v":588.2500000000002,"d":"588.25"},577.95,566.05,1.70897]
[4,"AARTIIND",491.05,{"v":493.1333333333334,"d":"493.13"},{"v":487.91666666666674,"d":"487.92"},{"v":484.78333333333336,"d":"484.78"},{"v":479.5666666666667,"d":"479.57"},{"v":496.26666666666677,"d":"496.27"},{"v":501.48333333333335,"d":"501.48"},{"v":504.6166666666668,"d":"504.62"},498.35,490,17.88907]
[5,"AAVAS",1627.25,{"v":1638.3833333333332,"d":"1638.38"},{"v":1609.0166666666664,"d":"1609.02"},{"v":1590.7833333333333,"d":"1590.78"},{"v":1561.4166666666665,"d":"1561.42"},{"v":1656.6166666666663,"d":"1656.62"},{"v":1685.9833333333331,"d":"1685.98"},{"v":1704.2166666666662,"d":"1704.22"},1667.75,1620.15,2.09849]
[6,"ABB",4291.45,{"v":4320.483333333334,"d":"4320.48"},{"v":4241.966666666667,"d":"4241.97"},{"v":4192.483333333334,"d":"4192.48"},{"v":4113.966666666667,"d":"4113.97"},{"v":4369.966666666667,"d":"4369.97"},{"v":4448.483333333334,"d":"4448.48"},{"v":4497.966666666667,"d":"4497.97"},4399,4271,1.64901]
[7,"ABBOTINDIA",22704.65,22825.75,22413.95,22123.25,21711.45,23116.45,{"v":23528.250000000004,"d":"23528.25"},23818.95,23237.55,22535.05,0.18058]
[8,"ACC",2011.25,{"v":2012.9666666666665,"d":"2012.97"},{"v":1988.2833333333328,"d":"1988.28"},{"v":1965.3166666666664,"d":"1965.32"},{"v":1940.6333333333328,"d":"1940.63"},{"v":2035.933333333333,"d":"2035.93"},{"v":2060.616666666667,"d":"2060.62"},{"v":2083.583333333333,"d":"2083.58"},2037.65,1990,5.11773]
[9,"ADANIENT",2450.05,{"v":2431.866666666667,"d":"2431.87"},{"v":2398.1833333333334,"d":"2398.18"},{"v":2346.3166666666666,"d":"2346.32"},{"v":2312.633333333333,"d":"2312.63"},{"v":2483.7333333333336,"d":"2483.73"},{"v":2517.416666666667,"d":"2517.42"},{"v":2569.2833333333338,"d":"2569.28"},2465.55,2380,67.64397]
[10,"ADANIGREEN",949.1,{"v":937.0833333333334,"d":"937.08"},{"v":917.1666666666667,"d":"917.17"},{"v":885.2333333333333,"d":"885.23"},{"v":865.3166666666667,"d":"865.32"},{"v":969.0166666666668,"d":"969.02"},{"v":988.9333333333335,"d":"988.93"},{"v":1020.8666666666668,"d":"1020.87"},957,905.15,40.96797]
{"$rows_left_out":511}
{"sheet":"Bulk Deals","index":4,"n_rows":167,"n_cols":8,"rows_kept":167,"merged":[[4,0,4,1],[4,2,4,3],[6,1,6,2]]}
[" "]
[]
[]
[]
[]
[{"$nulls":4},"Back To Main Page"]
["Subject :","BULK DEAL",null,{"$f":"Main!B10","v":"2023-09-04"}]
[]
["Date","Scrip code","Scrip Name","Client Name","Buy / Sell","Quantity Traded","Trade Price / Wt.Avg.trade price","Exchange  "]
["2023-09-01",540615,"7NR","VAX FASHION PRIVATE LIMITED","SELL",{"v":1550000,"d":"1,550,000"},0.62,"BSE"]
["2023-09-01",539773,"ADVIKCA","G G ENGINEERING LIMITED","BUY",{"v":389344,"d":"389,344"},2.48,"BSE"]
["2023-09-01",539773,"ADVIKCA","SAROJ GUPTA","SELL",{"v":2140842,"d":"2,140,842"},2.49,"BSE"]
["2023-09-01",539773,"ADVIKCA","G G ENGINEERING LIMITED","SELL",{"v":1389888,"d":"1,389,888"},2.57,"BSE"]
["2023-09-01",531017,"ARISE","LOREM INVESTMENT","SELL",{"v":53070,"d":"53,070"},13.77,"BSE"]
["2023-09-01",531017,"ARISE","LOREM INVESTMENT","BUY",59,13.76,"BSE"]
["2023-09-01",540023,"COLORCHIPS","SETU SECURITIES PVT. LTD.","SELL",{"v":1134869,"d":"1,134,869"},4.83,"BSE"]
["2023-09-01",540023,"COLORCHIPS","MULTIPLIER SHARE & STOCK ADVISORS PRIVATE LIMITED","SELL",{"v":924719,"d":"924,719"},4.68,"BSE"]
["2023-09-01",540023,"COLORCHIPS","SAHASTRAA ADVISORS PRIVATE LIMITED","SELL",{"v":100550,"d":"100,550"},4.94,"BSE"]
["2023-09-01",540023,"COLORCHIPS","SAHASTRAA ADVISORS PRIVATE LIMITED","BUY",{"v":500000,"d":"500,000"},4.92,"BSE"]
["2023-09-01",540023,"COLORCHIPS","ANKITA VISHAL SHAH","BUY",{"v":1808324,"d":"1,808,324"},4.67,"BSE"]
{"$rows_left_out":148}
{"sheet":"Call Tracker (Equity & F&O)","index":5,"n_rows":270,"n_cols":18,"rows_kept":270}
[]
[]
[]
[]
[{"$nulls":12},"Back To Main Page"]
["Retail Research Technical Calls & Fundamental Performance Report for the month of August-2023"]
[{"$nulls":12},{"$f":"Main!B10","v":"2023-09-04"}]
[null,"Positional  Call"]
["Sr.no","Date",null,"Company","Rec","Rec Price","Stop Loss***","Call Closed At","Target","Remark","Profit / Loss per Share","All charges","Net Gain / Loss  %","Status","Closed Date","Market Closing Price"]
[1,"2023-07-12",null,"HDFCBANK","Accu","1595-1655",1540,null,"1800-1900","Open",{"$nulls":5},{"$f":"VLOOKUP(D10,'MidCap Intra'!$B$11:$C$568,2,0)","v":{"v":1574.7,"d":"1574.70"}},null,"H"]
[2,"2023-07-26",null,"BANKBARODA","Accu","191-197",185,null,"215-225","Open",{"$nulls":5},{"$f":"VLOOKUP(D11,'MidCap Intra'!$B$11:$C$568,2,0)","v":{"v":190.6,"d":"190.60"}},null,"H"]
[3,"2023-07-26",null,"RVNL","Accu",127.5,118,134.75,"145-150","Profit of Rs.7.25/-",{"$f":"H12-F12","v":7.25},{"$f":"(F12*-0.3)/100","v":{"v":-0.3825,"d":"-0.38"}},{"$f":"(K12+L12)/F12","v":{"v":0.05386274509803921,"d":"5.39%"}},"Successful","2023-09-01"," ",null,"H"]
[4,"2023-08-04",null,"VINATIORGA","Accu","1805-1855",1745,null,"2000-2050","Open",{"$nulls":5},{"$f":"VLOOKUP(D13,'MidCap Intra'!$B$11:$C$568,2,0)","v":1855.85},null,"H"]
[5,"2023-08-07",null,"TATAMTRDVR","Accu","381-399",365,null,"440-460","Open",{"$nulls":5},{"$f":"VLOOKUP(D14,'MidCap Intra'!$B$11:$C$568,2,0)","v":406.05},null,"H"]
[6,"2023-08-29",null,"FLUOROCHEM","Accu","2815-2935",2700,null,"3180-3380","Open",{"$nulls":5},{"$f":"VLOOKUP(D15,'MidCap Intra'!$B$11:$C$568,2,0)","v":3073.55},null,"H"]
[7,"2023-08-29",null,"JAMNAAUTO","Accu",114.5,105,122.25,"124-130","Profit of Rs.7.75/-",{"$f":"H16-F16","v":7.75},{"$f":"(F16*-0.3)/100","v":{"v":-0.3435,"d":"-0.34"}},{"$f":"(K16+L16)/F16","v":{"v":0.06468558951965066,"d":"6.47%"}},"Successful","2023-09-01"," ",null,"H"]
[8,"2023-08-30",null,"AMARAJABAT","Accu","597-627",577,null,"670-700","Open",{"$nulls":5},{"$f":"VLOOKUP(D17,'MidCap Intra'!$B$11:$C$568,2,0)","v":625.55},null,"H"]
[9,"2023-08-31",null,"GMMPFAUDLR","Accu",1530,1415,1612.5,"1640-1700","Profit of Rs.82.5/-",{"$f":"H18-F18","v":82.5},{"$f":"(F18*-0.3)/100","v":-4.59},{"$f":"(K18+L18)/F18","v":{"v":0.05092156862745098,"d":"5.09%"}},"Successful","2023-09-01"," ",null,"H"]
[10,"2023-09-01",null,"TATASTEEL","Accu","123.5-126.5",119,null,"134-140","Open"]
[11,"2023-09-01",null,"FEDERALBNK","Accu","136.5-141.5",133,null,"149-155","Open"]
{"$rows_left_out":237}