{"text_format":"3","workbook":"xlsx","n_sheets":10,"sheets":["Main","Future Intra","Cash Intra","MidCap Intra","Bulk Deals","Call Tracker (Equity & F&O)","Sheet2","Sheet1","Sheet3","Sheet4"],"not_rendered":{"images":4,"defined_names":5},"read":"whole","date_system":"1900"}

{"sheet":"Main","index":0,"n_rows":27,"n_cols":11,"rows_kept":27}
[null,"                                                                                                 "]
{"$rows_empty":8}
[null,"2019-08-02"]
[]
[null,"Sheet No.","Template Name","Summary"]
[null,1,"Future Intra","For Intraday trading in F&O segment"]
[null,2,"Cash Intra","For Intraday trading in cash market segment"]
[null,3,"Mid-cap Intra","For Intraday trading in Mid-cap stocks"]
[null,4,"Bulk Deals","Reveals Bulk Deals carried on NSE & BSE"]
[null,5,"Call Tracker"]
{"$rows_empty":9}
[{"$nulls":10},"`"]

{"sheet":"Future Intra","index":1,"n_rows":205,"n_cols":15,"rows_kept":205,"merged":[[8,0,9,0],[8,1,9,1],[8,2,9,2],[8,5,8,7],[8,8,8,10]]}
[]
[]
[]
[]
[{"$nulls":12},"Back to Main Page"]
["FOR INTRA DAY TRADING",{"$nulls":10},{"$f":"Main!B10","v":"2019-08-02"}]
[]
[]
["Sr.no","Sector","Scrip","CLOSE RATE","Pivot Point","Supports",null,null,"Resistances"]
[null,"Sector",null,"Point","Point","S1","S2","S3","R1","R2","R3","HIGH","LOW","OI","% Change in OI"]
[1,"Index","BANKNIFTY",{"v":28499.3,"d":"28499.30"},{"v":28521.283333333336,"d":"28521.28"},{"v":28118.566666666673,"d":"28118.57"},{"v":27737.833333333336,"d":"27737.83"},{"v":27335.116666666672,"d":"27335.12"},{"v":28902.016666666674,"d":"28902.02"},{"v":29304.73333333334,"d":"29304.73"},{"v":29685.466666666674,"d":"29685.47"},28924,28140.55,1736640,{"v":0.16040572505312112,"d":"16.04%"}]
[2,"Index","NIFTY",11015.35,{"v":11004.949999999999,"d":"11004.95"},{"v":10911.499999999998,"d":"10911.50"},10807.65,{"v":10714.199999999999,"d":"10714.20"},{"v":11108.799999999997,"d":"11108.80"},{"v":11202.249999999998,"d":"11202.25"},{"v":11306.099999999997,"d":"11306.10"},11098.4,10901.1,20010750,{"v":0.07890075940767818,"d":"7.89%"}]
[3,"Index","NIFTYIT",{"v":15423,"d":"15423.00"},{"v":15481,"d":"15481.00"},{"v":15292,"d":"15292.00"},{"v":15161,"d":"15161.00"},{"v":14972,"d":"14972.00"},{"v":15612,"d":"15612.00"},{"v":15801,"d":"15801.00"},{"v":15932,"d":"15932.00"},15670,15350,13950,{"v":0.007220216606498195,"d":"0.72%"}]
[4,"Cement","ACC",1522.65,{"v":1528.1500000000003,"d":"1528.15"},{"v":1500.9000000000005,"d":"1500.90"},{"v":1479.1500000000003,"d":"1479.15"},{"v":1451.9000000000005,"d":"1451.90"},{"v":1549.9000000000005,"d":"1549.90"},1577.15,{"v":1598.9000000000005,"d":"1598.90"},1555.4,1506.4,2302800,{"v":0.03042777877214963,"d":"3.04%"}]
[5,"Others","ADANIENT",{"v":125.7,"d":"125.70"},{"v":125.96666666666665,"d":"125.97"},{"v":122.68333333333331,"d":"122.68"},{"v":119.66666666666666,"d":"119.67"},{"v":116.38333333333331,"d":"116.38"},{"v":128.9833333333333,"d":"128.98"},{"v":132.26666666666665,"d":"132.27"},{"v":135.2833333333333,"d":"135.28"},129.25,122.95,29716000,{"v":1.6179048132668194E-3,"d":"0.16%"}]
[6,"Others","ADANIPORTS",373.25,{"v":373.6333333333334,"d":"373.63"},{"v":367.8666666666668,"d":"367.87"},{"v":362.4833333333334,"d":"362.48"},{"v":356.7166666666668,"d":"356.72"},{"v":379.01666666666677,"d":"379.02"},{"v":384.7833333333333,"d":"384.78"},{"v":390.16666666666674,"d":"390.17"},379.4,368.25,15087500,{"v":-0.01565813081063448,"d":"-1.57%"}]
[7,"Power","ADANIPOWER",{"v":59.5,"d":"59.50"},{"v":59.61666666666667,"d":"59.62"},{"v":58.03333333333333,"d":"58.03"},{"v":56.56666666666666,"d":"56.57"},{"v":54.98333333333333,"d":"54.98"},{"v":61.083333333333336,"d":"61.08"},{"v":62.666666666666664,"d":"62.67"},{"v":64.13333333333334,"d":"64.13"},61.2,58.15,111240000,{"v":-0.008202567760342368,"d":"-0.82%"}]
[8,"Automobile","AMARAJABAT",660.35,{"v":661.2333333333333,"d":"661.23"},{"v":650.9166666666667,"d":"650.92"},{"v":641.4833333333333,"d":"641.48"},{"v":631.1666666666667,"d":"631.17"},{"v":670.6666666666667,"d":"670.67"},{"v":680.9833333333333,"d":"680.98"},{"v":690.4166666666667,"d":"690.42"},671.55,651.8,1778000,{"v":0.0817717206132879,"d":"8.18%"}]
[9,"Cement","AMBUJACEM",{"v":198,"d":"198.00"},{"v":198.58333333333334,"d":"198.58"},{"v":194.66666666666669,"d":"194.67"},{"v":191.33333333333334,"d":"191.33"},{"v":187.41666666666669,"d":"187.42"},{"v":201.91666666666669,"d":"201.92"},{"v":205.83333333333337,"d":"205.83"},{"v":209.16666666666669,"d":"209.17"},202.5,195.25,21357500,{"v":0.03601746301236963,"d":"3.60%"}]
[10,"Others","APOLLOHOSP",{"v":1364.2,"d":"1364.20"},1362.45,{"v":1344.4,"d":"1344.40"},{"v":1324.6000000000001,"d":"1324.60"},{"v":1306.5500000000002,"d":"1306.55"},1382.25,{"v":1400.2999999999997,"d":"1400.30"},{"v":1420.1,"d":"1420.10"},1380.5,1342.65,1279500,{"v":-3.1164783794312427E-3,"d":"-0.31%"}]
{"$rows_left_out":172}
{"sheet":"Cash Intra","index":2,"n_rows":247,"n_cols":13,"rows_kept":247,"merged":[[7,0,8,0],[7,1,8,1],[7,2,8,2],[7,3,8,3],[7,4,7,6],[7,7,7,9]]}
[]
[]
[]
[]
[{"$nulls":12},"Back to Main Page"]
["FOR INTRA DAY TRADING",{"$nulls":9},{"$f":"Main!B10","v":"2019-08-02"}]
[]
["Sr.no","Scrip","CLOSE RATE","Pivot Point","Supports",null,null,"Resistances"]
[null,null,"Point",null,"S1","S2","S3","R1","R2","R3","HIGH","LOW","Total Trade Quanity in Lakhs"]
[1,"Nifty 50",10980,10979.25,10881.75,{"v":10783.5,"d":"10783.50"},{"v":10686,"d":"10686.00"},{"v":11077.5,"d":"11077.50"},{"v":11175,"d":"11175.00"},11273.25,11076.75,10881]
[2,"Nifty Bank",28367.25,{"v":28411.43333333333,"d":"28411.43"},{"v":28003.16666666666,"d":"28003.17"},{"v":27639.08333333333,"d":"27639.08"},{"v":27230.81666666666,"d":"27230.82"},{"v":28775.516666666663,"d":"28775.52"},{"v":29183.783333333333,"d":"29183.78"},{"v":29547.866666666665,"d":"29547.87"},28819.7,28047.35]
[3,"Nifty CPSE",1993,{"v":1994.7166666666665,"d":"1994.72"},{"v":1970.833333333333,"d":"1970.83"},{"v":1948.6666666666665,"d":"1948.67"},{"v":1924.783333333333,"d":"1924.78"},{"v":2016.883333333333,"d":"2016.88"},{"v":2040.7666666666667,"d":"2040.77"},{"v":2062.933333333333,"d":"2062.93"},2018.6,1972.55]
[4,"Nifty Infra",3048.15,{"v":3054.7666666666664,"d":"3054.77"},{"v":3016.833333333333,"d":"3016.83"},{"v":2985.5166666666664,"d":"2985.52"},{"v":2947.583333333333,"d":"2947.58"},{"v":3086.083333333333,"d":"3086.08"},{"v":3124.0166666666664,"d":"3124.02"},{"v":3155.333333333333,"d":"3155.33"},3092.7,3023.45]
[5,"Nifty IT",15332.1,{"v":15401.133333333333,"d":"15401.13"},{"v":15208.716666666667,"d":"15208.72"},{"v":15085.333333333334,"d":"15085.33"},{"v":14892.916666666668,"d":"14892.92"},{"v":15524.516666666666,"d":"15524.52"},{"v":15716.933333333334,"d":"15716.93"},{"v":15840.316666666666,"d":"15840.32"},15593.55,15277.75]
[6,"Nifty PSE",3199.8,{"v":3198.2833333333333,"d":"3198.28"},{"v":3169.0666666666666,"d":"3169.07"},{"v":3138.3333333333335,"d":"3138.33"},{"v":3109.116666666667,"d":"3109.12"},{"v":3229.0166666666664,"d":"3229.02"},{"v":3258.2333333333327,"d":"3258.23"},{"v":3288.9666666666662,"d":"3288.97"},3227.5,3167.55]
[7,"Nifty Midcap 50",4301.9,{"v":4305.733333333333,"d":"4305.73"},{"v":4248.7666666666655,"d":"4248.77"},{"v":4195.633333333333,"d":"4195.63"},{"v":4138.666666666666,"d":"4138.67"},{"v":4358.866666666665,"d":"4358.87"},{"v":4415.833333333332,"d":"4415.83"},{"v":4468.966666666664,"d":"4468.97"},4362.7,4252.6]
[8,"ABB",1352.65,{"v":1362.3500000000001,"d":"1362.35"},{"v":1332.7500000000002,"d":"1332.75"},{"v":1312.8500000000001,"d":"1312.85"},{"v":1283.2500000000002,"d":"1283.25"},{"v":1382.2500000000002,"d":"1382.25"},{"v":1411.8500000000001,"d":"1411.85"},{"v":1431.7500000000002,"d":"1431.75"},1391.95,1342.45,0.50873]
[9,"ACC",1515.3,{"v":1523.5666666666666,"d":"1523.57"},{"v":1490.7333333333331,"d":"1490.73"},{"v":1466.1666666666665,"d":"1466.17"},{"v":1433.333333333333,"d":"1433.33"},{"v":1548.1333333333332,"d":"1548.13"},{"v":1580.9666666666667,"d":"1580.97"},{"v":1605.5333333333333,"d":"1605.53"},1556.4,1499,8.05812]
[10,"AUBANK",657.2,{"v":660.9333333333334,"d":"660.93"},{"v":648.9166666666667,"d":"648.92"},{"v":640.6333333333333,"d":"640.63"},{"v":628.6166666666667,"d":"628.62"},{"v":669.2166666666668,"d":"669.22"},{"v":681.2333333333335,"d":"681.23"},{"v":689.5166666666669,"d":"689.52"},672.95,652.65,1.07709]
[11,"ADANIPORTS",371.1,371.75,365.65,{"v":360.2,"d":"360.20"},{"v":354.09999999999997,"d":"354.10"},{"v":377.2,"d":"377.20"},{"v":383.3,"d":"383.30"},388.75,377.85,366.3,17.20133]
{"$rows_left_out":228}
{"sheet":"MidCap Intra","index":3,"n_rows":545,"n_cols":13,"rows_kept":545,"merged":[[0,0,0,1],[8,0,9,0],[8,1,9,1],[8,2,9,2],[8,3,9,3],[8,4,8,6],[8,7,8,9]]}
[]
[]
[]
[]
[{"$nulls":11},"Back To Main Page"]
["FOR INTRA DAY TRADING",{"$nulls":9},{"$f":"Main!B10","v":"2019-08-02"}]
[null,null," "]
[]
["Sr.no","Scrip","CLOSE RATE","Pivot Point","Supports",null,null,"Resistances"]
[null,null,"Point",null,"S1","S2","S3","R1","R2","R3","HIGH","LOW","Total Trade Quanity in Lakhs"]
[1,"3MINDIA",20704.1,{"v":20875.8,"d":"20875.80"},{"v":20458.3,"d":"20458.30"},{"v":20212.5,"d":"20212.50"},{"v":19795,"d":"19795.00"},{"v":21121.6,"d":"21121.60"},{"v":21539.1,"d":"21539.10"},{"v":21784.899999999998,"d":"21784.90"},21293.3,20630,0.00663]
[2,"ABB",1352.65,{"v":1362.3500000000001,"d":"1362.35"},{"v":1332.7500000000002,"d":"1332.75"},{"v":1312.8500000000001,"d":"1312.85"},{"v":1283.2500000000002,"d":"1283.25"},{"v":1382.2500000000002,"d":"1382.25"},{"v":1411.8500000000001,"d":"1411.85"},{"v":1431.7500000000002,"d":"1431.75"},1391.95,1342.45,0.50873]
[3,"ACC",1515.3,{"v":1523.5666666666666,"d":"1523.57"},{"v":1490.7333333333331,"d":"1490.73"},{"v":1466.1666666666665,"d":"1466.17"},{"v":1433.333333333333,"d":"1433.33"},{"v":1548.1333333333332,"d":"1548.13"},{"v":1580.9666666666667,"d":"1580.97"},{"v":1605.5333333333333,"d":"1605.53"},1556.4,1499,8.05812]
[4,"AIAENG",1721.45,{"v":1718.6499999999999,"d":"1718.65"},{"v":1705.2999999999997,"d":"1705.30"},{"v":1689.1499999999999,"d":"1689.15"},{"v":1675.7999999999997,"d":"1675.80"},{"v":1734.7999999999997,"d":"1734.80"},{"v":1748.1499999999996,"d":"1748.15"},{"v":1764.2999999999997,"d":"1764.30"},1732,1702.5,0.3794]
[5,"APLAPOLLO",1384.85,{"v":1391.3500000000001,"d":"1391.35"},{"v":1344.7000000000003,"d":"1344.70"},{"v":1304.5500000000002,"d":"1304.55"},{"v":1257.9000000000003,"d":"1257.90"},{"v":1431.5000000000002,"d":"1431.50"},{"v":1478.1500000000003,"d":"1478.15"},{"v":1518.3000000000002,"d":"1518.30"},1438,1351.2,0.0959]
[6,"AUBANK",657.2,{"v":660.9333333333334,"d":"660.93"},{"v":648.9166666666667,"d":"648.92"},{"v":640.6333333333333,"d":"640.63"},{"v":628.6166666666667,"d":"628.62"},{"v":669.2166666666668,"d":"669.22"},{"v":681.2333333333335,"d":"681.23"},{"v":689.5166666666669,"d":"689.52"},672.95,652.65,1.07709]
[7,"AAVAS",1466.5,{"v":1471.5166666666667,"d":"1471.52"},{"v":1442.9833333333333,"d":"1442.98"},{"v":1419.4666666666667,"d":"1419.47"},{"v":1390.9333333333334,"d":"1390.93"},{"v":1495.0333333333333,"d":"1495.03"},{"v":1523.5666666666666,"d":"1523.57"},{"v":1547.0833333333333,"d":"1547.08"},1500.05,1448,0.4841]
[8,"ADANIGREEN",45.6,46.15,44.55,{"v":43.5,"d":"43.50"},{"v":41.9,"d":"41.90"},{"v":47.199999999999996,"d":"47.20"},{"v":48.800000000000004,"d":"48.80"},{"v":49.849999999999994,"d":"49.85"},47.75,45.1,5.03495]
[9,"ADANIPORTS",371.1,371.75,365.65,{"v":360.2,"d":"360.20"},{"v":354.09999999999997,"d":"354.10"},{"v":377.2,"d":"377.20"},{"v":383.3,"d":"383.30"},388.75,377.85,366.3,17.20133]
[10,"ADANIPOWER",59.4,{"v":59.53333333333333,"d":"59.53"},{"v":57.96666666666666,"d":"57.97"},{"v":56.53333333333333,"d":"56.53"},{"v":54.96666666666666,"d":"54.97"},{"v":60.96666666666666,"d":"60.97"},{"v":62.533333333333324,"d":"62.53"},{"v":63.96666666666666,"d":"63.97"},61.1,58.1,111.53236]
{"$rows_left_out":513}
{"sheet":"Bulk Deals","index":4,"n_rows":53,"n_cols":8,"rows_kept":53,"merged":[[4,0,4,1],[4,2,4,3],[6,1,6,2]]}
[" "]
[]
[]
[]
[]
[{"$nulls":4},"Back To Main Page"]
["Subject :","BULK DEAL",null,{"$f":"Main!B10","v":"2019-08-02"}]
[]
["Date","Scrip code","Scrip Name","Client Name","Buy / Sell","Quantity Traded","Trade Price / Wt.Avg.trade price","Exchange  "]
["2019-08-01",541302,"DHRUV","SAAJAN SUBHASH RATHOD","BUY",{"v":80000,"d":"80,000"},{"v":24.9,"d":"24.90"},"BSE"]
["2019-08-01",541302,"DHRUV","AMKOR ENTERPRISES PRIVATE LIMITED","SELL",{"v":80000,"d":"80,000"},24.04,"BSE"]
["2019-08-01",539225,"JIYAECO","RAHUL SHARMA","BUY",{"v":162216,"d":"162,216"},50.31,"BSE"]
["2019-08-01",539225,"JIYAECO","RAHUL SHARMA","SELL",{"v":162216,"d":"162,216"},49.31,"BSE"]
["2019-08-01",540952,"LAL","TANVI GUPTA","BUY",{"v":250000,"d":"250,000"},5.76,"BSE"]
["2019-08-01",540952,"LAL","RISHU AGARWAL","SELL",{"v":160000,"d":"160,000"},5.76,"BSE"]
["2019-08-01",540952,"LAL","R S SERVICES PRIVATE LIMITED","SELL",{"v":90000,"d":"90,000"},5.76,"BSE"]
["2019-08-01",539814,"RADHEY","RAJESH SHANTILAL VAKHARIA","BUY",{"v":22000,"d":"22,000"},18.01,"BSE"]
["2019-08-01",500390,"RELINFRA","TOWER RESEARCH CAPITAL MARKETS INDIA PRIVATE LIMITED","BUY",{"v":1319622,"d":"1,319,622"},50.02,"BSE"]
["2019-08-01",500390,"RELINFRA","TOWER RESEARCH CAPITAL MARKETS INDIA PRIVATE LIMITED","SELL",{"v":1319622,"d":"1,319,622"},50.09,"BSE"]
["2019-08-01",542383,"RITCO","VIPUL MOHAN PATEL","SELL",{"v":123200,"d":"123,200"},54.44,"BSE"]
{"$rows_left_out":34}
{"sheet":"Call Tracker (Equity & F&O)","index":5,"n_rows":248,"n_cols":18,"rows_kept":248,"merged":[[54,0,55,0],[54,1,55,1],[54,9,55,9],[54,11,55,11],[54,12,55,12],[54,13,55,13],[54,14,55,14],[56,0,57,0],[56,1,57,1],[56,9,57,9],[56,11,57,11],[56,12,57,12],[56,13,57,13],[56,14,57,14]]}
[]
[]
[]
[]
[{"$nulls":12},"Back To Main Page"]
["Retail Research Technical Calls & Fundamental Performance Report for the month of August-2019 "]
[{"$nulls":12},{"$f":"Main!B10","v":"2019-08-02"}]
[null,"Positional  Call"]
["Sr.no","Date",null,"Company","Rec","Rec Price","Stop Loss***","Call Closed At","Target","Remark","Profit / Loss per Share","Gain / Loss  %","Status","Closed Date","NSE Closed Price"]
[1,"2019-07-10",null,"TCS","Buy",2110,1973,2211,"2295-2345","Profit of Rs.101/-",{"$f":"H10-F10","v":101},{"$f":"K10/F10","v":{"v":0.047867298578199054,"d":"4.79%"}},"Successful","2019-08-01",{"$nulls":3},"H"]
[2,"2019-07-12",null,"LT","Buy<>",1457,1353,1352.5,"1630-1680","Loss of Rs.104.50/-",{"$f":"H11-F11","v":-104.5},{"$f":"K11/F11","v":{"v":-0.07172271791352093,"d":"-7.17%"}},"Unsuccessful","2019-08-01",{"$nulls":3},"H"]
[3,"2019-07-17",null,"BHARTIARTL","Buy","347-349",322,null,"392 -396","Open",{"$nulls":4},{"$f":"VLOOKUP(D12,Sheet2!A14:M1653,6,0)","v":337.6},null,null,"R"]
[4,"2019-07-18",null,"NAVINFLUOR","Buy",612,570,635,"680 -700","Part Profit of Rs.23/-",{"$f":"H13-F13","v":23},{"$f":"K13/F13","v":{"v":0.03758169934640523,"d":"3.76%"}},"Successful","2019-08-01",{"$f":"VLOOKUP(D13,Sheet2!A9:M1648,6,0)","v":622.8},null,null,"H"]
[5,"2019-07-19",null,"ACC","Buy",1620,1518,1515,"1750-1800","Loss of Rs.105/-",-105,{"v":-0.06481481481481481,"d":"-6.48%"},"Unsuccessful","2019-08-01",{"$nulls":3},"H"]
[6,"2019-07-22",null,"MOTHERSUMI","Buy","109-111",103,null,"121-123","Open",{"$nulls":4},{"$f":"VLOOKUP(D15,Sheet2!A18:M1657,6,0)","v":106.75},null,null,"R"]
[7,"2019-07-26",null,"M&M","Buy","550-555",530,null,"590-600","Open",{"$nulls":4},{"$f":"VLOOKUP(D16,Sheet2!A19:M1658,6,0)","v":550},null,null,"H"]
[8,"2019-07-26",null,"GLENMARK","Buy","424-427",395,null,"490-500","Open",{"$nulls":4},{"$f":"VLOOKUP(D17,Sheet2!A20:M1659,6,0)","v":426.05},null,null,"H"]
[9,"2019-07-31",null,"BANKBARODA","Buy","105.50-107.50",99,null,"120-122","Open",{"$nulls":4},{"$f":"VLOOKUP(D18,Sheet2!A21:M1660,6,0)","v":106.7},null,null,"H"]
[10,"2019-08-01",null,"WIPRO","Sell","275-277",292,null,"250-240","Open",{"$nulls":4},{"$f":"VLOOKUP(D19,Sheet2!A22:M1661,6,0)","v":265.3},null,null,"H"]
[11,"2019-08-01",null,"TATASTEEL","Buy","427-430",405,null,"470-475","Open",{"$nulls":4},{"$f":"VLOOKUP(D20,Sheet2!A23:M1662,6,0)","v":432.05},null,null,"R"]
{"$rows_left_out":204}
{"sheet":"Sheet2","index":6,"n_rows":1899,"n_cols":14,"rows_kept":1899,"hidden":true}
["SYMBOL","SERIES","OPEN","HIGH","LOW","CLOSE","LAST","PREVCLOSE","TOTTRDQTY","TOTTRDVAL","TIMESTAMP","TOTALTRADES","ISIN","ISIN"]
["20MICRONS","EQ",34,34.6,33.55,33.8,34.05,34.1,13555,460021.1,"2019-07-31",132,"INE144J01027"]
["21STCENMGM","EQ",15.35,15.35,15.05,15.05,15.05,15.35,114,1716,"2019-07-31",6,"INE253B01015"]
["3IINFOTECH","EQ",2.4,2.4,2.25,2.25,2.25,2.35,1549806,3552923.15,"2019-07-31",843,"INE748C01020"]
["3MINDIA","EQ",20990,21222,20669.25,21107.9,21100,20989.85,846,17699531.05,"2019-07-31",406,"INE470A01017"]
["5PAISA","EQ",168.75,176,168.75,169.4,171.5,177.6,4945,836353.35,"2019-07-31",158,"INE618L01018"]
["63MOONS","EQ",92,95.45,90.75,95.4,95.45,90.95,232053,21875477.95,"2019-07-31",1761,"INE111B01023"]
["8KMILES","EQ",56.95,59.4,56.95,57.1,56.95,59.9,145870,8324452.55,"2019-07-31",910,"INE650K01021"]
["A2ZINFRA","EQ",10.45,10.9,10.15,10.35,10.3,10.85,450921,4769285.7,"2019-07-31",632,"INE619I01012"]
["AARTIDRUGS","EQ",472,479.2,456,462.25,459.5,475.3,9047,4191166.45,"2019-07-31",668,"INE767A01016"]
["AARTIIND","EQ",1620,1679,1617.05,1666,1675,1630.55,26257,43147191.35,"2019-07-31",4547,"INE769A01020"]
["AARVEEDEN","EQ",16.95,16.95,15.15,16,15.6,16.4,11966,188979.5,"2019-07-31",181,"INE273D01019"]
["AAVAS","EQ",1411.05,1512.6,1391,1491.2,1470,1430.2,32101,46194431.05,"2019-07-31",4624,"INE216P01012"]
["ABAN","EQ",29.8,29.8,28.05,28.45,28.4,29.5,217898,6185231.3,"2019-07-31",2893,"INE421A01028"]
["ABB","EQ",1361,1374,1337.9,1363.1,1370,1358.3,53331,72442909.25,"2019-07-31",4741,"INE117A01022"]
["ABBOTINDIA","EQ",8500,8500,8278,8363.6,8340,8490.8,3723,31063639.65,"2019-07-31",1458,"INE358A01014"]
["ABCAPITAL","EQ",80.25,82.35,80,82.05,82.25,81,1050413,85020802.85,"2019-07-31",13541,"INE674K01013"]
["ABFRL","EQ",188.5,189.75,182.2,188.25,188.5,190,638547,118563540.9,"2019-07-31",32866,"INE647O01011"]
["ABSLNN50ET","EQ",257.9,261.23,257.9,261.23,261.23,257.9,10,2608.76,"2019-07-31",8,"INF209KB1B87"]
["ACC","EQ",1540.9,1564,1516.5,1560.4,1562,1540.9,630274,971244692.7,"2019-07-31",23162,"INE012A01025"]
{"$rows_left_out":1684}
{"sheet":"Sheet1","index":7,"n_rows":0,"n_cols":0,"rows_kept":0,"hidden":true}

{"sheet":"Sheet3","index":8,"n_rows":0,"n_cols":0,"rows_kept":0,"hidden":true}

{"sheet":"Sheet4","index":9,"n_rows":0,"n_cols":0,"rows_kept":0,"hidden":true}