{"text_format":"3","workbook":"xlsx","n_sheets":6,"sheets":["Main","Future Intra","Cash Intra","MidCap Intra","Bulk Deals","Call Tracker (Equity & F&O)"],"not_rendered":{"images":2,"defined_names":3},"read":"whole","date_system":"1900"}

{"sheet":"Main","index":0,"n_rows":27,"n_cols":11,"rows_kept":27}
[null,"                                                                                                 "]
{"$rows_empty":8}
[null,"2023-06-02"]
[]
[null,"Sheet No.","Template Name","Summary"]
[null,1,"Future Intra","For Intraday trading in F&O segment"]
[null,2,"Cash Intra","For Intraday trading in cash market segment"]
[null,3,"Mid-cap Intra","For Intraday trading in Mid-cap stocks"]
[null,4,"Bulk Deals","Reveals Bulk Deals carried on NSE & BSE"]
[null,5,"Call Tracker"]
{"$rows_empty":9}
[{"$nulls":10},"`"]

{"sheet":"Future Intra","index":1,"n_rows":236,"n_cols":16,"rows_kept":236,"merged":[[8,0,9,0],[8,1,9,1],[8,2,9,2],[8,3,9,3],[8,6,8,8],[8,9,8,11]]}
[]
[]
[]
[]
[{"$nulls":12},"Back to Main Page"]
["FOR INTRA DAY TRADING",{"$nulls":10},{"$f":"Main!B10","v":"2023-06-02"}]
[]
[]
["Sr.no","Sector","Scrip","Expiry Date","CLOSE RATE","Pivot Point","Supports",null,null,"Resistances"]
[{"$nulls":4},"Point","Point","S1","S2","S3","R1","R2","R3","HIGH","LOW","OI","% Change in OI"]
[1,"Index","NIFTY","2023-06-29",{"v":18570,"d":"18570.00"},{"v":18593,"d":"18593.00"},{"v":18527,"d":"18527.00"},{"v":18484,"d":"18484.00"},{"v":18418,"d":"18418.00"},{"v":18636,"d":"18636.00"},{"v":18702,"d":"18702.00"},{"v":18745,"d":"18745.00"},18659,18550,9751900,{"v":-0.04301191340699888,"d":"-4.30%"}]
[2,"Index","BANKNIFTY","2023-06-29",43948.25,{"v":44033.083333333336,"d":"44033.08"},{"v":43776.16666666667,"d":"43776.17"},{"v":43604.083333333336,"d":"43604.08"},{"v":43347.16666666667,"d":"43347.17"},{"v":44205.16666666667,"d":"44205.17"},{"v":44462.08333333334,"d":"44462.08"},{"v":44634.16666666667,"d":"44634.17"},44290,43861,2449640,{"v":0.036200434845139295,"d":"3.62%"}]
[3,"Index","FINNIFTY","2023-06-27",{"v":19423.3,"d":"19423.30"},{"v":19467.38333333333,"d":"19467.38"},{"v":19347.966666666664,"d":"19347.97"},{"v":19272.63333333333,"d":"19272.63"},{"v":19153.216666666664,"d":"19153.22"},{"v":19542.716666666664,"d":"19542.72"},{"v":19662.133333333335,"d":"19662.13"},{"v":19737.466666666664,"d":"19737.47"},19586.8,19392.05,38520,{"v":0.09060022650056625,"d":"9.06%"}]
[4,"Index","MIDCPNIFTY","2023-06-27",{"v":7834,"d":"7834.00"},{"v":7841.983333333334,"d":"7841.98"},{"v":7812.0666666666675,"d":"7812.07"},{"v":7790.133333333334,"d":"7790.13"},{"v":7760.216666666668,"d":"7760.22"},{"v":7863.916666666667,"d":"7863.92"},{"v":7893.833333333333,"d":"7893.83"},{"v":7915.766666666666,"d":"7915.77"},7871.9,7820.05,825,{"v":-0.717948717948718,"d":"-71.79%"}]
[5,"Chemical","AARTIIND","2023-06-29",{"v":518.3,"d":"518.30"},{"v":519.6166666666667,"d":"519.62"},{"v":515.6333333333333,"d":"515.63"},{"v":512.9666666666667,"d":"512.97"},{"v":508.98333333333335,"d":"508.98"},{"v":522.2833333333333,"d":"522.28"},{"v":526.2666666666667,"d":"526.27"},{"v":528.9333333333333,"d":"528.93"},523.6,516.95,5318050,{"v":0.012701495805840403,"d":"1.27%"}]
[6,"Capital_Goods","ABB","2023-06-29",3955.25,{"v":4007.2166666666667,"d":"4007.22"},{"v":3894.883333333333,"d":"3894.88"},{"v":3834.5166666666664,"d":"3834.52"},{"v":3722.183333333333,"d":"3722.18"},{"v":4067.5833333333335,"d":"4067.58"},{"v":4179.916666666666,"d":"4179.92"},{"v":4240.283333333334,"d":"4240.28"},4119.55,3946.85,1449750,{"v":-0.07615102756093675,"d":"-7.62%"}]
[7,"Pharma","ABBOTINDIA","2023-06-29",21754.45,{"v":21835.466666666667,"d":"21835.47"},{"v":21618.983333333334,"d":"21618.98"},{"v":21483.516666666666,"d":"21483.52"},{"v":21267.033333333333,"d":"21267.03"},{"v":21970.933333333334,"d":"21970.93"},{"v":22187.41666666667,"d":"22187.42"},{"v":22322.883333333335,"d":"22322.88"},22051.95,21700,68120,{"v":0.03212121212121212,"d":"3.21%"}]
[8,"Others","ABCAPITAL","2023-06-29",{"v":173,"d":"173.00"},{"v":172.73333333333335,"d":"172.73"},{"v":171.7666666666667,"d":"171.77"},{"v":170.53333333333336,"d":"170.53"},{"v":169.56666666666672,"d":"169.57"},{"v":173.9666666666667,"d":"173.97"},{"v":174.93333333333334,"d":"174.93"},{"v":176.16666666666669,"d":"176.17"},173.7,171.5,28987200,{"v":-2.601263470828688E-3,"d":"-0.26%"}]
[9,"Textile","ABFRL","2023-06-29",204.15,{"v":204.04999999999998,"d":"204.05"},{"v":202.59999999999997,"d":"202.60"},{"v":201.04999999999998,"d":"201.05"},{"v":199.59999999999997,"d":"199.60"},{"v":205.59999999999997,"d":"205.60"},{"v":207.04999999999995,"d":"207.05"},{"v":208.59999999999997,"d":"208.60"},205.5,202.5,28579200,{"v":0.003102755977368133,"d":"0.31%"}]
[10,"Cement","ACC","2023-06-29",1808.05,{"v":1811.9333333333334,"d":"1811.93"},{"v":1788.8666666666668,"d":"1788.87"},{"v":1769.6833333333334,"d":"1769.68"},{"v":1746.6166666666668,"d":"1746.62"},{"v":1831.1166666666668,"d":"1831.12"},{"v":1854.1833333333334,"d":"1854.18"},{"v":1873.3666666666668,"d":"1873.37"},1835,1792.75,5047750,{"v":0.00420761548561652,"d":"0.42%"}]
[11,"Others","ADANIENT","2023-06-29",2507.85,{"v":2519.933333333333,"d":"2519.93"},{"v":2488.166666666666,"d":"2488.17"},{"v":2468.483333333333,"d":"2468.48"},{"v":2436.7166666666662,"d":"2436.72"},{"v":2539.616666666666,"d":"2539.62"},{"v":2571.383333333333,"d":"2571.38"},{"v":2591.0666666666657,"d":"2591.07"},2551.7,2500.25,9379450,{"v":7.8958178840275077E-4,"d":"0.08%"}]
[12,"Others","ADANIPORTS","2023-06-29",737.15,{"v":739.0166666666668,"d":"739.02"},{"v":730.0833333333335,"d":"730.08"},{"v":723.0166666666668,"d":"723.02"},{"v":714.0833333333335,"d":"714.08"},{"v":746.0833333333335,"d":"746.08"},{"v":755.0166666666667,"d":"755.02"},{"v":762.0833333333335,"d":"762.08"},747.95,731.95,38784150,{"v":0.005603083381192464,"d":"0.56%"}]
[13,"Pharma","ALKEM","2023-06-29",3397.15,{"v":3406.4666666666667,"d":"3406.47"},{"v":3379.2833333333333,"d":"3379.28"},{"v":3361.4166666666665,"d":"3361.42"},{"v":3334.233333333333,"d":"3334.23"},{"v":3424.3333333333335,"d":"3424.33"},{"v":3451.516666666667,"d":"3451.52"},{"v":3469.3833333333337,"d":"3469.38"},3433.65,3388.6,575800,{"v":0.01195079086115993,"d":"1.20%"}]
[14,"Cement","AMBUJACEM","2023-06-29",432.35,{"v":430.95000000000005,"d":"430.95"},{"v":427.6000000000001,"d":"427.60"},422.85,{"v":419.50000000000006,"d":"419.50"},{"v":435.7000000000001,"d":"435.70"},439.05,{"v":443.8000000000001,"d":"443.80"},434.3,426.2,58460400,{"v":-9.8431251922485386E-4,"d":"-0.10%"}]
[15,"Others","APOLLOHOSP","2023-06-29",{"v":4842.8,"d":"4842.80"},{"v":4796.766666666666,"d":"4796.77"},{"v":4720.033333333333,"d":"4720.03"},{"v":4597.266666666666,"d":"4597.27"},{"v":4520.533333333333,"d":"4520.53"},{"v":4919.533333333333,"d":"4919.53"},{"v":4996.266666666666,"d":"4996.27"},{"v":5119.033333333333,"d":"5119.03"},4873.5,4674,2160750,{"v":0.0722659884622542,"d":"7.23%"}]
[16,"Automobile","APOLLOTYRE","2023-06-29",389.75,{"v":389.7166666666667,"d":"389.72"},{"v":387.0333333333334,"d":"387.03"},{"v":384.3166666666667,"d":"384.32"},{"v":381.63333333333344,"d":"381.63"},{"v":392.4333333333334,"d":"392.43"},{"v":395.1166666666667,"d":"395.12"},{"v":397.83333333333337,"d":"397.83"},392.4,387,13108700,{"v":-0.007300209767438338,"d":"-0.73%"}]
[17,"Automobile","ASHOKLEY","2023-06-29",{"v":147.9,"d":"147.90"},{"v":147.91666666666666,"d":"147.92"},{"v":146.73333333333332,"d":"146.73"},{"v":145.56666666666666,"d":"145.57"},{"v":144.38333333333333,"d":"144.38"},{"v":149.08333333333331,"d":"149.08"},{"v":150.26666666666665,"d":"150.27"},{"v":151.4333333333333,"d":"151.43"},149.1,146.75,70640000,{"v":0.011599599026206501,"d":"1.16%"}]
[18,"FMCG","ASIANPAINT","2023-06-29",3232.75,{"v":3230.2000000000003,"d":"3230.20"},{"v":3212.5500000000006,"d":"3212.55"},{"v":3192.3500000000004,"d":"3192.35"},{"v":3174.7000000000007,"d":"3174.70"},{"v":3250.4000000000005,"d":"3250.40"},3268.05,{"v":3288.2500000000005,"d":"3288.25"},3247.85,3210,5217000,{"v":-0.03029739776951673,"d":"-3.03%"}]
[19,"Others","ASTRAL","2023-06-29",1817.85,{"v":1825.3833333333332,"d":"1825.38"},{"v":1806.7666666666664,"d":"1806.77"},{"v":1795.6833333333332,"d":"1795.68"},{"v":1777.0666666666664,"d":"1777.07"},{"v":1836.4666666666665,"d":"1836.47"},{"v":1855.0833333333333,"d":"1855.08"},{"v":1866.1666666666665,"d":"1866.17"},1844,1814.3,1591679,{"v":-0.011847801321485532,"d":"-1.18%"}]
[20,"Others","ATUL","2023-06-29",{"v":6763.3,"d":"6763.30"},{"v":6765.133333333334,"d":"6765.13"},{"v":6710.266666666668,"d":"6710.27"},{"v":6657.2333333333345,"d":"6657.23"},{"v":6602.366666666669,"d":"6602.37"},{"v":6818.166666666668,"d":"6818.17"},{"v":6873.033333333335,"d":"6873.03"},{"v":6926.0666666666675,"d":"6926.07"},6820,6712.1,196500,{"v":0.015503875968992248,"d":"1.55%"}]
{"$rows_left_out":192}
{"sheet":"Cash Intra","index":2,"n_rows":246,"n_cols":13,"rows_kept":246,"merged":[[7,0,8,0],[7,1,8,1],[7,2,8,2],[7,3,8,3],[7,4,7,6],[7,7,7,9]]}
[]
[]
[]
[]
[{"$nulls":12},"Back to Main Page"]
["FOR INTRA DAY TRADING",{"$nulls":9},{"$f":"Main!B10","v":"2023-06-02"}]
[]
["Sr.no",null,"CLOSE RATE","Pivot Point","Supports",null,null,"Resistances"]
[{"$nulls":4},"S1","S2","S3","R1","R2","R3","HIGH","LOW","Total Trade Quanity in Lakhs"]
[1,"Nifty 50",18487.75,{"v":18510.86666666667,"d":"18510.87"},{"v":18441.433333333338,"d":"18441.43"},{"v":18395.11666666667,"d":"18395.12"},{"v":18325.683333333338,"d":"18325.68"},{"v":18557.183333333338,"d":"18557.18"},{"v":18626.616666666672,"d":"18626.62"},{"v":18672.933333333338,"d":"18672.93"},{"v":18580.3,"d":"18580.30"},18464.55]
[2,"Nifty Bank",{"v":43790.2,"d":"43790.20"},{"v":43892.1,"d":"43892.10"},43604.25,{"v":43418.3,"d":"43418.30"},{"v":43130.450000000004,"d":"43130.45"},{"v":44078.049999999996,"d":"44078.05"},{"v":44365.89999999999,"d":"44365.90"},{"v":44551.84999999999,"d":"44551.85"},44179.95,43706.15]
[3,"Nifty CPSE",3065.45,{"v":3062.5166666666664,"d":"3062.52"},{"v":3052.033333333333,"d":"3052.03"},{"v":3038.6166666666663,"d":"3038.62"},{"v":3028.1333333333328,"d":"3028.13"},{"v":3075.933333333333,"d":"3075.93"},{"v":3086.4166666666665,"d":"3086.42"},{"v":3099.833333333333,"d":"3099.83"},{"v":3073,"d":"3073.00"},{"v":3049.1,"d":"3049.10"}]
[4,"Nifty Infra",5446.75,{"v":5451.733333333333,"d":"5451.73"},{"v":5434.416666666665,"d":"5434.42"},{"v":5422.083333333332,"d":"5422.08"},{"v":5404.766666666665,"d":"5404.77"},{"v":5464.066666666666,"d":"5464.07"},{"v":5481.383333333333,"d":"5481.38"},{"v":5493.716666666666,"d":"5493.72"},5469.05,{"v":5439.4,"d":"5439.40"}]
[5,"Nifty IT",29446.25,{"v":29475.8,"d":"29475.80"},{"v":29352.5,"d":"29352.50"},29258.75,29135.45,29569.55,{"v":29692.849999999995,"d":"29692.85"},{"v":29786.6,"d":"29786.60"},{"v":29599.1,"d":"29599.10"},29382.05]
[6,"Nifty PSE",{"v":4776.5,"d":"4776.50"},{"v":4777.616666666667,"d":"4777.62"},{"v":4760.483333333334,"d":"4760.48"},{"v":4744.466666666667,"d":"4744.47"},{"v":4727.333333333334,"d":"4727.33"},{"v":4793.633333333333,"d":"4793.63"},{"v":4810.766666666666,"d":"4810.77"},{"v":4826.783333333333,"d":"4826.78"},4794.75,{"v":4761.6,"d":"4761.60"}]
[7,"Nifty Midcap 50",{"v":9559.5,"d":"9559.50"},{"v":9568,"d":"9568.00"},{"v":9532.6,"d":"9532.60"},{"v":9505.7,"d":"9505.70"},{"v":9470.300000000001,"d":"9470.30"},{"v":9594.9,"d":"9594.90"},{"v":9630.300000000001,"d":"9630.30"},{"v":9657.199999999999,"d":"9657.20"},{"v":9603.4,"d":"9603.40"},{"v":9541.1,"d":"9541.10"}]
[8,"ABB",3944.65,4007.15,{"v":3874.3,"d":"3874.30"},{"v":3803.9500000000003,"d":"3803.95"},{"v":3671.1000000000004,"d":"3671.10"},{"v":4077.5,"d":"4077.50"},{"v":4210.349999999999,"d":"4210.35"},{"v":4280.7,"d":"4280.70"},4140,3936.8,4.2149]
[9,"ACC",1800.3,{"v":1801.5666666666666,"d":"1801.57"},{"v":1779.4333333333332,"d":"1779.43"},{"v":1758.5666666666666,"d":"1758.57"},{"v":1736.4333333333332,"d":"1736.43"},{"v":1822.4333333333332,"d":"1822.43"},{"v":1844.5666666666664,"d":"1844.57"},{"v":1865.4333333333332,"d":"1865.43"},1823.7,1780.7,5.42023]
[10,"AUBANK",769.75,{"v":772.4,"d":"772.40"},762.65,755.55,{"v":745.8,"d":"745.80"},{"v":779.5,"d":"779.50"},789.25,796.35,782.15,765.3,13.86561]
[11,"ABBOTINDIA",21602.65,{"v":21680.783333333336,"d":"21680.78"},{"v":21471.866666666672,"d":"21471.87"},{"v":21341.083333333336,"d":"21341.08"},{"v":21132.16666666667,"d":"21132.17"},{"v":21811.566666666673,"d":"21811.57"},{"v":22020.483333333337,"d":"22020.48"},{"v":22151.266666666674,"d":"22151.27"},21889.7,21550,0.10678]
[12,"ADANIENT",2492.15,{"v":2512.483333333333,"d":"2512.48"},{"v":2464.9666666666662,"d":"2464.97"},{"v":2437.7833333333333,"d":"2437.78"},{"v":2390.2666666666664,"d":"2390.27"},{"v":2539.666666666666,"d":"2539.67"},{"v":2587.1833333333334,"d":"2587.18"},{"v":2614.366666666666,"d":"2614.37"},2560,2485.3,17.04946]
[13,"ADANIGREEN",993.95,{"v":996.3166666666666,"d":"996.32"},{"v":981.6333333333332,"d":"981.63"},{"v":969.3166666666666,"d":"969.32"},{"v":954.6333333333332,"d":"954.63"},{"v":1008.6333333333332,"d":"1008.63"},{"v":1023.3166666666666,"d":"1023.32"},{"v":1035.6333333333332,"d":"1035.63"},1011,984,46.39202]
[14,"ADANIPORTS",732.05,{"v":735.3333333333334,"d":"735.33"},{"v":725.7166666666667,"d":"725.72"},{"v":719.3833333333333,"d":"719.38"},{"v":709.7666666666667,"d":"709.77"},{"v":741.6666666666667,"d":"741.67"},{"v":751.2833333333333,"d":"751.28"},{"v":757.6166666666668,"d":"757.62"},744.95,729,37.7176]
[15,"ATGL",694.35,680.75,664.15,{"v":633.9499999999999,"d":"633.95"},{"v":617.3499999999999,"d":"617.35"},710.95,727.55,{"v":757.7500000000001,"d":"757.75"},697.35,650.55,165.89982]
[16,"ADANITRANS",815.5,{"v":808.1166666666667,"d":"808.12"},{"v":800.7333333333333,"d":"800.73"},{"v":785.9666666666667,"d":"785.97"},{"v":778.5833333333334,"d":"778.58"},{"v":822.8833333333333,"d":"822.88"},{"v":830.2666666666668,"d":"830.27"},{"v":845.0333333333333,"d":"845.03"},815.5,793.35,40.42939]
[17,"AWL",442.05,{"v":443.4666666666667,"d":"443.47"},{"v":438.58333333333337,"d":"438.58"},{"v":435.1166666666667,"d":"435.12"},{"v":430.23333333333335,"d":"430.23"},{"v":446.9333333333334,"d":"446.93"},{"v":451.8166666666667,"d":"451.82"},{"v":455.2833333333334,"d":"455.28"},448.35,440,18.25488]
[18,"ABCAPITAL",171.85,{"v":171.55000000000004,"d":"171.55"},{"v":170.60000000000008,"d":"170.60"},{"v":169.35000000000005,"d":"169.35"},{"v":168.4000000000001,"d":"168.40"},{"v":172.80000000000007,"d":"172.80"},{"v":173.75000000000006,"d":"173.75"},{"v":175.00000000000006,"d":"175.00"},172.5,170.3,28.58463]
[19,"ABFRL",203.3,203.15,{"v":201.8,"d":"201.80"},{"v":200.3,"d":"200.30"},{"v":198.95000000000002,"d":"198.95"},204.65,{"v":205.99999999999997,"d":"206.00"},{"v":207.5,"d":"207.50"},204.5,201.65,18.17415]
[20,"ALKEM",3380.35,{"v":3388.5166666666664,"d":"3388.52"},{"v":3358.283333333333,"d":"3358.28"},{"v":3336.2166666666662,"d":"3336.22"},{"v":3305.9833333333327,"d":"3305.98"},{"v":3410.583333333333,"d":"3410.58"},{"v":3440.8166666666666,"d":"3440.82"},{"v":3462.883333333333,"d":"3462.88"},3418.75,3366.45,0.55564]
[21,"AMBUJACEM",429.25,{"v":428.1666666666667,"d":"428.17"},{"v":425.08333333333337,"d":"425.08"},{"v":420.9166666666667,"d":"420.92"},{"v":417.83333333333337,"d":"417.83"},{"v":432.33333333333337,"d":"432.33"},{"v":435.41666666666674,"d":"435.42"},{"v":439.58333333333337,"d":"439.58"},431.25,424,34.22014]
{"$rows_left_out":217}
{"sheet":"MidCap Intra","index":3,"n_rows":532,"n_cols":13,"rows_kept":532,"merged":[[0,0,0,1],[8,0,9,0],[8,1,9,1],[8,2,9,2],[8,3,9,3],[8,4,8,6],[8,7,8,9]]}
[]
[]
[]
[]
[{"$nulls":11},"Back To Main Page"]
["FOR INTRA DAY TRADING",{"$nulls":9},{"$f":"Main!B10","v":"2023-06-02"}]
[null,null," "]
[]
["Sr.no","Scrip","CLOSE RATE","Pivot Point","Supports",null,null,"Resistances"]
[{"$nulls":4},"S1","S2","S3","R1","R2","R3","HIGH","LOW","Total Trade Quanity in Lakhs"]
[1,"360ONE",419.9,{"v":421.0333333333333,"d":"421.03"},{"v":417.0666666666666,"d":"417.07"},{"v":414.2333333333333,"d":"414.23"},{"v":410.2666666666666,"d":"410.27"},{"v":423.8666666666666,"d":"423.87"},{"v":427.8333333333333,"d":"427.83"},{"v":430.66666666666663,"d":"430.67"},425,418.2,7.55519]
[2,"3MINDIA",26290.7,{"v":25918.266666666663,"d":"25918.27"},{"v":25386.533333333326,"d":"25386.53"},{"v":24482.36666666666,"d":"24482.37"},{"v":23950.633333333324,"d":"23950.63"},{"v":26822.433333333327,"d":"26822.43"},{"v":27354.166666666664,"d":"27354.17"},{"v":28258.33333333333,"d":"28258.33"},26450,25014.1,0.09503]
[3,"ABB",3944.65,4007.15,{"v":3874.3,"d":"3874.30"},{"v":3803.9500000000003,"d":"3803.95"},{"v":3671.1000000000004,"d":"3671.10"},{"v":4077.5,"d":"4077.50"},{"v":4210.349999999999,"d":"4210.35"},{"v":4280.7,"d":"4280.70"},4140,3936.8,4.2149]
[4,"ACC",1800.3,{"v":1801.5666666666666,"d":"1801.57"},{"v":1779.4333333333332,"d":"1779.43"},{"v":1758.5666666666666,"d":"1758.57"},{"v":1736.4333333333332,"d":"1736.43"},{"v":1822.4333333333332,"d":"1822.43"},{"v":1844.5666666666664,"d":"1844.57"},{"v":1865.4333333333332,"d":"1865.43"},1823.7,1780.7,5.42023]
[5,"AIAENG",3030,{"v":3040.1,"d":"3040.10"},{"v":2991.2,"d":"2991.20"},{"v":2952.4,"d":"2952.40"},{"v":2903.5,"d":"2903.50"},{"v":3078.8999999999996,"d":"3078.90"},{"v":3127.8,"d":"3127.80"},{"v":3166.5999999999995,"d":"3166.60"},3089,3001.3,1.59497]
[6,"APLAPOLLO",1142.85,{"v":1138.3166666666666,"d":"1138.32"},{"v":1124.6333333333332,"d":"1124.63"},{"v":1106.4166666666665,"d":"1106.42"},{"v":1092.7333333333331,"d":"1092.73"},{"v":1156.5333333333333,"d":"1156.53"},{"v":1170.2166666666667,"d":"1170.22"},{"v":1188.4333333333334,"d":"1188.43"},1152,1120.1,5.46073]
[7,"AUBANK",769.75,{"v":772.4,"d":"772.40"},762.65,755.55,{"v":745.8,"d":"745.80"},{"v":779.5,"d":"779.50"},789.25,796.35,782.15,765.3,13.86561]
[8,"AARTIDRUGS",454.65,{"v":451.9166666666667,"d":"451.92"},{"v":441.83333333333337,"d":"441.83"},{"v":429.0166666666667,"d":"429.02"},{"v":418.9333333333334,"d":"418.93"},{"v":464.73333333333335,"d":"464.73"},{"v":474.8166666666667,"d":"474.82"},{"v":487.6333333333333,"d":"487.63"},462,439.1,9.07466]
[9,"AAVAS",1390.85,{"v":1393.0333333333335,"d":"1393.03"},{"v":1380.866666666667,"d":"1380.87"},{"v":1370.8833333333334,"d":"1370.88"},{"v":1358.716666666667,"d":"1358.72"},{"v":1403.016666666667,"d":"1403.02"},{"v":1415.1833333333336,"d":"1415.18"},{"v":1425.1666666666672,"d":"1425.17"},1405.2,1383.05,1.58446]
[10,"ABBOTINDIA",21602.65,{"v":21680.783333333336,"d":"21680.78"},{"v":21471.866666666672,"d":"21471.87"},{"v":21341.083333333336,"d":"21341.08"},{"v":21132.16666666667,"d":"21132.17"},{"v":21811.566666666673,"d":"21811.57"},{"v":22020.483333333337,"d":"22020.48"},{"v":22151.266666666674,"d":"22151.27"},21889.7,21550,0.10678]
[11,"ADANIENT",2492.15,{"v":2512.483333333333,"d":"2512.48"},{"v":2464.9666666666662,"d":"2464.97"},{"v":2437.7833333333333,"d":"2437.78"},{"v":2390.2666666666664,"d":"2390.27"},{"v":2539.666666666666,"d":"2539.67"},{"v":2587.1833333333334,"d":"2587.18"},{"v":2614.366666666666,"d":"2614.37"},2560,2485.3,17.04946]
[12,"ADANIGREEN",993.95,{"v":996.3166666666666,"d":"996.32"},{"v":981.6333333333332,"d":"981.63"},{"v":969.3166666666666,"d":"969.32"},{"v":954.6333333333332,"d":"954.63"},{"v":1008.6333333333332,"d":"1008.63"},{"v":1023.3166666666666,"d":"1023.32"},{"v":1035.6333333333332,"d":"1035.63"},1011,984,46.39202]
[13,"ADANIPORTS",732.05,{"v":735.3333333333334,"d":"735.33"},{"v":725.7166666666667,"d":"725.72"},{"v":719.3833333333333,"d":"719.38"},{"v":709.7666666666667,"d":"709.77"},{"v":741.6666666666667,"d":"741.67"},{"v":751.2833333333333,"d":"751.28"},{"v":757.6166666666668,"d":"757.62"},744.95,729,37.7176]
[14,"ATGL",694.35,680.75,664.15,{"v":633.9499999999999,"d":"633.95"},{"v":617.3499999999999,"d":"617.35"},710.95,727.55,{"v":757.7500000000001,"d":"757.75"},697.35,650.55,165.89982]
[15,"ADANITRANS",815.5,{"v":808.1166666666667,"d":"808.12"},{"v":800.7333333333333,"d":"800.73"},{"v":785.9666666666667,"d":"785.97"},{"v":778.5833333333334,"d":"778.58"},{"v":822.8833333333333,"d":"822.88"},{"v":830.2666666666668,"d":"830.27"},{"v":845.0333333333333,"d":"845.03"},815.5,793.35,40.42939]
[16,"AWL",442.05,{"v":443.4666666666667,"d":"443.47"},{"v":438.58333333333337,"d":"438.58"},{"v":435.1166666666667,"d":"435.12"},{"v":430.23333333333335,"d":"430.23"},{"v":446.9333333333334,"d":"446.93"},{"v":451.8166666666667,"d":"451.82"},{"v":455.2833333333334,"d":"455.28"},448.35,440,18.25488]
[17,"ABCAPITAL",171.85,{"v":171.55000000000004,"d":"171.55"},{"v":170.60000000000008,"d":"170.60"},{"v":169.35000000000005,"d":"169.35"},{"v":168.4000000000001,"d":"168.40"},{"v":172.80000000000007,"d":"172.80"},{"v":173.75000000000006,"d":"173.75"},{"v":175.00000000000006,"d":"175.00"},172.5,170.3,28.58463]
[18,"ABFRL",203.3,203.15,{"v":201.8,"d":"201.80"},{"v":200.3,"d":"200.30"},{"v":198.95000000000002,"d":"198.95"},204.65,{"v":205.99999999999997,"d":"206.00"},{"v":207.5,"d":"207.50"},204.5,201.65,18.17415]
[19,"ABSLAMC",355.05,{"v":356.4166666666667,"d":"356.42"},{"v":352.6333333333334,"d":"352.63"},{"v":350.2166666666667,"d":"350.22"},{"v":346.4333333333334,"d":"346.43"},{"v":358.83333333333337,"d":"358.83"},{"v":362.6166666666667,"d":"362.62"},{"v":365.03333333333336,"d":"365.03"},360.2,354,0.25854]
[20,"AEGISCHEM",342.35,{"v":348.51666666666665,"d":"348.52"},{"v":332.5333333333333,"d":"332.53"},{"v":322.71666666666664,"d":"322.72"},{"v":306.7333333333333,"d":"306.73"},{"v":358.3333333333333,"d":"358.33"},{"v":374.31666666666666,"d":"374.32"},{"v":384.1333333333333,"d":"384.13"},364.5,338.7,9.71591]
{"$rows_left_out":503}
{"sheet":"Bulk Deals","index":4,"n_rows":92,"n_cols":8,"rows_kept":92,"merged":[[4,0,4,1],[4,2,4,3],[6,1,6,2]]}
[" "]
[]
[]
[]
[]
[{"$nulls":4},"Back To Main Page"]
["Subject :","BULK DEAL",null,{"$f":"Main!B10","v":"2023-06-02"}]
[]
["Date","Scrip code","Scrip Name","Client Name","Buy / Sell","Quantity Traded","Trade Price / Wt.Avg.trade price","Exchange  "]
["2023-06-01",512149,"AVANCE","RUPAL SHRIKANT SHAH","SELL",{"v":2200000,"d":"2,200,000"},1.72,"BSE"]
["2023-06-01",538734,"CEINSYSTECH","ZODIUS TECHNOLOGY FUND","SELL",{"v":150000,"d":"150,000"},162.33,"BSE"]
["2023-06-01",538734,"CEINSYSTECH","ELDER VENTURE LLP","SELL",{"v":118437,"d":"118,437"},155.62,"BSE"]
["2023-06-01",539991,"CFEL","SINGULARITY HOLDINGS LIMITED","SELL",{"v":197018,"d":"197,018"},115.24,"BSE"]
["2023-06-01",539991,"CFEL","ABHISHEK KHAITAN","BUY",{"v":147347,"d":"147,347"},115.25,"BSE"]
["2023-06-01",530755,"CORNE","JAYESH PRAVINCHANDRA SHETH","BUY",{"v":4776,"d":"4,776"},16,"BSE"]
["2023-06-01",530755,"CORNE","JAYESH PRAVINCHANDRA SHETH","SELL",{"v":26861,"d":"26,861"},16.24,"BSE"]
["2023-06-01",543848,"DEVLAB","SUNFLOWER BROKING PRIVATE LIMITED","SELL",{"v":52000,"d":"52,000"},61,"BSE"]
["2023-06-01",543848,"DEVLAB","ANSU INVESTMENT","BUY",{"v":52000,"d":"52,000"},61,"BSE"]
["2023-06-01",537707,"ETT","KISHANSINH MANSINH RAJPUT","SELL",{"v":56000,"d":"56,000"},41.28,"BSE"]
["2023-06-01",524444,"EVEXIA","LTS INVESTMENT FUND LTD","BUY",{"v":5000000,"d":"5,000,000"},2.8,"BSE"]
["2023-06-01",543895,"EXHICON","SUSHIL LAHOTI","SELL",{"v":8000,"d":"8,000"},135.98,"BSE"]
["2023-06-01",543895,"EXHICON","SUSHIL LAHOTI","BUY",{"v":60000,"d":"60,000"},130.6,"BSE"]
["2023-06-01",530663,"GOYALASS","SULEKHA RANI","SELL",{"v":235600,"d":"235,600"},2.79,"BSE"]
["2023-06-01",530663,"GOYALASS","SULEKHA RANI","BUY",3,2.88,"BSE"]
["2023-06-01",532467,"HAZOOR","CHAITANYA DILIP CHANDAN","SELL",{"v":65000,"d":"65,000"},153.67,"BSE"]
["2023-06-01",532467,"HAZOOR","JABIR MOHD SILAWAT","BUY",{"v":65065,"d":"65,065"},153.7,"BSE"]
["2023-06-01",542935,"ICLORGANIC","YELLOWSTONE VENTURES LLP","BUY",{"v":60000,"d":"60,000"},70.12,"BSE"]
["2023-06-01",540377,"IFL","MONEYSTAR TRADELINK PRIVATE LIMITED","BUY",{"v":1510771,"d":"1,510,771"},13.58,"BSE"]
["2023-06-01",542924,"JANUSCORP","MISTERKAPOORKESHRI","BUY",{"v":38500,"d":"38,500"},3.92,"BSE"]
["2023-06-01",542924,"JANUSCORP","MISTERKAPOORKESHRI","SELL",{"v":73500,"d":"73,500"},4.05,"BSE"]
{"$rows_left_out":63}
{"sheet":"Call Tracker (Equity & F&O)","index":5,"n_rows":255,"n_cols":18,"rows_kept":255}
[]
[]
[]
[]
[{"$nulls":12},"Back To Main Page"]
["Retail Research Technical Calls & Fundamental Performance Report for the month of June-2023"]
[{"$nulls":12},{"$f":"Main!B10","v":"2023-06-02"}]
[null,"Positional  Call"]
["Sr.no","Date",null,"Company","Rec","Rec Price","Stop Loss***","Call Closed At","Target","Remark","Profit / Loss per Share","All charges","Net Gain / Loss  %","Status","Closed Date","Market Closing Price"]
[1,"2023-05-12",null,"SBIN","Accu","562-574",538,null,"600-630","Open",{"$nulls":5},{"$f":"VLOOKUP(D10,'MidCap Intra'!B39:C539,2,0)","v":582.75},null,"H"]
[2,"2023-05-22",null,"JSWSTEEL","Accu","665-691",637,null,"740-780","Open",{"$nulls":5},{"$f":"VLOOKUP(D11,'MidCap Intra'!B40:C540,2,0)","v":693.85},null,"H"]
[3,"2023-05-31",null,"GSFC","Accu","152-157",144,null,"170-175","Open",{"$nulls":5},{"$f":"VLOOKUP(D12,'MidCap Intra'!B41:C541,2,0)","v":158.85},null,"H"]
[]
[]
[]
["CLBS = Closing Basis ***"]
["Dividend adjusted <>",{"$nulls":4},"Reinitiated $"]
["Part book {}",null,null,"s",null,"Revised stoploss #"]
[]
[null,"Momentum Call"]
["Sr.no","Date",null,"Company","Rec","Rec Price","Stop Loss","Call Closed At","Target","Remark","Profit / Loss per Share/Lot","All charges","Net Gain / Loss  %","Status","Closed Date"]
[1,"2023-05-23",null,"ACC","Buy","1807-1815",1750,null,"1900-1920","Open",{"$nulls":7},"H"]
[2,"2023-06-01",null,"MARICO","Buy","554-557",539,null,"590-600","Open",{"$nulls":7},"H"]
[3,"2023-06-01",null,"COALINDIA","Buy","228.5-230.5",222,null,"240-244","Open",{"$nulls":7},"H"]
[]
[]
["CLBS = Closing Basis ***",{"$nulls":6},"*"]
["Dividend adjusted <>",{"$nulls":4},"Reinitiated $"]
[{"$nulls":5},"Revised stoploss #"]
[]
{"$rows_left_out":218}