{"text_format":"3","workbook":"xlsx","n_sheets":6,"sheets":["Main","Future Intra","Cash Intra","MidCap Intra","Bulk Deals","Call Tracker (Equity & F&O)"],"not_rendered":{"images":2,"defined_names":2},"read":"whole","date_system":"1900"}

{"sheet":"Main","index":0,"n_rows":27,"n_cols":11,"rows_kept":27}
[null,"                                                                                                 "]
{"$rows_empty":8}
[null,"2022-05-04"]
[]
[null,"Sheet No.","Template Name","Summary"]
[null,1,"Future Intra","For Intraday trading in F&O segment"]
[null,2,"Cash Intra","For Intraday trading in cash market segment"]
[null,3,"Mid-cap Intra","For Intraday trading in Mid-cap stocks"]
[null,4,"Bulk Deals","Reveals Bulk Deals carried on NSE & BSE"]
[null,5,"Call Tracker"]
{"$rows_empty":9}
[{"$nulls":10},"`"]

{"sheet":"Future Intra","index":1,"n_rows":239,"n_cols":16,"rows_kept":239,"merged":[[8,0,9,0],[8,1,9,1],[8,2,9,2],[8,3,9,3],[8,6,8,8],[8,9,8,11]]}
[]
[]
[]
[]
[{"$nulls":12},"Back to Main Page"]
["FOR INTRA DAY TRADING",{"$nulls":10},{"$f":"Main!B10","v":"2022-05-04"}]
[]
[]
["Sr.no","Sector","Scrip","Expiry Date","CLOSE RATE","Pivot Point","Supports",null,null,"Resistances"]
[{"$nulls":4},"Point","Point","S1","S2","S3","R1","R2","R3","HIGH","LOW","OI","% Change in OI"]
[1,"Index","NIFTY","2022-05-26",17084.25,{"v":17042.416666666668,"d":"17042.42"},{"v":16966.833333333336,"d":"16966.83"},{"v":16849.416666666668,"d":"16849.42"},{"v":16773.833333333336,"d":"16773.83"},{"v":17159.833333333336,"d":"17159.83"},{"v":17235.41666666667,"d":"17235.42"},{"v":17352.833333333336,"d":"17352.83"},17118,16925,11139350,{"v":0.04913022594347175,"d":"4.91%"}]
[2,"Index","BANKNIFTY","2022-05-26",36208.55,{"v":36039.01666666667,"d":"36039.02"},{"v":35798.53333333334,"d":"35798.53"},{"v":35388.51666666667,"d":"35388.52"},{"v":35148.03333333334,"d":"35148.03"},{"v":36449.03333333334,"d":"36449.03"},{"v":36689.51666666666,"d":"36689.52"},{"v":37099.53333333334,"d":"37099.53"},36279.5,35629,2784225,{"v":-0.003061471117436958,"d":"-0.31%"}]
[3,"Index","FINNIFTY","2022-05-31",{"v":16681.7,"d":"16681.70"},{"v":16637.283333333336,"d":"16637.28"},{"v":16544.616666666672,"d":"16544.62"},{"v":16407.533333333336,"d":"16407.53"},{"v":16314.866666666672,"d":"16314.87"},{"v":16774.366666666672,"d":"16774.37"},{"v":16867.033333333336,"d":"16867.03"},{"v":17004.116666666672,"d":"17004.12"},16729.95,16500.2,3360,{"v":-0.07692307692307693,"d":"-7.69%"}]
[4,"Index","MIDCPNIFTY","2022-05-31",7173.05,7159.55,{"v":7015.650000000001,"d":"7015.65"},6858.25,6714.35,{"v":7316.950000000001,"d":"7316.95"},7460.85,{"v":7618.250000000001,"d":"7618.25"},7303.45,7002.15,1425,{"v":0.1875,"d":"18.75%"}]
[5,"Chemical","AARTIIND","2022-05-26",{"v":851.9,"d":"851.90"},{"v":860.5833333333334,"d":"860.58"},{"v":836.1666666666667,"d":"836.17"},{"v":820.4333333333334,"d":"820.43"},{"v":796.0166666666668,"d":"796.02"},{"v":876.3166666666667,"d":"876.32"},{"v":900.7333333333335,"d":"900.73"},{"v":916.4666666666667,"d":"916.47"},885,844.85,2778650,{"v":0.17168458781362006,"d":"17.17%"}]
[6,"Capital_Goods","ABB","2022-05-26",2059.15,2067.65,{"v":2042.2000000000003,"d":"2042.20"},2025.25,{"v":1999.8000000000002,"d":"1999.80"},{"v":2084.6000000000004,"d":"2084.60"},2110.05,{"v":2127.0000000000005,"d":"2127.00"},2093.1,2050.7,257250,{"v":-0.019065776930409915,"d":"-1.91%"}]
[7,"Pharma","ABBOTINDIA","2022-05-26",{"v":17150.2,"d":"17150.20"},{"v":17073.233333333334,"d":"17073.23"},{"v":16952.566666666666,"d":"16952.57"},{"v":16754.93333333333,"d":"16754.93"},{"v":16634.266666666663,"d":"16634.27"},{"v":17270.86666666667,"d":"17270.87"},{"v":17391.533333333333,"d":"17391.53"},{"v":17589.16666666667,"d":"17589.17"},17193.9,16875.6,31555,{"v":0.005576800509878904,"d":"0.56%"}]
[8,"Others","ABCAPITAL","2022-05-26",117.35,{"v":117.7,"d":"117.70"},{"v":115.5,"d":"115.50"},{"v":113.64999999999999,"d":"113.65"},{"v":111.44999999999999,"d":"111.45"},{"v":119.55000000000001,"d":"119.55"},{"v":121.75000000000003,"d":"121.75"},{"v":123.60000000000002,"d":"123.60"},119.9,115.85,22624800,{"v":-0.032003012048192774,"d":"-3.20%"}]
[9,"Textile","ABFRL","2022-05-26",{"v":283.4,"d":"283.40"},{"v":282.73333333333335,"d":"282.73"},{"v":280.6666666666667,"d":"280.67"},{"v":277.93333333333334,"d":"277.93"},{"v":275.8666666666667,"d":"275.87"},{"v":285.4666666666667,"d":"285.47"},{"v":287.5333333333333,"d":"287.53"},{"v":290.2666666666667,"d":"290.27"},284.8,280,10134800,{"v":-0.01091093631058107,"d":"-1.09%"}]
[10,"Cement","ACC","2022-05-26",2354.05,{"v":2346.016666666667,"d":"2346.02"},{"v":2328.0333333333338,"d":"2328.03"},{"v":2302.016666666667,"d":"2302.02"},{"v":2284.0333333333338,"d":"2284.03"},{"v":2372.0333333333338,"d":"2372.03"},{"v":2390.0166666666664,"d":"2390.02"},{"v":2416.0333333333338,"d":"2416.03"},2364,2320,2700250,{"v":0.003250975292587776,"d":"0.33%"}]
[11,"Others","ADANIENT","2022-05-26",2350.05,{"v":2346.4833333333336,"d":"2346.48"},{"v":2321.566666666667,"d":"2321.57"},{"v":2293.0833333333335,"d":"2293.08"},{"v":2268.166666666667,"d":"2268.17"},{"v":2374.966666666667,"d":"2374.97"},{"v":2399.883333333333,"d":"2399.88"},{"v":2428.3666666666672,"d":"2428.37"},2371.4,2318,18869500,{"v":2.1243261902865185E-3,"d":"0.21%"}]
[12,"Others","ADANIPORTS","2022-05-26",{"v":860.5,"d":"860.50"},855.85,{"v":845.6500000000001,"d":"845.65"},{"v":830.8000000000001,"d":"830.80"},{"v":820.6000000000001,"d":"820.60"},{"v":870.7,"d":"870.70"},{"v":880.9000000000001,"d":"880.90"},895.75,866.05,841,77552500,{"v":-2.7393287033307016E-4,"d":"-0.03%"}]
[13,"Pharma","ALKEM","2022-05-26",{"v":3281.7,"d":"3281.70"},{"v":3257.683333333333,"d":"3257.68"},{"v":3195.3166666666657,"d":"3195.32"},{"v":3108.933333333333,"d":"3108.93"},{"v":3046.5666666666657,"d":"3046.57"},{"v":3344.0666666666657,"d":"3344.07"},{"v":3406.4333333333334,"d":"3406.43"},{"v":3492.8166666666657,"d":"3492.82"},3320.05,3171.3,256200,{"v":0.08284023668639054,"d":"8.28%"}]
[14,"Automobile","AMARAJABAT","2022-05-26",{"v":555.8,"d":"555.80"},{"v":556.1333333333333,"d":"556.13"},{"v":551.7666666666667,"d":"551.77"},{"v":547.7333333333333,"d":"547.73"},{"v":543.3666666666667,"d":"543.37"},{"v":560.1666666666666,"d":"560.17"},{"v":564.5333333333332,"d":"564.53"},{"v":568.5666666666666,"d":"568.57"},560.5,552.1,6555000,{"v":0.015491866769945779,"d":"1.55%"}]
[15,"Cement","AMBUJACEM","2022-05-26",{"v":380,"d":"380.00"},{"v":377.6166666666666,"d":"377.62"},{"v":373.03333333333325,"d":"373.03"},{"v":366.0666666666666,"d":"366.07"},{"v":361.48333333333323,"d":"361.48"},{"v":384.58333333333326,"d":"384.58"},{"v":389.16666666666663,"d":"389.17"},{"v":396.13333333333327,"d":"396.13"},382.2,370.65,37942800,{"v":0.028051209103840683,"d":"2.81%"}]
[16,"Pharma","APLLTD","2022-05-26",787.55,{"v":783.3000000000001,"d":"783.30"},{"v":775.6000000000001,"d":"775.60"},{"v":763.6500000000001,"d":"763.65"},{"v":755.9500000000002,"d":"755.95"},{"v":795.2500000000001,"d":"795.25"},{"v":802.9500000000002,"d":"802.95"},{"v":814.9000000000001,"d":"814.90"},791,771.35,1453200,{"v":-0.022598870056497175,"d":"-2.26%"}]
[17,"Others","APOLLOHOSP","2022-05-26",4311.35,{"v":4348.950000000001,"d":"4348.95"},{"v":4255.100000000001,"d":"4255.10"},4198.85,{"v":4105.000000000001,"d":"4105.00"},{"v":4405.200000000002,"d":"4405.20"},4499.05,{"v":4555.300000000002,"d":"4555.30"},4442.8,4292.7,1951625,{"v":0.02132530908615163,"d":"2.13%"}]
[18,"Automobile","APOLLOTYRE","2022-05-26",{"v":203.1,"d":"203.10"},{"v":202.91666666666666,"d":"202.92"},{"v":200.9333333333333,"d":"200.93"},{"v":198.76666666666665,"d":"198.77"},{"v":196.7833333333333,"d":"196.78"},{"v":205.08333333333331,"d":"205.08"},{"v":207.06666666666666,"d":"207.07"},{"v":209.23333333333332,"d":"209.23"},204.9,200.75,14088500,{"v":-0.005926971247133533,"d":"-0.59%"}]
[19,"Automobile","ASHOKLEY","2022-05-26",126.35,{"v":125.48333333333333,"d":"125.48"},{"v":123.21666666666667,"d":"123.22"},{"v":120.08333333333333,"d":"120.08"},{"v":117.81666666666666,"d":"117.82"},{"v":128.61666666666667,"d":"128.62"},{"v":130.88333333333335,"d":"130.88"},{"v":134.01666666666668,"d":"134.02"},127.75,122.35,32072500,{"v":-0.05879504636694448,"d":"-5.88%"}]
[20,"FMCG","ASIANPAINT","2022-05-26",3203.85,{"v":3196.2666666666664,"d":"3196.27"},{"v":3175.1333333333328,"d":"3175.13"},{"v":3146.4166666666665,"d":"3146.42"},{"v":3125.283333333333,"d":"3125.28"},{"v":3224.9833333333327,"d":"3224.98"},{"v":3246.116666666666,"d":"3246.12"},{"v":3274.8333333333326,"d":"3274.83"},3217.4,3167.55,5150900,{"v":0.011457914011644461,"d":"1.15%"}]
{"$rows_left_out":200}
{"sheet":"Cash Intra","index":2,"n_rows":246,"n_cols":13,"rows_kept":246,"merged":[[7,0,8,0],[7,1,8,1],[7,2,8,2],[7,3,8,3],[7,4,7,6],[7,7,7,9]]}
[]
[]
[]
[]
[{"$nulls":12},"Back to Main Page"]
["FOR INTRA DAY TRADING",{"$nulls":9},{"$f":"Main!B10","v":"2022-05-04"}]
[]
["Sr.no",null,"CLOSE RATE","Pivot Point","Supports",null,null,"Resistances"]
[{"$nulls":4},"S1","S2","S3","R1","R2","R3","HIGH","LOW","Total Trade Quanity in Lakhs"]
[1,"Nifty 50",17069.1,{"v":17026.2,"d":"17026.20"},16960.15,{"v":16851.2,"d":"16851.20"},16785.15,17135.15,{"v":17201.199999999997,"d":"17201.20"},17310.15,17092.25,16917.25]
[2,"Nifty Bank",36163.75,{"v":36005.73333333333,"d":"36005.73"},{"v":35776.21666666666,"d":"35776.22"},{"v":35388.68333333333,"d":"35388.68"},{"v":35159.16666666666,"d":"35159.17"},{"v":36393.26666666666,"d":"36393.27"},{"v":36622.78333333334,"d":"36622.78"},{"v":37010.316666666666,"d":"37010.32"},36235.25,35618.2]
[3,"Nifty CPSE",2654.05,{"v":2641.516666666667,"d":"2641.52"},{"v":2622.6333333333337,"d":"2622.63"},{"v":2591.2166666666667,"d":"2591.22"},{"v":2572.3333333333335,"d":"2572.33"},{"v":2672.933333333334,"d":"2672.93"},{"v":2691.816666666667,"d":"2691.82"},{"v":2723.233333333334,"d":"2723.23"},2660.4,2610.1]
[4,"Nifty Infra",5122.1,5106.85,{"v":5088.1,"d":"5088.10"},{"v":5054.1,"d":"5054.10"},5035.35,5140.85,{"v":5159.6,"d":"5159.60"},{"v":5193.6,"d":"5193.60"},5125.6,5072.85]
[5,"Nifty IT",31138.8,{"v":31163.033333333336,"d":"31163.03"},{"v":30916.41666666667,"d":"30916.42"},{"v":30694.033333333336,"d":"30694.03"},{"v":30447.41666666667,"d":"30447.42"},{"v":31385.41666666667,"d":"31385.42"},{"v":31632.033333333333,"d":"31632.03"},{"v":31854.41666666667,"d":"31854.42"},31409.65,30940.65]
[6,"Nifty PSE",4242.05,4225.05,4198.75,4155.45,4129.15,4268.35,{"v":4294.6500000000015,"d":"4294.65"},{"v":4337.950000000001,"d":"4337.95"},4251.35,4181.75]
[7,"Nifty Midcap 50",8120.15,{"v":8102.799999999999,"d":"8102.80"},{"v":8072.399999999999,"d":"8072.40"},8024.65,{"v":7994.249999999999,"d":"7994.25"},{"v":8150.549999999998,"d":"8150.55"},8180.95,{"v":8228.699999999997,"d":"8228.70"},8133.2,8055.05]
[8,"ACC",2347.2,{"v":2338.4,"d":"2338.40"},{"v":2318.5,"d":"2318.50"},{"v":2289.7999999999997,"d":"2289.80"},{"v":2269.8999999999996,"d":"2269.90"},{"v":2367.1000000000004,"d":"2367.10"},{"v":2387.000000000001,"d":"2387.00"},{"v":2415.7000000000007,"d":"2415.70"},2358.3,2309.7,4.90846]
[9,"AUBANK",1371.1,{"v":1372.5166666666667,"d":"1372.52"},{"v":1354.6333333333332,"d":"1354.63"},{"v":1338.1666666666665,"d":"1338.17"},{"v":1320.283333333333,"d":"1320.28"},{"v":1388.9833333333333,"d":"1388.98"},{"v":1406.866666666667,"d":"1406.87"},{"v":1423.3333333333335,"d":"1423.33"},1390.4,1356.05,10.35462]
[10,"AARTIIND",847.65,{"v":856.0166666666668,"d":"856.02"},{"v":830.1833333333335,"d":"830.18"},{"v":812.7166666666667,"d":"812.72"},{"v":786.8833333333334,"d":"786.88"},{"v":873.4833333333336,"d":"873.48"},{"v":899.3166666666668,"d":"899.32"},{"v":916.7833333333336,"d":"916.78"},881.85,838.55,13.11997]
[11,"ADANIENT",2339.5,{"v":2337.6,"d":"2337.60"},{"v":2312.8999999999996,"d":"2312.90"},{"v":2286.2999999999997,"d":"2286.30"},{"v":2261.5999999999995,"d":"2261.60"},{"v":2364.2,"d":"2364.20"},{"v":2388.8999999999996,"d":"2388.90"},{"v":2415.5,"d":"2415.50"},2362.3,2311,10.06544]
[12,"ADANIGREEN",2830.35,{"v":2844.7833333333333,"d":"2844.78"},{"v":2794.5666666666666,"d":"2794.57"},{"v":2758.7833333333333,"d":"2758.78"},{"v":2708.5666666666666,"d":"2708.57"},{"v":2880.5666666666666,"d":"2880.57"},{"v":2930.783333333333,"d":"2930.78"},{"v":2966.5666666666666,"d":"2966.57"},2895,2809,3.74592]
[13,"ADANIPORTS",856.55,{"v":852.4833333333332,"d":"852.48"},{"v":842.1166666666664,"d":"842.12"},{"v":827.6833333333332,"d":"827.68"},{"v":817.3166666666664,"d":"817.32"},{"v":866.9166666666665,"d":"866.92"},{"v":877.2833333333333,"d":"877.28"},{"v":891.7166666666666,"d":"891.72"},862.85,838.05,57.60499]
[14,"ATGL",2488.2,{"v":2483.4500000000003,"d":"2483.45"},{"v":2446.9000000000005,"d":"2446.90"},{"v":2405.6000000000004,"d":"2405.60"},{"v":2369.0500000000006,"d":"2369.05"},{"v":2524.7500000000005,"d":"2524.75"},{"v":2561.3000000000006,"d":"2561.30"},{"v":2602.6000000000004,"d":"2602.60"},2520,2442.15,3.05245]
[15,"ADANITRANS",2804.45,2779.15,{"v":2720.3,"d":"2720.30"},2636.15,{"v":2577.3,"d":"2577.30"},{"v":2863.3,"d":"2863.30"},{"v":2922.1499999999996,"d":"2922.15"},{"v":3006.3,"d":"3006.30"},2838,2695,3.15168]
[16,"ABCAPITAL",116.95,{"v":117.31666666666666,"d":"117.32"},{"v":115.18333333333332,"d":"115.18"},{"v":113.41666666666666,"d":"113.42"},{"v":111.28333333333332,"d":"111.28"},{"v":119.08333333333333,"d":"119.08"},{"v":121.21666666666665,"d":"121.22"},{"v":122.98333333333333,"d":"122.98"},119.45,115.55,48.44723]
[17,"ABFRL",282.45,{"v":282.3666666666666,"d":"282.37"},{"v":279.78333333333325,"d":"279.78"},{"v":277.1166666666666,"d":"277.12"},{"v":274.53333333333325,"d":"274.53"},{"v":285.03333333333325,"d":"285.03"},{"v":287.6166666666666,"d":"287.62"},{"v":290.28333333333325,"d":"290.28"},284.95,279.7,8.17211]
[18,"AJANTPHARM",1803.15,{"v":1795.6166666666668,"d":"1795.62"},{"v":1727.5333333333335,"d":"1727.53"},{"v":1651.9166666666667,"d":"1651.92"},{"v":1583.8333333333335,"d":"1583.83"},{"v":1871.2333333333336,"d":"1871.23"},{"v":1939.3166666666666,"d":"1939.32"},{"v":2014.9333333333336,"d":"2014.93"},1863.7,1720,2.87821]
[19,"APLLTD",786.6,{"v":779.5166666666668,"d":"779.52"},{"v":767.0333333333335,"d":"767.03"},{"v":747.4666666666668,"d":"747.47"},{"v":734.9833333333336,"d":"734.98"},{"v":799.0833333333335,"d":"799.08"},{"v":811.5666666666668,"d":"811.57"},{"v":831.1333333333334,"d":"831.13"},792,759.95,1.90613]
[20,"ALKEM",3272.8,{"v":3268.633333333333,"d":"3268.63"},{"v":3223.5666666666666,"d":"3223.57"},{"v":3174.3333333333335,"d":"3174.33"},{"v":3129.266666666667,"d":"3129.27"},{"v":3317.8666666666663,"d":"3317.87"},{"v":3362.933333333333,"d":"3362.93"},{"v":3412.166666666666,"d":"3412.17"},3313.7,3219.4,0.51958]
[21,"AMARAJABAT",554.05,{"v":555.2833333333333,"d":"555.28"},{"v":550.1666666666666,"d":"550.17"},{"v":546.2833333333333,"d":"546.28"},{"v":541.1666666666666,"d":"541.17"},{"v":559.1666666666666,"d":"559.17"},{"v":564.2833333333334,"d":"564.28"},{"v":568.1666666666666,"d":"568.17"},560.4,551.4,2.22903]
{"$rows_left_out":217}
{"sheet":"MidCap Intra","index":3,"n_rows":530,"n_cols":13,"rows_kept":530,"merged":[[0,0,0,1],[8,0,9,0],[8,1,9,1],[8,2,9,2],[8,3,9,3],[8,4,8,6],[8,7,8,9]]}
[]
[]
[]
[]
[{"$nulls":11},"Back To Main Page"]
["FOR INTRA DAY TRADING",{"$nulls":9},{"$f":"Main!B10","v":"2022-05-04"}]
[null,null," "]
[]
["Sr.no","Scrip","CLOSE RATE","Pivot Point","Supports",null,null,"Resistances"]
[{"$nulls":4},"S1","S2","S3","R1","R2","R3","HIGH","LOW","Total Trade Quanity in Lakhs"]
[1,"3MINDIA",19831.1,{"v":19844.033333333333,"d":"19844.03"},{"v":19587.066666666666,"d":"19587.07"},{"v":19343.033333333333,"d":"19343.03"},{"v":19086.066666666666,"d":"19086.07"},{"v":20088.066666666666,"d":"20088.07"},{"v":20345.033333333333,"d":"20345.03"},{"v":20589.066666666666,"d":"20589.07"},20101,19600,0.05191]
[2,"AARTIDRUGS",457.25,455.95,{"v":451.9,"d":"451.90"},446.55,{"v":442.5,"d":"442.50"},{"v":461.29999999999995,"d":"461.30"},465.35,{"v":470.69999999999993,"d":"470.70"},460,450.6,0.53806]
[3,"AARTIIND",847.65,{"v":856.0166666666668,"d":"856.02"},{"v":830.1833333333335,"d":"830.18"},{"v":812.7166666666667,"d":"812.72"},{"v":786.8833333333334,"d":"786.88"},{"v":873.4833333333336,"d":"873.48"},{"v":899.3166666666668,"d":"899.32"},{"v":916.7833333333336,"d":"916.78"},881.85,838.55,13.11997]
[4,"AAVAS",2289.4,{"v":2278.133333333333,"d":"2278.13"},{"v":2261.2666666666664,"d":"2261.27"},{"v":2233.133333333333,"d":"2233.13"},{"v":2216.2666666666664,"d":"2216.27"},{"v":2306.2666666666664,"d":"2306.27"},{"v":2323.133333333333,"d":"2323.13"},{"v":2351.2666666666664,"d":"2351.27"},2295,2250,0.31684]
[5,"ABB",2051.35,{"v":2063.1,"d":"2063.10"},{"v":2029.6999999999998,"d":"2029.70"},2008.05,{"v":1974.6499999999999,"d":"1974.65"},2084.75,{"v":2118.1500000000005,"d":"2118.15"},{"v":2139.7999999999997,"d":"2139.80"},2096.5,2041.45,0.48561]
[6,"ABBOTINDIA",17081.55,{"v":17042.633333333335,"d":"17042.63"},{"v":16885.31666666667,"d":"16885.32"},{"v":16689.083333333336,"d":"16689.08"},{"v":16531.76666666667,"d":"16531.77"},{"v":17238.86666666667,"d":"17238.87"},{"v":17396.183333333334,"d":"17396.18"},{"v":17592.416666666668,"d":"17592.42"},17199.95,16846.4,0.08825]
[7,"ABCAPITAL",116.95,{"v":117.31666666666666,"d":"117.32"},{"v":115.18333333333332,"d":"115.18"},{"v":113.41666666666666,"d":"113.42"},{"v":111.28333333333332,"d":"111.28"},{"v":119.08333333333333,"d":"119.08"},{"v":121.21666666666665,"d":"121.22"},{"v":122.98333333333333,"d":"122.98"},119.45,115.55,48.44723]
[8,"ABFRL",282.45,{"v":282.3666666666666,"d":"282.37"},{"v":279.78333333333325,"d":"279.78"},{"v":277.1166666666666,"d":"277.12"},{"v":274.53333333333325,"d":"274.53"},{"v":285.03333333333325,"d":"285.03"},{"v":287.6166666666666,"d":"287.62"},{"v":290.28333333333325,"d":"290.28"},284.95,279.7,8.17211]
[9,"ACC",2347.2,{"v":2338.4,"d":"2338.40"},{"v":2318.5,"d":"2318.50"},{"v":2289.7999999999997,"d":"2289.80"},{"v":2269.8999999999996,"d":"2269.90"},{"v":2367.1000000000004,"d":"2367.10"},{"v":2387.000000000001,"d":"2387.00"},{"v":2415.7000000000007,"d":"2415.70"},2358.3,2309.7,4.90846]
[10,"ADANIENT",2339.5,{"v":2337.6,"d":"2337.60"},{"v":2312.8999999999996,"d":"2312.90"},{"v":2286.2999999999997,"d":"2286.30"},{"v":2261.5999999999995,"d":"2261.60"},{"v":2364.2,"d":"2364.20"},{"v":2388.8999999999996,"d":"2388.90"},{"v":2415.5,"d":"2415.50"},2362.3,2311,10.06544]
[11,"ADANIGREEN",2830.35,{"v":2844.7833333333333,"d":"2844.78"},{"v":2794.5666666666666,"d":"2794.57"},{"v":2758.7833333333333,"d":"2758.78"},{"v":2708.5666666666666,"d":"2708.57"},{"v":2880.5666666666666,"d":"2880.57"},{"v":2930.783333333333,"d":"2930.78"},{"v":2966.5666666666666,"d":"2966.57"},2895,2809,3.74592]
[12,"ADANIPORTS",856.55,{"v":852.4833333333332,"d":"852.48"},{"v":842.1166666666664,"d":"842.12"},{"v":827.6833333333332,"d":"827.68"},{"v":817.3166666666664,"d":"817.32"},{"v":866.9166666666665,"d":"866.92"},{"v":877.2833333333333,"d":"877.28"},{"v":891.7166666666666,"d":"891.72"},862.85,838.05,57.60499]
[13,"ADANITRANS",2804.45,2779.15,{"v":2720.3,"d":"2720.30"},2636.15,{"v":2577.3,"d":"2577.30"},{"v":2863.3,"d":"2863.30"},{"v":2922.1499999999996,"d":"2922.15"},{"v":3006.3,"d":"3006.30"},2838,2695,3.15168]
[14,"ADVENZYMES",295.15,{"v":297,"d":"297.00"},292.15,289.15,{"v":284.29999999999995,"d":"284.30"},{"v":300,"d":"300.00"},304.85,307.85,301.85,294,0.75464]
[15,"AEGISCHEM",217.7,{"v":218.51666666666665,"d":"218.52"},{"v":215.2833333333333,"d":"215.28"},{"v":212.86666666666665,"d":"212.87"},{"v":209.6333333333333,"d":"209.63"},{"v":220.9333333333333,"d":"220.93"},{"v":224.16666666666666,"d":"224.17"},{"v":226.58333333333331,"d":"226.58"},221.75,216.1,3.07736]
[16,"AFFLE",1219.65,{"v":1216.0833333333333,"d":"1216.08"},{"v":1203.5666666666666,"d":"1203.57"},{"v":1187.4833333333333,"d":"1187.48"},{"v":1174.9666666666667,"d":"1174.97"},{"v":1232.1666666666665,"d":"1232.17"},{"v":1244.6833333333334,"d":"1244.68"},{"v":1260.7666666666664,"d":"1260.77"},1228.6,1200,1.43936]
[17,"AIAENG",1941,{"v":1960.3333333333333,"d":"1960.33"},{"v":1900.6666666666665,"d":"1900.67"},{"v":1860.3333333333333,"d":"1860.33"},{"v":1800.6666666666665,"d":"1800.67"},{"v":2000.6666666666665,"d":"2000.67"},{"v":2060.333333333333,"d":"2060.33"},{"v":2100.6666666666665,"d":"2100.67"},2020,1920,1.59963]
[18,"AJANTPHARM",1803.15,{"v":1795.6166666666668,"d":"1795.62"},{"v":1727.5333333333335,"d":"1727.53"},{"v":1651.9166666666667,"d":"1651.92"},{"v":1583.8333333333335,"d":"1583.83"},{"v":1871.2333333333336,"d":"1871.23"},{"v":1939.3166666666666,"d":"1939.32"},{"v":2014.9333333333336,"d":"2014.93"},1863.7,1720,2.87821]
[19,"ALEMBICLTD",77.6,{"v":77.68333333333334,"d":"77.68"},{"v":75.96666666666667,"d":"75.97"},{"v":74.33333333333333,"d":"74.33"},{"v":72.61666666666666,"d":"72.62"},{"v":79.31666666666668,"d":"79.32"},{"v":81.03333333333335,"d":"81.03"},{"v":82.66666666666669,"d":"82.67"},79.4,76.05,1.56753]
[20,"ALKEM",3272.8,{"v":3268.633333333333,"d":"3268.63"},{"v":3223.5666666666666,"d":"3223.57"},{"v":3174.3333333333335,"d":"3174.33"},{"v":3129.266666666667,"d":"3129.27"},{"v":3317.8666666666663,"d":"3317.87"},{"v":3362.933333333333,"d":"3362.93"},{"v":3412.166666666666,"d":"3412.17"},3313.7,3219.4,0.51958]
{"$rows_left_out":501}
{"sheet":"Bulk Deals","index":4,"n_rows":70,"n_cols":8,"rows_kept":70,"merged":[[4,0,4,1],[4,2,4,3],[6,1,6,2]]}
[" "]
[]
[]
[]
[]
[{"$nulls":4},"Back To Main Page"]
["Subject :","BULK DEAL",null,{"$f":"Main!B10","v":"2022-05-04"}]
[]
["Date","Scrip code","Scrip Name","Client Name","Buy / Sell","Quantity Traded","Trade Price / Wt.Avg.trade price","Exchange  "]
["2022-05-02",539621,"BCLENTERPR","TOPGAIN FINANCE PRIVATE LIMITED","SELL",{"v":308240,"d":"308,240"},3.8,"BSE"]
["2022-05-02",539559,"DDIL","MANISHA CHORDIA .","BUY",{"v":49950,"d":"49,950"},16.7,"BSE"]
["2022-05-02",540811,"DML","KINGSMAN WEALTH MANAGEMENT PRIVATE LIMITED","BUY",{"v":50000,"d":"50,000"},17,"BSE"]
["2022-05-02",504351,"EMPOWER","AVANCE TECHNOLOGIES LIMITED","SELL",{"v":12500000,"d":"12,500,000"},0.15,"BSE"]
["2022-05-02",524590,"HEMORGANIC","HARSHAD BABUBHAI PATEL","SELL",{"v":24072,"d":"24,072"},73.55,"BSE"]
["2022-05-02",524590,"HEMORGANIC","PURAV BHARATBHAI PATEL","BUY",{"v":18028,"d":"18,028"},72.82,"BSE"]
["2022-05-02",541627,"HITECHWIND","SWARUPGUCHHAIT","BUY",{"v":41498,"d":"41,498"},3.29,"BSE"]
["2022-05-02",540134,"IISL","SWARUPGUCHHAIT","BUY",{"v":36970,"d":"36,970"},4.03,"BSE"]
["2022-05-02",501700,"INDIANVSH","ANJALI CREDIT PRIVATE LIMITED","SELL",{"v":500000,"d":"500,000"},52.1,"BSE"]
["2022-05-02",509051,"INDINFO","NIRAJ RAJNIKANT SHAH","BUY",{"v":7500000,"d":"7,500,000"},4.27,"BSE"]
["2022-05-02",509051,"INDINFO","SHERWOOD SECURITIES PVT LTD","SELL",{"v":49000000,"d":"49,000,000"},4.27,"BSE"]
["2022-05-02",509051,"INDINFO","MAYANK GLOBAL FINANCE LIMITED","BUY",{"v":6500000,"d":"6,500,000"},4.27,"BSE"]
["2022-05-02",530443,"KIRANSY-B","RITIKESHKUMAR","BUY",{"v":27119,"d":"27,119"},9.21,"BSE"]
["2022-05-02",539910,"KOCL","ARTLINK VINTRADE LIMITED","SELL",{"v":226670,"d":"226,670"},5.91,"BSE"]
["2022-05-02",539910,"KOCL","ALPHA LEON ENTERPRISES LLP","SELL",{"v":132498,"d":"132,498"},5.71,"BSE"]
["2022-05-02",511557,"PROFINC","DIPAK MATHURBHAI SALVI","SELL",{"v":1736740,"d":"1,736,740"},8.24,"BSE"]
["2022-05-02",511557,"PROFINC","BHAVYA DHIMAN","SELL",{"v":450000,"d":"450,000"},8.24,"BSE"]
["2022-05-02",541601,"RAJNISH","ANUSTUP TRADING PRIVATE LIMITED","BUY",{"v":116100,"d":"116,100"},180.82,"BSE"]
["2022-05-02",541151,"RIDINGS","BEELINE MERCHANT BANKING PRIVATE LIMITED","BUY",{"v":64000,"d":"64,000"},6.71,"BSE"]
["2022-05-02",538540,"RLFL","VENKATA SHILPA PERIKA","SELL",{"v":276000,"d":"276,000"},2.9,"BSE"]
["2022-05-02",540821,"SADHNA","AAHUTI RASIK MISTRY","BUY",{"v":100000,"d":"100,000"},33.35,"BSE"]
{"$rows_left_out":41}
{"sheet":"Call Tracker (Equity & F&O)","index":5,"n_rows":253,"n_cols":18,"rows_kept":253}
[]
[]
[]
[]
[{"$nulls":12},"Back To Main Page"]
["Retail Research Technical Calls & Fundamental Performance Report for the month of Apr-2022"]
[{"$nulls":12},{"$f":"Main!B10","v":"2022-05-04"}]
[null,"Positional  Call"]
["Sr.no","Date",null,"Company","Rec","Rec Price","Stop Loss***","Call Closed At","Target","Remark","Profit / Loss per Share","All charges","Net Gain / Loss  %","Status","Closed Date","Market Closing Price"]
[1,"2022-03-21",null,"WHIRLPOOL","Buy",1640,1530,1675,"1800-1900","Profit of Rs.35/-",{"$f":"H10-F10","v":35},{"$f":"(F10*-0.7)/100","v":-11.48},{"$f":"(K10+L10)/F10","v":{"v":0.014341463414634147,"d":"1.43%"}},"Successful","2022-05-02",{"$f":"VLOOKUP(D10,'MidCap Intra'!B18:C572,2,0)","v":1646.1},null,"H"]
[2,"2022-04-13",null,"CAMS","Buy","2580-2610",2395,null,"2800-2900","Open",{"$nulls":5},{"$f":"VLOOKUP(D11,'MidCap Intra'!B26:C580,2,0)","v":2439.65},null,"H"]
[3,"2022-04-19",null,"REDINGTON","Buy","157-159",149,null,"170-180","Open",{"$nulls":5},{"$f":"VLOOKUP(D12,'MidCap Intra'!B27:C581,2,0)","v":150.45},null,"H"]
[4,"2022-04-20",null,"IRCTC","Buy","750-760",695,null,"830-900","Open",{"$nulls":5},{"$f":"VLOOKUP(D13,'MidCap Intra'!B28:C582,2,0)","v":737.5},null,"H"]
[]
[]
[]
["CLBS = Closing Basis ***"]
["Dividend adjusted <>",{"$nulls":4},"Reinitiated $"]
["Part book {}",null,null,"s",null,"Revised stoploss #"]
[]
[null,"Momentum Call"]
["Sr.no","Date",null,"Company","Rec","Rec Price","Stop Loss","Call Closed At","Target","Remark","Profit / Loss per Share/Lot","All charges","Net Gain / Loss  %","Status","Closed Date"]
[1,"2022-04-20",null,"CANBK ","Buy","233-234",227,null,"242-250","Open",{"$nulls":7},"H"]
[2,"2022-04-21",null,"SUPREMEIND","Buy","1975-1985",1920,null,"2050-2100","Open",{"$nulls":7},"H"]
[3,"2022-04-21",null,"HDFCBANK","Buy","1370-1380",1340,null,1450,"Open",{"$nulls":7},"H"]
[4,"2022-04-22",null,"MTARTECH","Buy","1705-1715",1647,null,"1760-1800","Open",{"$nulls":7},"H"]
[5,"2022-04-25",null,"TATAPOWER","Buy","247-250",240,null,265,"Open",{"$nulls":7},"H"]
[6,"2022-04-28",null,"AEGISCHEM","Buy","219-220",214,null,"230-232","Open"]
[]
[]
{"$rows_left_out":212}