{"text_format":"3","workbook":"xlsx","n_sheets":11,"sheets":["Main","Future Intra","Cash Intra","MidCap Intra","Bulk Deals","Call Tracker (Equity & F&O)","Sheet2","Sheet1","Sheet3","Sheet4","Sheet5"],"not_rendered":{"images":4,"defined_names":5},"read":"whole","date_system":"1900"}

{"sheet":"Main","index":0,"n_rows":27,"n_cols":11,"rows_kept":27}
[null,"                                                                                                 "]
{"$rows_empty":8}
[null,"2020-03-04"]
[]
[null,"Sheet No.","Template Name","Summary"]
[null,1,"Future Intra","For Intraday trading in F&O segment"]
[null,2,"Cash Intra","For Intraday trading in cash market segment"]
[null,3,"Mid-cap Intra","For Intraday trading in Mid-cap stocks"]
[null,4,"Bulk Deals","Reveals Bulk Deals carried on NSE & BSE"]
[null,5,"Call Tracker"]
{"$rows_empty":9}
[{"$nulls":10},"`"]

{"sheet":"Future Intra","index":1,"n_rows":190,"n_cols":15,"rows_kept":190,"merged":[[8,0,9,0],[8,1,9,1],[8,2,9,2],[8,5,8,7],[8,8,8,10]]}
[]
[]
[]
[]
[{"$nulls":12},"Back to Main Page"]
["FOR INTRA DAY TRADING",{"$nulls":10},{"$f":"Main!B10","v":"2020-03-04"}]
[]
[]
["Sr.no","Sector","Scrip","CLOSE RATE","Pivot Point","Supports",null,null,"Resistances"]
[null,"Sector",null,"Point","Point","S1","S2","S3","R1","R2","R3","HIGH","LOW","OI","% Change in OI"]
[1,"Index","BANKNIFTY",29223.75,{"v":29101.516666666663,"d":"29101.52"},{"v":28874.833333333325,"d":"28874.83"},{"v":28525.91666666666,"d":"28525.92"},{"v":28299.233333333323,"d":"28299.23"},{"v":29450.433333333327,"d":"29450.43"},{"v":29677.11666666666,"d":"29677.12"},{"v":30026.03333333333,"d":"30026.03"},29328.2,28752.6,1353680,{"v":0.064146908999434,"d":"6.41%"}]
[2,"Index","NIFTY",11294.75,{"v":11247.199999999999,"d":"11247.20"},{"v":11167.649999999998,"d":"11167.65"},11040.55,{"v":10960.999999999998,"d":"10961.00"},{"v":11374.299999999997,"d":"11374.30"},{"v":11453.849999999997,"d":"11453.85"},{"v":11580.949999999997,"d":"11580.95"},11326.75,11120.1,15979650,{"v":0.04863151574212156,"d":"4.86%"}]
[3,"Index","NIFTYIT",{"v":15683,"d":"15683.00"},{"v":15618.666666666666,"d":"15618.67"},{"v":15507.333333333332,"d":"15507.33"},{"v":15331.666666666666,"d":"15331.67"},{"v":15220.333333333332,"d":"15220.33"},{"v":15794.333333333332,"d":"15794.33"},{"v":15905.666666666664,"d":"15905.67"},{"v":16081.333333333332,"d":"16081.33"},15730,15443,4900,{"v":0.07692307692307693,"d":"7.69%"}]
[4,"Cement","ACC",1334.95,{"v":1320.9333333333334,"d":"1320.93"},{"v":1302.0666666666668,"d":"1302.07"},{"v":1269.1833333333334,"d":"1269.18"},{"v":1250.3166666666668,"d":"1250.32"},{"v":1353.8166666666668,"d":"1353.82"},{"v":1372.6833333333336,"d":"1372.68"},{"v":1405.5666666666668,"d":"1405.57"},1339.8,1288.05,3486000,{"v":-0.03839788149619331,"d":"-3.84%"}]
[5,"Others","ADANIENT",{"v":225.7,"d":"225.70"},{"v":224.1,"d":"224.10"},{"v":221,"d":"221.00"},{"v":216.3,"d":"216.30"},{"v":213.20000000000002,"d":"213.20"},{"v":228.79999999999998,"d":"228.80"},{"v":231.89999999999995,"d":"231.90"},{"v":236.59999999999997,"d":"236.60"},227.2,219.4,27360000,{"v":-0.023693976591493006,"d":"-2.37%"}]
[6,"Others","ADANIPORTS",{"v":347.2,"d":"347.20"},345.75,{"v":342.7,"d":"342.70"},{"v":338.2,"d":"338.20"},335.15,350.25,{"v":353.29999999999995,"d":"353.30"},{"v":357.8,"d":"357.80"},348.8,341.25,32975000,{"v":0.027258566978193146,"d":"2.73%"}]
[7,"Power","ADANIPOWER",48.95,{"v":48.833333333333336,"d":"48.83"},{"v":47.91666666666667,"d":"47.92"},{"v":46.88333333333333,"d":"46.88"},{"v":45.96666666666667,"d":"45.97"},{"v":49.866666666666674,"d":"49.87"},{"v":50.783333333333346,"d":"50.78"},{"v":51.81666666666668,"d":"51.82"},49.75,47.8,72870000,{"v":-0.005051884216275259,"d":"-0.51%"}]
[8,"Automobile","AMARAJABAT",{"v":643.6,"d":"643.60"},{"v":638.6666666666666,"d":"638.67"},{"v":630.4333333333333,"d":"630.43"},{"v":617.2666666666667,"d":"617.27"},{"v":609.0333333333333,"d":"609.03"},{"v":651.8333333333333,"d":"651.83"},{"v":660.0666666666666,"d":"660.07"},{"v":673.2333333333332,"d":"673.23"},646.9,625.5,2140000,{"v":-0.020863836017569547,"d":"-2.09%"}]
[9,"Cement","AMBUJACEM",211.75,{"v":209.4,"d":"209.40"},206.25,200.75,{"v":197.6,"d":"197.60"},{"v":214.9,"d":"214.90"},{"v":218.05000000000004,"d":"218.05"},223.55,212.55,203.9,19947500,{"v":0.010639645345155161,"d":"1.06%"}]
[10,"Others","APOLLOHOSP",1732.15,{"v":1727.6166666666668,"d":"1727.62"},{"v":1705.5333333333335,"d":"1705.53"},{"v":1678.9166666666667,"d":"1678.92"},{"v":1656.8333333333335,"d":"1656.83"},{"v":1754.2333333333336,"d":"1754.23"},{"v":1776.3166666666666,"d":"1776.32"},{"v":1802.9333333333336,"d":"1802.93"},1749.7,1701,1835000,{"v":0.014933628318584071,"d":"1.49%"}]
{"$rows_left_out":155}
{"sheet":"Cash Intra","index":2,"n_rows":247,"n_cols":13,"rows_kept":247,"merged":[[7,0,8,0],[7,1,8,1],[7,2,8,2],[7,3,8,3],[7,4,7,6],[7,7,7,9]]}
[]
[]
[]
[]
[{"$nulls":12},"Back to Main Page"]
["FOR INTRA DAY TRADING",{"$nulls":9},{"$f":"Main!B10","v":"2020-03-04"}]
[]
["Sr.no","Scrip","CLOSE RATE","Pivot Point","Supports",null,null,"Resistances"]
[null,null,"Point",null,"S1","S2","S3","R1","R2","R3","HIGH","LOW","Total Trade Quanity in Lakhs"]
[1,"Nifty 50",11303.3,{"v":11266.033333333333,"d":"11266.03"},{"v":11189.816666666666,"d":"11189.82"},{"v":11076.333333333332,"d":"11076.33"},{"v":11000.116666666665,"d":"11000.12"},{"v":11379.516666666666,"d":"11379.52"},{"v":11455.733333333334,"d":"11455.73"},{"v":11569.216666666667,"d":"11569.22"},11342.25,11152.55]
[2,"Nifty Bank",29177.05,{"v":29070.649999999998,"d":"29070.65"},{"v":28855.949999999997,"d":"28855.95"},28534.85,{"v":28320.149999999998,"d":"28320.15"},{"v":29391.749999999996,"d":"29391.75"},29606.45,{"v":29927.549999999996,"d":"29927.55"},29285.35,28749.55]
[3,"Nifty CPSE",1601.2,{"v":1585.2333333333333,"d":"1585.23"},{"v":1554.4666666666667,"d":"1554.47"},{"v":1507.7333333333333,"d":"1507.73"},{"v":1476.9666666666667,"d":"1476.97"},{"v":1631.9666666666667,"d":"1631.97"},{"v":1662.7333333333336,"d":"1662.73"},{"v":1709.4666666666667,"d":"1709.47"},1616,1538.5]
[4,"Nifty Infra",3044.8,{"v":3031.4166666666665,"d":"3031.42"},{"v":3005.983333333333,"d":"3005.98"},{"v":2967.1666666666665,"d":"2967.17"},{"v":2941.733333333333,"d":"2941.73"},{"v":3070.233333333333,"d":"3070.23"},{"v":3095.6666666666665,"d":"3095.67"},{"v":3134.483333333333,"d":"3134.48"},3056.85,2992.6]
[5,"Nifty IT",15723.2,{"v":15670.666666666666,"d":"15670.67"},{"v":15548.233333333332,"d":"15548.23"},{"v":15373.266666666666,"d":"15373.27"},{"v":15250.833333333332,"d":"15250.83"},{"v":15845.633333333331,"d":"15845.63"},{"v":15968.066666666666,"d":"15968.07"},{"v":16143.033333333331,"d":"16143.03"},15793.1,15495.7]
[6,"Nifty PSE",2777.25,{"v":2757.866666666667,"d":"2757.87"},{"v":2719.4333333333334,"d":"2719.43"},{"v":2661.616666666667,"d":"2661.62"},{"v":2623.1833333333334,"d":"2623.18"},{"v":2815.6833333333334,"d":"2815.68"},{"v":2854.116666666667,"d":"2854.12"},{"v":2911.9333333333334,"d":"2911.93"},2796.3,2700.05]
[7,"Nifty Midcap 50",4562.2,{"v":4538.433333333333,"d":"4538.43"},{"v":4493.716666666667,"d":"4493.72"},{"v":4425.233333333334,"d":"4425.23"},{"v":4380.516666666667,"d":"4380.52"},{"v":4606.916666666667,"d":"4606.92"},{"v":4651.633333333332,"d":"4651.63"},{"v":4720.116666666667,"d":"4720.12"},4583.15,4469.95]
[8,"ACC",1335.25,1321.75,{"v":1301.5,"d":"1301.50"},1267.75,{"v":1247.5,"d":"1247.50"},{"v":1355.5,"d":"1355.50"},1375.75,{"v":1409.5,"d":"1409.50"},1342,1288,5.14199]
[9,"AUBANK",1174.2,{"v":1171.3999999999999,"d":"1171.40"},{"v":1152.7999999999997,"d":"1152.80"},{"v":1131.3999999999999,"d":"1131.40"},{"v":1112.7999999999997,"d":"1112.80"},{"v":1192.7999999999997,"d":"1192.80"},{"v":1211.3999999999996,"d":"1211.40"},{"v":1232.7999999999997,"d":"1232.80"},1190,1150,4.21839]
[10,"ADANIPORTS",347.3,{"v":346.1166666666666,"d":"346.12"},{"v":343.1833333333332,"d":"343.18"},{"v":339.0666666666666,"d":"339.07"},{"v":336.1333333333332,"d":"336.13"},{"v":350.23333333333323,"d":"350.23"},{"v":353.16666666666663,"d":"353.17"},{"v":357.28333333333325,"d":"357.28"},349.05,342,29.12256]
[11,"ADANIPOWER",48.9,{"v":48.76666666666667,"d":"48.77"},{"v":47.88333333333335,"d":"47.88"},{"v":46.866666666666674,"d":"46.87"},{"v":45.98333333333335,"d":"45.98"},{"v":49.783333333333346,"d":"49.78"},{"v":50.66666666666667,"d":"50.67"},{"v":51.683333333333344,"d":"51.68"},49.65,47.75,57.54033]
{"$rows_left_out":228}
{"sheet":"MidCap Intra","index":3,"n_rows":545,"n_cols":13,"rows_kept":545,"merged":[[0,0,0,1],[8,0,9,0],[8,1,9,1],[8,2,9,2],[8,3,9,3],[8,4,8,6],[8,7,8,9]]}
[]
[]
[]
[]
[{"$nulls":11},"Back To Main Page"]
["FOR INTRA DAY TRADING",{"$nulls":9},{"$f":"Main!B10","v":"2020-03-04"}]
[null,null," "]
[]
["Sr.no","Scrip","CLOSE RATE","Pivot Point","Supports",null,null,"Resistances"]
[null,null,"Point",null,"S1","S2","S3","R1","R2","R3","HIGH","LOW","Total Trade Quanity in Lakhs"]
[1,"3MINDIA",20632.95,{"v":20646.649999999998,"d":"20646.65"},{"v":20298.299999999996,"d":"20298.30"},{"v":19963.649999999998,"d":"19963.65"},{"v":19615.299999999996,"d":"19615.30"},{"v":20981.299999999996,"d":"20981.30"},{"v":21329.649999999994,"d":"21329.65"},{"v":21664.299999999996,"d":"21664.30"},20995,20312,0.07108]
[2,"AARTIIND",983.45,{"v":981.5833333333334,"d":"981.58"},{"v":968.1666666666667,"d":"968.17"},{"v":952.8833333333333,"d":"952.88"},{"v":939.4666666666667,"d":"939.47"},{"v":996.8666666666668,"d":"996.87"},{"v":1010.2833333333335,"d":"1010.28"},{"v":1025.5666666666668,"d":"1025.57"},995,966.3,2.25422]
[3,"AAVAS",1918.2,{"v":1907.1666666666667,"d":"1907.17"},{"v":1869.3333333333335,"d":"1869.33"},{"v":1820.4666666666667,"d":"1820.47"},{"v":1782.6333333333334,"d":"1782.63"},{"v":1956.0333333333335,"d":"1956.03"},{"v":1993.866666666667,"d":"1993.87"},{"v":2042.7333333333336,"d":"2042.73"},1945,1858.3,0.31876]
[4,"ABBOTINDIA",15427.65,{"v":15502.883333333333,"d":"15502.88"},{"v":15225.766666666666,"d":"15225.77"},{"v":15023.883333333333,"d":"15023.88"},{"v":14746.766666666666,"d":"14746.77"},{"v":15704.766666666666,"d":"15704.77"},{"v":15981.883333333331,"d":"15981.88"},{"v":16183.766666666666,"d":"16183.77"},15780,15301,0.18862]
[5,"ABCAPITAL",77.85,{"v":77.83333333333333,"d":"77.83"},{"v":76.81666666666666,"d":"76.82"},{"v":75.78333333333333,"d":"75.78"},{"v":74.76666666666667,"d":"74.77"},{"v":78.86666666666666,"d":"78.87"},{"v":79.88333333333334,"d":"79.88"},{"v":80.91666666666666,"d":"80.92"},78.85,76.8,13.04622]
[6,"ABFRL",254.25,{"v":251.08333333333334,"d":"251.08"},{"v":242.16666666666669,"d":"242.17"},{"v":230.08333333333334,"d":"230.08"},{"v":221.16666666666669,"d":"221.17"},{"v":263.1666666666667,"d":"263.17"},{"v":272.08333333333337,"d":"272.08"},{"v":284.1666666666667,"d":"284.17"},260,239,11.12115]
[7,"ACC",1335.25,1321.75,{"v":1301.5,"d":"1301.50"},1267.75,{"v":1247.5,"d":"1247.50"},{"v":1355.5,"d":"1355.50"},1375.75,{"v":1409.5,"d":"1409.50"},1342,1288,7.01334]
[8,"ADANIGAS",134.25,{"v":134.68333333333334,"d":"134.68"},{"v":130.36666666666667,"d":"130.37"},{"v":126.48333333333335,"d":"126.48"},{"v":122.16666666666669,"d":"122.17"},{"v":138.56666666666666,"d":"138.57"},{"v":142.88333333333333,"d":"142.88"},{"v":146.76666666666665,"d":"146.77"},139,130.8,36.40772]
[9,"ADANIGREEN",159.5,{"v":159.83333333333334,"d":"159.83"},{"v":156.66666666666669,"d":"156.67"},{"v":153.83333333333334,"d":"153.83"},{"v":150.66666666666669,"d":"150.67"},{"v":162.66666666666669,"d":"162.67"},{"v":165.83333333333337,"d":"165.83"},{"v":168.66666666666669,"d":"168.67"},163,157,5.34459]
[10,"ADANIPORTS",347.3,{"v":346.1166666666666,"d":"346.12"},{"v":343.1833333333332,"d":"343.18"},{"v":339.0666666666666,"d":"339.07"},{"v":336.1333333333332,"d":"336.13"},{"v":350.23333333333323,"d":"350.23"},{"v":353.16666666666663,"d":"353.17"},{"v":357.28333333333325,"d":"357.28"},349.05,342,36.71071]
{"$rows_left_out":514}
{"sheet":"Bulk Deals","index":4,"n_rows":54,"n_cols":8,"rows_kept":54,"merged":[[4,0,4,1],[4,2,4,3],[6,1,6,2]]}
[" "]
[]
[]
[]
[]
[{"$nulls":4},"Back To Main Page"]
["Subject :","BULK DEAL",null,{"$f":"Main!B10","v":"2020-03-04"}]
[]
["Date","Scrip code","Scrip Name","Client Name","Buy / Sell","Quantity Traded","Trade Price / Wt.Avg.trade price","Exchange  "]
["2020-03-03",539660,"BESTAGRO","NAND KISHORE GARG","SELL",{"v":75000,"d":"75,000"},240,"BSE"]
["2020-03-03",539660,"BESTAGRO","SEEMA GARG","SELL",{"v":75000,"d":"75,000"},240,"BSE"]
["2020-03-03",539660,"BESTAGRO","RESONANCE OPPORTUNITIES FUND","BUY",{"v":150000,"d":"150,000"},240,"BSE"]
["2020-03-03",522251,"CENLUB","COUNTER CYCLICAL INVESTMENTS PRIVATE LIMITED","BUY",{"v":28836,"d":"28,836"},36.8,"BSE"]
["2020-03-03",522251,"CENLUB","RAJIV GARG","SELL",{"v":25985,"d":"25,985"},36.8,"BSE"]
["2020-03-03",532443,"CERA","NALANDA INDIA EQUITY FUND LIMITED","BUY",{"v":106800,"d":"106,800"},2499.9,"BSE"]
["2020-03-03",511696,"CHRTEDCA","MOHIB NOMANBHAI KHERICHA","BUY",{"v":18188,"d":"18,188"},55.12,"BSE"]
["2020-03-03",511696,"CHRTEDCA","LALITKUMAR G GANDHI","SELL",{"v":18188,"d":"18,188"},55.12,"BSE"]
["2020-03-03",538765,"JSHL","SARLA ARYA","BUY",{"v":35000,"d":"35,000"},15.5,"BSE"]
["2020-03-03",538765,"JSHL","VIVEK DWIVEDI","BUY",{"v":15000,"d":"15,000"},19.08,"BSE"]
["2020-03-03",538765,"JSHL","VIVEK DWIVEDI","SELL",{"v":45000,"d":"45,000"},16.42,"BSE"]
{"$rows_left_out":35}
{"sheet":"Call Tracker (Equity & F&O)","index":5,"n_rows":248,"n_cols":18,"rows_kept":248,"merged":[[62,0,63,0],[62,1,63,1],[62,9,63,9],[62,11,63,11],[62,12,63,12],[62,13,63,13],[62,14,63,14],[76,0,77,0],[76,1,77,1],[76,9,77,9],[76,11,77,11],[76,12,77,12],[76,13,77,13],[76,14,77,14],[78,0,79,0],[78,1,79,1],[78,9,79,9],[78,11,79,11],[78,12,79,12],[78,13,79,13],[78,14,79,14]]}
[]
[]
[]
[]
[{"$nulls":12},"Back To Main Page"]
["Retail Research Technical Calls & Fundamental Performance Report for the month of March-2020 "]
[{"$nulls":12},{"$f":"Main!B10","v":"2020-03-04"}]
[null,"Positional  Call"]
["Sr.no","Date",null,"Company","Rec","Rec Price","Stop Loss***","Call Closed At","Target","Remark","Profit / Loss per Share","Gain / Loss  %","Status","Closed Date","NSE Closed Price"]
[1,"2020-02-04",null,"MARICO","Buy","306-308",287.8,null,"335-345","Open",{"$nulls":4},{"$f":"VLOOKUP(D10,Sheet2!A2:H1667,6,0)","v":296.1},null,null,"R"]
[2,"2020-02-05",null,"FINPIPE","Buy",552,518,568.5,"600-630","Part Profit of Rs.16.5/-",{"$f":"H11-F11","v":16.5},{"$f":"K11/F11","v":{"v":0.029891304347826088,"d":"2.99%"}},"Successful","2020-02-24",{"$f":"VLOOKUP(D11,Sheet2!A5:H1670,6,0)","v":550.55},null,null,"H"]
[3,"2020-02-05",null,"IOC","Buy",114,107,118,"124-128","Part Profit of Rs.4/-",{"$f":"H12-F12","v":4},{"$f":"K12/F12","v":{"v":0.03508771929824561,"d":"3.51%"}},"Successful","2020-02-10",{"$f":"VLOOKUP(D12,Sheet2!A6:H1671,6,0)","v":106.65},null,null,"H"]
[4,"2020-02-26",null,"TITAN","Buy","1255-1265",1189,null,"1350-1400","Open",{"$nulls":4},{"$f":"VLOOKUP(D13,Sheet2!A15:H1680,6,0)","v":1247},null,null,"H"]
[5,"2020-02-26",null,"WHIRLPOOL","Buy","2240-2250",2145,null,"2430-2450","Open",{"$nulls":4},{"$f":"VLOOKUP(D14,Sheet2!A19:H1684,6,0)","v":2222.95},null,null,"R"]
[6,"2020-02-27",null,"MARUTI","Buy",6300,6100,6305,6700,"Profit of Rs.5/-",{"$f":"H15-F15","v":5},{"$f":"K15/F15","v":{"v":7.9365079365079365E-4,"d":"0.08%"}},"Neutral","2020-03-02",{"$nulls":3},"A"]
[7,"2020-02-27",null,"JKPAPER","Buy","120-122",113,null,"132-135","Open",{"$nulls":4},{"$f":"VLOOKUP(D16,Sheet2!A21:H1686,6,0)","v":115.25},null,null,"N"]
[8,"2020-02-27",null,"SUNPHARMA","Buy",390,370,369,430,"Loss of Rs.21/-",{"$f":"H17-F17","v":-21},{"$f":"K17/F17","v":{"v":-0.05384615384615385,"d":"-5.38%"}},"Unsuccessful","2020-03-02",{"$nulls":3},"A"]
[9,"2020-02-27",null,"HDFCLIFE","Buy","565-567",535,null,625,"Open",{"$nulls":4},{"$f":"VLOOKUP(D18,Sheet2!A23:H1688,6,0)","v":563.5},null,null,"N"]
[10,"2020-02-28",null,"NTPC","Buy","108-110",102,null,125,"Open",{"$nulls":4},{"$f":"VLOOKUP(D19,Sheet2!A24:H1689,6,0)","v":108.9},null,null,"R"]
[11,"2020-03-02",null,"M&M","Buy",447.5,420,468,"490-500","Profit of Rs.20.50/-",{"$f":"H20-F20","v":20.5},{"$f":"K20/F20","v":{"v":0.04581005586592179,"d":"4.58%"}},"Successful","2020-03-02",{"$nulls":3},"N"]
{"$rows_left_out":217}
{"sheet":"Sheet2","index":6,"n_rows":1899,"n_cols":14,"rows_kept":1899,"hidden":true}
["SYMBOL","SERIES","OPEN","HIGH","LOW","CLOSE","LAST","PREVCLOSE","TOTTRDQTY","TOTTRDVAL","TIMESTAMP","TOTALTRADES","ISIN","ISIN"]
["20MICRONS","EQ",31.2,32.25,30.85,31.1,31.1,31.15,13324,417402.95,"2020-03-03",180,"INE144J01027"]
["21STCENMGM","EQ",11.9,12.3,11.9,12.3,12.3,12.1,64,781.6,"2020-03-03",5,"INE253B01015"]
["3IINFOTECH","EQ",1.95,1.95,1.8,1.95,1.95,1.9,1984345,3734318.3,"2020-03-03",880,"INE748C01020"]
["3MINDIA","EQ",20470,20995,20312,20632.95,20636,20131.65,7108,146876184.05,"2020-03-03",2360,"INE470A01017"]
["3PLAND","EQ",4.5,4.5,4.5,4.5,4.5,4.5,110,495,"2020-03-03",3,"INE105C01023"]
["5PAISA","EQ",165,165,157.1,158.35,160,162.1,9134,1462268.4,"2020-03-03",306,"INE618L01018"]
["63MOONS","EQ",88.45,91.25,88,90.4,90.15,87.95,67249,6018122.45,"2020-03-03",1648,"INE111B01023"]
["A2ZINFRA","EQ",4.6,4.6,3.55,4,4,4.4,1078630,4233487.6,"2020-03-03",1012,"INE619I01012"]
["AARTIDRUGS","EQ",680,687,641.1,651,655.9,668.3,73215,48265467.15,"2020-03-03",4277,"INE767A01016"]
["AARTIIND","EQ",995,995,966.3,983.45,982.5,971,225422,221607352.8,"2020-03-03",18360,"INE769A01020"]
["AARVEEDEN","EQ",11.6,12.6,11.6,12.55,12.55,11.8,3543,42961.4,"2020-03-03",42,"INE273D01019"]
["AAVAS","EQ",1858.3,1945,1858.3,1918.2,1920,1858.4,31876,60504436.3,"2020-03-03",3611,"INE216P01012"]
["ABAN","EQ",21.95,21.95,19.9,20.1,20,20.15,54743,1105917.75,"2020-03-03",660,"INE421A01028"]
["ABB","EQ",1199,1204.85,1154,1161,1162,1190.2,45482,53034020.8,"2020-03-03",3437,"INE117A01022"]
["ABBOTINDIA","EQ",15407,15780,15301,15427.65,15440,15393.6,18862,292401477.45,"2020-03-03",4187,"INE358A01014"]
["ABCAPITAL","EQ",77.25,78.85,76.8,77.85,78,76.7,1304622,101290512.9,"2020-03-03",14283,"INE674K01013"]
["ABFRL","EQ",243.9,260,239,254.25,259.05,238,1112115,280628235.3,"2020-03-03",34062,"INE647O01011"]
["ABSLBANETF","EQ",290,290,286.58,289.87,289.87,292.49,4,1155.15,"2020-03-03",4,"INF209KB1O58"]
["ABSLNN50ET","EQ",272.42,272.42,271.67,271.67,271.67,270,10,2722.7,"2020-03-03",4,"INF209KB1B87"]
{"$rows_left_out":1698}
{"sheet":"Sheet1","index":7,"n_rows":0,"n_cols":0,"rows_kept":0,"hidden":true}

{"sheet":"Sheet3","index":8,"n_rows":0,"n_cols":0,"rows_kept":0,"hidden":true}

{"sheet":"Sheet4","index":9,"n_rows":0,"n_cols":0,"rows_kept":0,"hidden":true}

{"sheet":"Sheet5","index":10,"n_rows":0,"n_cols":0,"rows_kept":0,"hidden":true}