{"text_format":"3","workbook":"xlsx","n_sheets":11,"sheets":["Main","Future Intra","Cash Intra","MidCap Intra","Bulk Deals","Call Tracker (Equity & F&O)","Sheet2","Sheet1","Sheet3","Sheet4","Sheet5"],"not_rendered":{"images":4,"defined_names":5},"read":"whole","date_system":"1900"}

{"sheet":"Main","index":0,"n_rows":27,"n_cols":11,"rows_kept":27}
[null,"                                                                                                 "]
{"$rows_empty":8}
[null,"2019-10-31"]
[]
[null,"Sheet No.","Template Name","Summary"]
[null,1,"Future Intra","For Intraday trading in F&O segment"]
[null,2,"Cash Intra","For Intraday trading in cash market segment"]
[null,3,"Mid-cap Intra","For Intraday trading in Mid-cap stocks"]
[null,4,"Bulk Deals","Reveals Bulk Deals carried on NSE & BSE"]
[null,5,"Call Tracker"]
{"$rows_empty":9}
[{"$nulls":10},"`"]

{"sheet":"Future Intra","index":1,"n_rows":193,"n_cols":15,"rows_kept":193,"merged":[[8,0,9,0],[8,1,9,1],[8,2,9,2],[8,5,8,7],[8,8,8,10]]}
[]
[]
[]
[]
[{"$nulls":12},"Back to Main Page"]
["FOR INTRA DAY TRADING",{"$nulls":10},{"$f":"Main!B10","v":"2019-10-31"}]
[]
[]
["Sr.no","Sector","Scrip","CLOSE RATE","Pivot Point","Supports",null,null,"Resistances"]
[null,"Sector",null,"Point","Point","S1","S2","S3","R1","R2","R3","HIGH","LOW","OI","% Change in OI"]
[1,"Index","BANKNIFTY",29986.45,{"v":29959.300000000003,"d":"29959.30"},{"v":29767.200000000004,"d":"29767.20"},29547.95,{"v":29355.850000000002,"d":"29355.85"},{"v":30178.550000000007,"d":"30178.55"},{"v":30370.650000000005,"d":"30370.65"},{"v":30589.90000000001,"d":"30589.90"},30151.4,29740.05,1391060,{"v":0.03725300126761614,"d":"3.73%"}]
[2,"Index","NIFTY",{"v":11840.2,"d":"11840.20"},11834.35,{"v":11791.1,"d":"11791.10"},{"v":11742,"d":"11742.00"},11698.75,11883.45,{"v":11926.7,"d":"11926.70"},{"v":11975.800000000001,"d":"11975.80"},11877.6,11785.25,16543500,{"v":-0.03273900879647089,"d":"-3.27%"}]
[3,"Index","NIFTYIT",{"v":15479,"d":"15479.00"},{"v":15401.666666666666,"d":"15401.67"},{"v":15303.333333333332,"d":"15303.33"},{"v":15127.666666666666,"d":"15127.67"},{"v":15029.333333333332,"d":"15029.33"},{"v":15577.333333333332,"d":"15577.33"},{"v":15675.666666666664,"d":"15675.67"},{"v":15851.333333333332,"d":"15851.33"},15500,15226,11200,{"v":-0.21403508771929824,"d":"-21.40%"}]
[4,"Cement","ACC",1534.15,{"v":1543.0166666666667,"d":"1543.02"},{"v":1512.1333333333332,"d":"1512.13"},{"v":1490.1166666666666,"d":"1490.12"},{"v":1459.2333333333331,"d":"1459.23"},{"v":1565.0333333333333,"d":"1565.03"},{"v":1595.916666666667,"d":"1595.92"},{"v":1617.9333333333334,"d":"1617.93"},1573.9,1521,2540800,{"v":0.064343163538874,"d":"6.43%"}]
[5,"Others","ADANIENT",{"v":195.4,"d":"195.40"},{"v":194.98333333333335,"d":"194.98"},{"v":192.6166666666667,"d":"192.62"},{"v":189.83333333333334,"d":"189.83"},{"v":187.4666666666667,"d":"187.47"},{"v":197.7666666666667,"d":"197.77"},{"v":200.13333333333338,"d":"200.13"},{"v":202.9166666666667,"d":"202.92"},197.35,192.2,31424000,{"v":-0.04613890237979602,"d":"-4.61%"}]
[6,"Others","ADANIPORTS",398.35,{"v":400.1666666666667,"d":"400.17"},{"v":394.6833333333334,"d":"394.68"},{"v":391.0166666666667,"d":"391.02"},{"v":385.5333333333334,"d":"385.53"},{"v":403.83333333333337,"d":"403.83"},{"v":409.3166666666666,"d":"409.32"},{"v":412.98333333333335,"d":"412.98"},405.65,396.5,14207500,{"v":0.030649256438157416,"d":"3.06%"}]
[7,"Power","ADANIPOWER",66.05,{"v":66.08333333333333,"d":"66.08"},{"v":65.51666666666665,"d":"65.52"},{"v":64.98333333333332,"d":"64.98"},{"v":64.41666666666664,"d":"64.42"},{"v":66.61666666666666,"d":"66.62"},{"v":67.18333333333335,"d":"67.18"},{"v":67.71666666666667,"d":"67.72"},66.65,65.55,91840000,{"v":-0.010771219302024989,"d":"-1.08%"}]
[8,"Automobile","AMARAJABAT",677.35,{"v":674.9166666666666,"d":"674.92"},{"v":668.2833333333333,"d":"668.28"},{"v":659.2166666666667,"d":"659.22"},{"v":652.5833333333334,"d":"652.58"},{"v":683.9833333333332,"d":"683.98"},{"v":690.6166666666667,"d":"690.62"},{"v":699.6833333333332,"d":"699.68"},681.55,665.85,1705200,{"v":-0.05508145849495733,"d":"-5.51%"}]
[9,"Cement","AMBUJACEM",{"v":200.4,"d":"200.40"},{"v":201.16666666666666,"d":"201.17"},{"v":198.63333333333333,"d":"198.63"},{"v":196.86666666666667,"d":"196.87"},{"v":194.33333333333334,"d":"194.33"},{"v":202.9333333333333,"d":"202.93"},{"v":205.46666666666667,"d":"205.47"},{"v":207.2333333333333,"d":"207.23"},203.7,199.4,20535000,{"v":-0.014043932301044292,"d":"-1.40%"}]
[10,"Others","APOLLOHOSP",1463.65,{"v":1457.6000000000001,"d":"1457.60"},{"v":1427.0500000000002,"d":"1427.05"},1390.45,{"v":1359.9,"d":"1359.90"},{"v":1494.2000000000003,"d":"1494.20"},1524.75,{"v":1561.3500000000004,"d":"1561.35"},1488.15,1421,1605000,{"v":0.008799497171590195,"d":"0.88%"}]
{"$rows_left_out":160}
{"sheet":"Cash Intra","index":2,"n_rows":247,"n_cols":13,"rows_kept":247,"merged":[[7,0,8,0],[7,1,8,1],[7,2,8,2],[7,3,8,3],[7,4,7,6],[7,7,7,9]]}
[]
[]
[]
[]
[{"$nulls":12},"Back to Main Page"]
["FOR INTRA DAY TRADING",{"$nulls":9},{"$f":"Main!B10","v":"2019-10-31"}]
[]
["Sr.no","Scrip","CLOSE RATE","Pivot Point","Supports",null,null,"Resistances"]
[null,null,"Point",null,"S1","S2","S3","R1","R2","R3","HIGH","LOW","Total Trade Quanity in Lakhs"]
[1,"Nifty 50",11844.1,{"v":11837.5,"d":"11837.50"},11791.05,{"v":11738,"d":"11738.00"},11691.55,11890.55,{"v":11937,"d":"11937.00"},11990.05,11883.95,11784.45]
[2,"Nifty Bank",29987.5,{"v":29963.86666666667,"d":"29963.87"},{"v":29776.63333333334,"d":"29776.63"},{"v":29565.76666666667,"d":"29565.77"},{"v":29378.53333333334,"d":"29378.53"},{"v":30174.733333333337,"d":"30174.73"},{"v":30361.966666666667,"d":"30361.97"},{"v":30572.833333333336,"d":"30572.83"},30151.1,29753]
[3,"Nifty CPSE",2047.95,{"v":2050.5833333333335,"d":"2050.58"},{"v":2038.3666666666668,"d":"2038.37"},{"v":2028.7833333333333,"d":"2028.78"},{"v":2016.5666666666666,"d":"2016.57"},{"v":2060.166666666667,"d":"2060.17"},{"v":2072.383333333333,"d":"2072.38"},{"v":2081.966666666667,"d":"2081.97"},2062.8,2041]
[4,"Nifty Infra",3313.4,{"v":3309.5500000000006,"d":"3309.55"},{"v":3300.6500000000015,"d":"3300.65"},{"v":3287.900000000001,"d":"3287.90"},{"v":3279.000000000002,"d":"3279.00"},{"v":3322.300000000001,"d":"3322.30"},{"v":3331.2,"d":"3331.20"},{"v":3343.9500000000007,"d":"3343.95"},3318.45,3296.8]
[5,"Nifty IT",15395.65,{"v":15342.683333333334,"d":"15342.68"},{"v":15265.716666666669,"d":"15265.72"},{"v":15135.783333333335,"d":"15135.78"},{"v":15058.81666666667,"d":"15058.82"},{"v":15472.616666666669,"d":"15472.62"},{"v":15549.583333333336,"d":"15549.58"},{"v":15679.516666666668,"d":"15679.52"},15419.65,15212.75]
[6,"Nifty PSE",3432.05,{"v":3427.7333333333336,"d":"3427.73"},{"v":3413.1166666666672,"d":"3413.12"},{"v":3394.183333333334,"d":"3394.18"},{"v":3379.5666666666675,"d":"3379.57"},{"v":3446.666666666667,"d":"3446.67"},{"v":3461.2833333333338,"d":"3461.28"},{"v":3480.2166666666667,"d":"3480.22"},3442.35,3408.8]
[7,"Nifty Midcap 50",4578.85,{"v":4570.766666666666,"d":"4570.77"},{"v":4552.033333333333,"d":"4552.03"},{"v":4525.216666666666,"d":"4525.22"},{"v":4506.483333333333,"d":"4506.48"},{"v":4597.583333333333,"d":"4597.58"},{"v":4616.316666666667,"d":"4616.32"},{"v":4643.133333333333,"d":"4643.13"},4589.5,4543.95]
[8,"ACC",1532.25,{"v":1541.8166666666666,"d":"1541.82"},{"v":1511.6333333333332,"d":"1511.63"},{"v":1491.0166666666667,"d":"1491.02"},{"v":1460.8333333333333,"d":"1460.83"},{"v":1562.4333333333332,"d":"1562.43"},{"v":1592.6166666666666,"d":"1592.62"},{"v":1613.2333333333331,"d":"1613.23"},1572,1521.2,9.20215]
[9,"AUBANK",689.8,{"v":696.0166666666668,"d":"696.02"},{"v":679.0333333333335,"d":"679.03"},{"v":668.2666666666668,"d":"668.27"},{"v":651.2833333333335,"d":"651.28"},{"v":706.7833333333335,"d":"706.78"},{"v":723.7666666666669,"d":"723.77"},{"v":734.5333333333335,"d":"734.53"},713,685.25,3.70908]
[10,"ADANIPORTS",398.1,{"v":399.5333333333333,"d":"399.53"},{"v":394.0666666666666,"d":"394.07"},{"v":390.0333333333333,"d":"390.03"},{"v":384.5666666666666,"d":"384.57"},{"v":403.5666666666666,"d":"403.57"},{"v":409.0333333333333,"d":"409.03"},{"v":413.0666666666666,"d":"413.07"},405,395.5,55.90453]
[11,"ADANIPOWER",66.05,{"v":66.06666666666666,"d":"66.07"},{"v":65.48333333333332,"d":"65.48"},{"v":64.91666666666666,"d":"64.92"},{"v":64.33333333333331,"d":"64.33"},{"v":66.63333333333333,"d":"66.63"},{"v":67.21666666666667,"d":"67.22"},{"v":67.78333333333333,"d":"67.78"},66.65,65.5,44.33796]
{"$rows_left_out":228}
{"sheet":"MidCap Intra","index":3,"n_rows":545,"n_cols":13,"rows_kept":545,"merged":[[0,0,0,1],[8,0,9,0],[8,1,9,1],[8,2,9,2],[8,3,9,3],[8,4,8,6],[8,7,8,9]]}
[]
[]
[]
[]
[{"$nulls":11},"Back To Main Page"]
["FOR INTRA DAY TRADING",{"$nulls":9},{"$f":"Main!B10","v":"2019-10-31"}]
[null,null," "]
[]
["Sr.no","Scrip","CLOSE RATE","Pivot Point","Supports",null,null,"Resistances"]
[null,null,"Point",null,"S1","S2","S3","R1","R2","R3","HIGH","LOW","Total Trade Quanity in Lakhs"]
[1,"3MINDIA",22281.2,22387.05,{"v":21949.149999999998,"d":"21949.15"},{"v":21617.1,"d":"21617.10"},{"v":21179.199999999997,"d":"21179.20"},{"v":22719.1,"d":"22719.10"},{"v":23157,"d":"23157.00"},23489.05,22824.95,22055,0.04885]
[2,"ACC",1532.25,{"v":1541.8166666666666,"d":"1541.82"},{"v":1511.6333333333332,"d":"1511.63"},{"v":1491.0166666666667,"d":"1491.02"},{"v":1460.8333333333333,"d":"1460.83"},{"v":1562.4333333333332,"d":"1562.43"},{"v":1592.6166666666666,"d":"1592.62"},{"v":1613.2333333333331,"d":"1613.23"},1572,1521.2,9.20215]
[3,"AIAENG",1721.6,{"v":1720.8999999999999,"d":"1720.90"},{"v":1702.7999999999997,"d":"1702.80"},{"v":1683.9999999999998,"d":"1684.00"},{"v":1665.8999999999996,"d":"1665.90"},{"v":1739.6999999999998,"d":"1739.70"},{"v":1757.7999999999997,"d":"1757.80"},{"v":1776.6,"d":"1776.60"},1739,1702.1,0.38694]
[4,"APLAPOLLO",1473.6,{"v":1453.5333333333335,"d":"1453.53"},{"v":1407.066666666667,"d":"1407.07"},{"v":1340.5333333333335,"d":"1340.53"},{"v":1294.066666666667,"d":"1294.07"},{"v":1520.066666666667,"d":"1520.07"},{"v":1566.5333333333338,"d":"1566.53"},{"v":1633.066666666667,"d":"1633.07"},1500,1387,0.14825]
[5,"AUBANK",689.8,{"v":696.0166666666668,"d":"696.02"},{"v":679.0333333333335,"d":"679.03"},{"v":668.2666666666668,"d":"668.27"},{"v":651.2833333333335,"d":"651.28"},{"v":706.7833333333335,"d":"706.78"},{"v":723.7666666666669,"d":"723.77"},{"v":734.5333333333335,"d":"734.53"},713,685.25,3.70908]
[6,"AAVAS",1594.9,{"v":1603.9000000000003,"d":"1603.90"},{"v":1576.1500000000005,"d":"1576.15"},{"v":1557.4000000000003,"d":"1557.40"},{"v":1529.6500000000005,"d":"1529.65"},{"v":1622.6500000000005,"d":"1622.65"},{"v":1650.4,"d":"1650.40"},{"v":1669.1500000000005,"d":"1669.15"},1631.65,1585.15,0.24658]
[7,"ABBOTINDIA",11922.5,{"v":11957.983333333332,"d":"11957.98"},{"v":11864.516666666663,"d":"11864.52"},{"v":11806.533333333331,"d":"11806.53"},{"v":11713.066666666662,"d":"11713.07"},{"v":12015.966666666664,"d":"12015.97"},{"v":12109.433333333334,"d":"12109.43"},{"v":12167.416666666664,"d":"12167.42"},12051.45,11900,0.22409]
[8,"ADANIGAS",146.9,{"v":147.96666666666667,"d":"147.97"},{"v":145.53333333333333,"d":"145.53"},{"v":144.16666666666666,"d":"144.17"},{"v":141.73333333333332,"d":"141.73"},{"v":149.33333333333334,"d":"149.33"},{"v":151.76666666666668,"d":"151.77"},{"v":153.13333333333335,"d":"153.13"},150.4,146.6,13.06351]
[9,"ADANIGREEN",89.9,{"v":90.46666666666665,"d":"90.47"},{"v":88.93333333333331,"d":"88.93"},{"v":87.96666666666665,"d":"87.97"},{"v":86.43333333333331,"d":"86.43"},{"v":91.43333333333331,"d":"91.43"},{"v":92.96666666666664,"d":"92.97"},{"v":93.93333333333331,"d":"93.93"},92,89.5,11.88364]
[10,"ADANIPORTS",398.1,{"v":399.5333333333333,"d":"399.53"},{"v":394.0666666666666,"d":"394.07"},{"v":390.0333333333333,"d":"390.03"},{"v":384.5666666666666,"d":"384.57"},{"v":403.5666666666666,"d":"403.57"},{"v":409.0333333333333,"d":"409.03"},{"v":413.0666666666666,"d":"413.07"},405,395.5,55.90453]
{"$rows_left_out":513}
{"sheet":"Bulk Deals","index":4,"n_rows":58,"n_cols":8,"rows_kept":58,"merged":[[4,0,4,1],[4,2,4,3],[6,1,6,2]]}
[" "]
[]
[]
[]
[]
[{"$nulls":4},"Back To Main Page"]
["Subject :","BULK DEAL",null,{"$f":"Main!B10","v":"2019-10-31"}]
[]
["Date","Scrip code","Scrip Name","Client Name","Buy / Sell","Quantity Traded","Trade Price / Wt.Avg.trade price","Exchange  "]
["2019-10-30",511463,"ALEXANDER","KAHAR NIKLESH KANAIYABHAI","BUY",{"v":25050,"d":"25,050"},{"v":20.7,"d":"20.70"},"BSE"]
["2019-10-30",511463,"ALEXANDER","NITINKUMAR GOVINDBHAI SALVE","BUY",{"v":46910,"d":"46,910"},20.44,"BSE"]
["2019-10-30",511463,"ALEXANDER","NITINKUMAR GOVINDBHAI SALVE","SELL",{"v":27000,"d":"27,000"},20.62,"BSE"]
["2019-10-30",511463,"ALEXANDER","KAHAR NIKLESH KANAIYABHAI","SELL",{"v":49300,"d":"49,300"},20.53,"BSE"]
["2019-10-30",537766,"BCP","JITAL ASHISH THAKAR","BUY",{"v":453232,"d":"453,232"},7.64,"BSE"]
["2019-10-30",542678,"CHCL","NNM SECURITIES PVT LTD","BUY",{"v":4000,"d":"4,000"},19.45,"BSE"]
["2019-10-30",542678,"CHCL","NEWEDGE VINIMAY PRIVATE LIMITED","BUY",{"v":200000,"d":"200,000"},21.08,"BSE"]
["2019-10-30",542678,"CHCL","NNM SECURITIES PVT LTD","SELL",{"v":202000,"d":"202,000"},21.06,"BSE"]
["2019-10-30",542727,"CPML","VIJETA BROKING INDIA PRIVATE LIMITED","BUY",{"v":8000,"d":"8,000"},{"v":28.1,"d":"28.10"},"BSE"]
["2019-10-30",542727,"CPML","VIJETA BROKING INDIA PRIVATE LIMITED","SELL",{"v":28000,"d":"28,000"},24.28,"BSE"]
["2019-10-30",542727,"CPML","JAYSHRI S MEHTA","BUY",{"v":20000,"d":"20,000"},24.22,"BSE"]
{"$rows_left_out":39}
{"sheet":"Call Tracker (Equity & F&O)","index":5,"n_rows":377,"n_cols":18,"rows_kept":377,"merged":[[141,0,142,0],[141,1,142,1],[141,9,142,9],[141,11,142,11],[141,12,142,12],[141,13,142,13],[141,14,142,14],[143,0,144,0],[143,1,144,1],[143,9,144,9],[143,11,144,11],[143,12,144,12],[143,13,144,13],[143,14,144,14],[145,0,146,0],[145,1,146,1],[145,9,146,9],[145,11,146,11],[145,12,146,12],[145,13,146,13],[145,14,146,14],[147,0,148,0],[147,1,148,1],[147,9,148,9],[147,11,148,11],[147,12,148,12],[147,13,148,13],[147,14,148,14],[149,0,150,0],[149,1,150,1],[149,9,150,9],[149,11,150,11],[149,12,150,12],[149,13,150,13],[149,14,150,14],[151,0,152,0],[151,1,152,1],[151,9,152,9],[151,11,152,11],[151,12,152,12],[151,13,152,13],[151,14,152,14],[153,0,154,0],[153,1,154,1],[153,9,154,9],[153,11,154,11],[153,12,154,12],[153,13,154,13],[153,14,154,14],[155,0,156,0],[155,1,156,1],[155,9,156,9],[155,11,156,11],[155,12,156,12],[155,13,156,13],[155,14,156,14],[157,0,158,0],[157,1,158,1],[157,9,158,9],[157,11,158,11],[157,12,158,12],[157,13,158,13],[157,14,158,14],[159,0,160,0],[159,1,160,1],[159,9,160,9],[159,11,160,11],[159,12,160,12],[159,13,160,13],[159,14,160,14],[161,0,162,0],[161,1,162,1],[161,9,162,9],[161,11,162,11],[161,12,162,12],[161,13,162,13],[161,14,162,14],[163,0,164,0],[163,1,164,1],[163,9,164,9],[163,11,164,11],[163,12,164,12],[163,13,164,13],[163,14,164,14],[165,0,166,0],[165,1,166,1],[165,9,166,9],[165,11,166,11],[165,12,166,12],[165,13,166,13],[165,14,166,14],[167,0,168,0],[167,1,168,1],[167,9,168,9],[167,11,168,11],[167,12,168,12],[167,13,168,13],[167,14,168,14],[169,0,170,0],[169,1,170,1],[169,9,170,9],[169,11,170,11],[169,12,170,12],[169,13,170,13],[169,14,170,14],[171,0,172,0],[171,1,172,1],[171,9,172,9],[171,11,172,11],[171,12,172,12],[171,13,172,13],[171,14,172,14],[173,0,174,0],[173,1,174,1],[173,9,174,9],[173,11,174,11],[173,12,174,12],[173,13,174,13],[173,14,174,14],[175,0,176,0],[175,1,176,1],[175,9,176,9],[175,11,176,11],[175,12,176,12],[175,13,176,13],[175,14,176,14],[177,0,178,0],[177,1,178,1],[177,9,178,9],[177,11,178,11],[177,12,178,12],[177,13,178,13],[177,14,178,14],[179,0,180,0],[179,1,180,1],[179,9,180,9],[179,11,180,11],[179,12,180,12],[179,13,180,13],[179,14,180,14],[186,0,187,0],[186,1,187,1],[186,9,187,9],[186,11,187,11],[186,12,187,12],[186,13,187,13],[186,14,187,14],[192,0,193,0],[192,1,193,1],[192,9,193,9],[192,11,193,11],[192,12,193,12],[192,13,193,13],[192,14,193,14]]}
[]
[]
[]
[]
[{"$nulls":12},"Back To Main Page"]
["Retail Research Technical Calls & Fundamental Performance Report for the month of October-2019 "]
[{"$nulls":12},{"$f":"Main!B10","v":"2019-10-31"}]
[null,"Positional  Call"]
["Sr.no","Date",null,"Company","Rec","Rec Price","Stop Loss***","Call Closed At","Target","Remark","Profit / Loss per Share","Gain / Loss  %","Status","Closed Date","NSE Closed Price"]
[1,"2019-08-30",null,"BIOCON","Buy{}",229.5,214.3,242.5,"255-260","Profit of Rs.13/-",{"$f":"H10-F10","v":13},{"$f":"K10/F10","v":{"v":0.05664488017429194,"d":"5.66%"}},"Successful","2019-10-10",{"$nulls":3},"R"]
[2,"2019-09-09",null,"TORNTPHARM","Sell",1705,1808,1618,"1560-1540","Profit of Rs.87/-",{"$f":"F11-H11","v":87},{"$f":"K11/F11","v":{"v":0.05102639296187683,"d":"5.10%"}},"Successful","2019-10-01",{"$nulls":3},"R"]
[3,"2019-09-25",null,"AXISBANK","Buy",695,628,730,"800-820","Profit of Rs.35/-",{"$f":"H12-F12","v":35},{"v":0.050359712230215826,"d":"5.04%"},"Successful","2019-10-23",{"$nulls":3},"H"]
[4,"2019-09-26",null,"HDFC","Buy",2070,1940,2138,"2250-2300","Part Profit of Rs.68/-",{"$f":"H13-F13","v":68},{"$f":"K13/F13","v":{"v":0.03285024154589372,"d":"3.29%"}},"Successful","2019-10-22",{"$f":"VLOOKUP(D13,Sheet2!A43:M1682,6,0)","v":2107.45},null,null,"H"]
[5,"2019-09-26",null,"BANKBARODA","Buy",96,89,89.5,"110-114","Loss of Rs.6.5/-",{"$f":"H14-F14","v":-6.5},{"$f":"K14/F14","v":{"v":-0.06770833333333333,"d":"-6.77%"}},"UnSuccessful","2019-10-01",{"$nulls":3},"H"]
[6,"2019-09-30",null,"BPCL","Sell",475,510,503,"420-410","Loss of Rs.28/-",{"$f":"F15-H15","v":-28},{"v":-0.05894736842105263,"d":"-5.89%"},"UnSuccessful","2019-10-03",{"$nulls":3},"H"]
[7,"2019-10-01",null,"CUMMINSIND","Buy",576.5,530,559.5,"640-660","Loss of Rs.17/-",{"$f":"H16-F16","v":-17},{"$f":"K16/F16","v":{"v":-0.029488291413703384,"d":"-2.95%"}},"UnSuccessful","2019-10-24",{"$nulls":3},"H"]
[8,"2019-10-01",null,"UPL","Buy","592-598",564,null,"650-660","Open",{"$nulls":4},{"$f":"VLOOKUP(D17,Sheet2!A47:M1686,6,0)","v":584.15},null,null,"R"]
[9,"2019-10-03",null,"HEIDELBERG","Buy",183,169,195,"205-210","Profit of Rs.12/-",{"$f":"H18-F18","v":12},{"$f":"K18/F18","v":{"v":0.06557377049180328,"d":"6.56%"}},"Successful","2019-10-18",{"$nulls":3},"H"]
[10,"2019-10-03",null,"APOLLOHOSP","Buy{}",1378.5,1286,1448,"1550-1580","Profit of Rs.69.5/-",{"$f":"H19-F19","v":69.5},{"$f":"K19/F19","v":{"v":0.050417120058034094,"d":"5.04%"}},"Successful","2019-10-11",{"$nulls":3},"R"]
[11,"2019-10-04",null,"HDFCAMC","Buy",2665,2537,2835,"2930-2960","Profit of Rs.170/-",{"$f":"H20-F20","v":170},{"$f":"K20/F20","v":{"v":0.06378986866791744,"d":"6.38%"}},"Successful","2019-10-18",{"$nulls":3},"R"]
{"$rows_left_out":358}
{"sheet":"Sheet2","index":6,"n_rows":1899,"n_cols":14,"rows_kept":1899,"hidden":true}
["SYMBOL","SERIES","OPEN","HIGH","LOW","CLOSE","LAST","PREVCLOSE","TOTTRDQTY","TOTTRDVAL","TIMESTAMP","TOTALTRADES","ISIN","ISIN"]
["20MICRONS","EQ",37,38.45,36.4,37.6,37.65,36.75,79468,2993683.25,"2019-10-30",1019,"INE144J01027"]
["21STCENMGM","EQ",13.1,13.1,13,13,13,13.1,21,273.1,"2019-10-30",3,"INE253B01015"]
["3IINFOTECH","EQ",2.1,2.1,2,2,2.05,2.05,672511,1366870.05,"2019-10-30",346,"INE748C01020"]
["3MINDIA","EQ",22400,22824.95,22055,22281.2,22275,22221.85,4885,109987770.9,"2019-10-30",1378,"INE470A01017"]
["3PLAND","EQ",6.5,6.5,6.2,6.2,6.2,6.2,175,1115,"2019-10-30",2,"INE105C01023"]
["5PAISA","EQ",174.45,175.95,172.5,174.7,174.95,172.25,4149,723149.3,"2019-10-30",110,"INE618L01018"]
["63MOONS","EQ",123.05,127.1,121.6,122.2,122.75,123.15,156137,19345885.4,"2019-10-30",2283,"INE111B01023"]
["A2ZINFRA","EQ",9,9.05,8.6,8.65,8.65,8.7,576283,5054828.8,"2019-10-30",658,"INE619I01012"]
["AARTIDRUGS","EQ",522,541.45,520,538.05,540,525.75,15781,8366372.1,"2019-10-30",1594,"INE767A01016"]
["AARTIIND","EQ",870.1,879.7,844,870.35,870,875.15,98961,86409165.55,"2019-10-30",3595,"INE769A01020"]
["AARVEEDEN","EQ",14.75,14.75,13.6,14.45,14.45,14.45,8234,116061.15,"2019-10-30",69,"INE273D01019"]
["AAVAS","EQ",1612,1631.65,1585.15,1594.9,1591,1611.95,24658,39484662.4,"2019-10-30",4846,"INE216P01012"]
["ABAN","BE",26,26.2,25.15,25.55,25.8,25.7,28056,722772.25,"2019-10-30",235,"INE421A01028"]
["ABB","EQ",1482.8,1482.8,1441.65,1448.15,1449,1469.65,120399,174627228.3,"2019-10-30",9187,"INE117A01022"]
["ABBOTINDIA","EQ",11900,12051.45,11900,11922.5,11910,11876.6,22409,267959527.05,"2019-10-30",2078,"INE358A01014"]
["ABCAPITAL","EQ",80,81.6,79.5,79.9,79.55,79.55,2696635,217438589.3,"2019-10-30",22858,"INE674K01013"]
["ABFRL","EQ",206.75,214.35,206,211.65,211.1,205.75,413600,87105071.6,"2019-10-30",10377,"INE647O01011"]
["ABSLBANETF","EQ",330,330,330,330,330,294.6,1,330,"2019-10-30",1,"INF209KB1O58"]
["ABSLNN50ET","EQ",286.01,290,286.01,289.34,289.34,285.26,27,7809.17,"2019-10-30",9,"INF209KB1B87"]
{"$rows_left_out":1701}
{"sheet":"Sheet1","index":7,"n_rows":0,"n_cols":0,"rows_kept":0,"hidden":true}

{"sheet":"Sheet3","index":8,"n_rows":0,"n_cols":0,"rows_kept":0,"hidden":true}

{"sheet":"Sheet4","index":9,"n_rows":0,"n_cols":0,"rows_kept":0,"hidden":true}

{"sheet":"Sheet5","index":10,"n_rows":0,"n_cols":0,"rows_kept":0,"hidden":true}