{"text_format":"3","workbook":"xlsx","n_sheets":10,"sheets":["Main","Future Intra","Cash Intra","MidCap Intra","Bulk Deals","Call Tracker (Equity & F&O)","Sheet2","Sheet1","Sheet3","Sheet4"],"not_rendered":{"images":4,"defined_names":4},"read":"whole","date_system":"1900"}

{"sheet":"Main","index":0,"n_rows":27,"n_cols":11,"rows_kept":27}
[null,"                                                                                                 "]
{"$rows_empty":8}
[null,"2019-06-26"]
[]
[null,"Sheet No.","Template Name","Summary"]
[null,1,"Future Intra","For Intraday trading in F&O segment"]
[null,2,"Cash Intra","For Intraday trading in cash market segment"]
[null,3,"Mid-cap Intra","For Intraday trading in Mid-cap stocks"]
[null,4,"Bulk Deals","Reveals Bulk Deals carried on NSE & BSE"]
[null,5,"Call Tracker"]
{"$rows_empty":9}
[{"$nulls":10},"`"]

{"sheet":"Future Intra","index":1,"n_rows":236,"n_cols":15,"rows_kept":236,"merged":[[8,0,9,0],[8,1,9,1],[8,2,9,2],[8,5,8,7],[8,8,8,10]]}
[]
[]
[]
[]
[{"$nulls":12},"Back to Main Page"]
["FOR INTRA DAY TRADING",{"$nulls":10},{"$f":"Main!B10","v":"2019-06-26"}]
[]
[]
["Sr.no","Sector","Scrip","CLOSE RATE","Pivot Point","Supports",null,null,"Resistances"]
[null,"Sector",null,"Point","Point","S1","S2","S3","R1","R2","R3","HIGH","LOW","OI","% Change in OI"]
[1,"Index","BANKNIFTY",{"v":30878.6,"d":"30878.60"},{"v":30769.533333333336,"d":"30769.53"},{"v":30589.066666666673,"d":"30589.07"},{"v":30299.533333333336,"d":"30299.53"},{"v":30119.066666666673,"d":"30119.07"},{"v":31059.066666666673,"d":"31059.07"},{"v":31239.53333333334,"d":"31239.53"},{"v":31529.066666666673,"d":"31529.07"},30950,30480,2378760,{"v":0.06641202894262582,"d":"6.64%"}]
[2,"Index","NIFTY",{"v":11810.3,"d":"11810.30"},{"v":11770.300000000001,"d":"11770.30"},{"v":11706.600000000002,"d":"11706.60"},{"v":11602.900000000001,"d":"11602.90"},{"v":11539.200000000003,"d":"11539.20"},{"v":11874.000000000002,"d":"11874.00"},{"v":11937.700000000003,"d":"11937.70"},{"v":12041.400000000001,"d":"12041.40"},11834,11666.6,22208025,{"v":6.2459858156992416E-3,"d":"0.62%"}]
[3,"Index","NIFTYIT",{"v":16214,"d":"16214.00"},{"v":16162,"d":"16162.00"},{"v":16086,"d":"16086.00"},{"v":15958,"d":"15958.00"},{"v":15882,"d":"15882.00"},{"v":16290,"d":"16290.00"},{"v":16366,"d":"16366.00"},{"v":16494,"d":"16494.00"},16238,16034,12650,{"v":-0.01171875,"d":"-1.17%"}]
[4,"Cement","ACC",1555.35,1549.05,{"v":1534.5,"d":"1534.50"},1513.65,{"v":1499.1000000000001,"d":"1499.10"},{"v":1569.8999999999999,"d":"1569.90"},{"v":1584.4499999999996,"d":"1584.45"},{"v":1605.2999999999997,"d":"1605.30"},1563.6,1528.2,3026000,{"v":0.09384037015615963,"d":"9.38%"}]
[5,"Others","ADANIENT",{"v":150.6,"d":"150.60"},{"v":149.13333333333333,"d":"149.13"},{"v":146.11666666666665,"d":"146.12"},{"v":141.63333333333333,"d":"141.63"},{"v":138.61666666666665,"d":"138.62"},{"v":153.61666666666665,"d":"153.62"},{"v":156.6333333333333,"d":"156.63"},{"v":161.11666666666665,"d":"161.12"},152.15,144.65,34208000,{"v":0.056454601605929584,"d":"5.65%"}]
[6,"Others","ADANIPORTS",407.15,{"v":406.5833333333333,"d":"406.58"},{"v":404.66666666666663,"d":"404.67"},{"v":402.18333333333334,"d":"402.18"},{"v":400.26666666666665,"d":"400.27"},{"v":409.0666666666666,"d":"409.07"},{"v":410.98333333333323,"d":"410.98"},{"v":413.4666666666666,"d":"413.47"},408.5,404.1,22650000,{"v":0.0124036205162588,"d":"1.24%"}]
[7,"Power","ADANIPOWER",50.55,{"v":50.06666666666666,"d":"50.07"},{"v":49.283333333333324,"d":"49.28"},{"v":48.01666666666666,"d":"48.02"},{"v":47.23333333333332,"d":"47.23"},{"v":51.33333333333333,"d":"51.33"},{"v":52.11666666666666,"d":"52.12"},{"v":53.38333333333333,"d":"53.38"},50.85,48.8,168700000,{"v":-0.024178621008792225,"d":"-2.42%"}]
[8,"Pharma","AJANTPHARM",974.65,{"v":961.5166666666668,"d":"961.52"},{"v":945.5333333333335,"d":"945.53"},{"v":916.4166666666667,"d":"916.42"},{"v":900.4333333333335,"d":"900.43"},{"v":990.6333333333336,"d":"990.63"},{"v":1006.6166666666669,"d":"1006.62"},{"v":1035.7333333333336,"d":"1035.73"},977.5,932.4,153500,{"v":-0.4585537918871252,"d":"-45.86%"}]
[9,"Banking","ALBK",{"v":42.5,"d":"42.50"},{"v":41.93333333333334,"d":"41.93"},{"v":41.16666666666667,"d":"41.17"},{"v":39.833333333333336,"d":"39.83"},{"v":39.06666666666667,"d":"39.07"},{"v":43.26666666666667,"d":"43.27"},{"v":44.03333333333334,"d":"44.03"},{"v":45.366666666666674,"d":"45.37"},42.7,40.6,8515000,{"v":-0.2833698030634573,"d":"-28.34%"}]
[10,"Automobile","AMARAJABAT",{"v":613.8,"d":"613.80"},{"v":612,"d":"612.00"},597.75,{"v":581.7,"d":"581.70"},567.45,628.05,{"v":642.3,"d":"642.30"},{"v":658.3499999999999,"d":"658.35"},626.25,595.95,1542100,{"v":0.06528046421663443,"d":"6.53%"}]
{"$rows_left_out":207}
{"sheet":"Cash Intra","index":2,"n_rows":247,"n_cols":13,"rows_kept":247,"merged":[[7,0,8,0],[7,1,8,1],[7,2,8,2],[7,3,8,3],[7,4,7,6],[7,7,7,9]]}
[]
[]
[]
[]
[{"$nulls":12},"Back to Main Page"]
["FOR INTRA DAY TRADING",{"$nulls":9},{"$f":"Main!B10","v":"2019-06-26"}]
[]
["Sr.no","Scrip","CLOSE RATE","Pivot Point","Supports",null,null,"Resistances"]
[null,null,"Point",null,"S1","S2","S3","R1","R2","R3","HIGH","LOW","Total Trade Quanity in Lakhs"]
[1,"Nifty 50",11796.45,{"v":11753.949999999999,"d":"11753.95"},{"v":11693.499999999998,"d":"11693.50"},11590.55,{"v":11530.099999999999,"d":"11530.10"},{"v":11856.899999999998,"d":"11856.90"},{"v":11917.349999999999,"d":"11917.35"},{"v":12020.299999999997,"d":"12020.30"},11814.4,11651]
[2,"Nifty Bank",30847.05,{"v":30737.233333333337,"d":"30737.23"},{"v":30561.216666666674,"d":"30561.22"},{"v":30275.38333333334,"d":"30275.38"},{"v":30099.366666666676,"d":"30099.37"},{"v":31023.066666666673,"d":"31023.07"},{"v":31199.083333333336,"d":"31199.08"},{"v":31484.91666666667,"d":"31484.92"},30913.25,30451.4]
[3,"Nifty CPSE",2353.05,{"v":2343.883333333333,"d":"2343.88"},{"v":2329.2666666666664,"d":"2329.27"},{"v":2305.483333333333,"d":"2305.48"},{"v":2290.8666666666663,"d":"2290.87"},{"v":2367.6666666666665,"d":"2367.67"},{"v":2382.2833333333333,"d":"2382.28"},{"v":2406.0666666666666,"d":"2406.07"},2358.5,2320.1]
[4,"Nifty Infra",3332.55,{"v":3326.9,"d":"3326.90"},{"v":3314.4500000000003,"d":"3314.45"},{"v":3296.3500000000004,"d":"3296.35"},{"v":3283.9000000000005,"d":"3283.90"},{"v":3345,"d":"3345.00"},3357.45,{"v":3375.5499999999997,"d":"3375.55"},3339.35,3308.8]
[5,"Nifty IT",16214.45,{"v":16172.666666666666,"d":"16172.67"},{"v":16092.383333333331,"d":"16092.38"},{"v":15970.316666666666,"d":"15970.32"},{"v":15890.033333333331,"d":"15890.03"},{"v":16294.733333333332,"d":"16294.73"},{"v":16375.016666666668,"d":"16375.02"},{"v":16497.083333333332,"d":"16497.08"},16252.95,16050.6]
[6,"Nifty PSE",3628.65,{"v":3612.4166666666665,"d":"3612.42"},{"v":3589.433333333333,"d":"3589.43"},{"v":3550.2166666666662,"d":"3550.22"},{"v":3527.2333333333327,"d":"3527.23"},{"v":3651.633333333333,"d":"3651.63"},{"v":3674.616666666667,"d":"3674.62"},{"v":3713.8333333333335,"d":"3713.83"},3635.4,3573.2]
[7,"Nifty Midcap 50",4839.15,{"v":4823.366666666666,"d":"4823.37"},{"v":4804.033333333332,"d":"4804.03"},{"v":4768.916666666666,"d":"4768.92"},{"v":4749.583333333332,"d":"4749.58"},{"v":4858.483333333332,"d":"4858.48"},{"v":4877.816666666666,"d":"4877.82"},{"v":4912.933333333332,"d":"4912.93"},4842.7,4788.25]
[8,"ABB",1559.05,{"v":1555.9833333333336,"d":"1555.98"},{"v":1543.9666666666672,"d":"1543.97"},{"v":1528.8833333333337,"d":"1528.88"},{"v":1516.8666666666672,"d":"1516.87"},{"v":1571.066666666667,"d":"1571.07"},{"v":1583.0833333333335,"d":"1583.08"},{"v":1598.166666666667,"d":"1598.17"},1568,1540.9,0.27457]
[9,"ACC",1554.55,{"v":1547.5999999999997,"d":"1547.60"},{"v":1533.2999999999993,"d":"1533.30"},{"v":1512.0499999999995,"d":"1512.05"},{"v":1497.749999999999,"d":"1497.75"},{"v":1568.8499999999995,"d":"1568.85"},1583.15,{"v":1604.3999999999996,"d":"1604.40"},1561.9,1526.35,4.75097]
[10,"AUBANK",698.75,{"v":696.5500000000001,"d":"696.55"},{"v":688.2000000000002,"d":"688.20"},{"v":677.6500000000001,"d":"677.65"},{"v":669.3000000000002,"d":"669.30"},{"v":707.1000000000001,"d":"707.10"},715.45,{"v":726.0000000000001,"d":"726.00"},704.9,686,6.5842]
[11,"ADANIPORTS",405.65,{"v":405.1666666666667,"d":"405.17"},{"v":403.1333333333334,"d":"403.13"},{"v":400.6166666666667,"d":"400.62"},{"v":398.58333333333337,"d":"398.58"},{"v":407.6833333333334,"d":"407.68"},{"v":409.7166666666667,"d":"409.72"},{"v":412.2333333333334,"d":"412.23"},407.2,402.65,20.99347]
{"$rows_left_out":228}
{"sheet":"MidCap Intra","index":3,"n_rows":545,"n_cols":13,"rows_kept":545,"merged":[[0,0,0,1],[8,0,9,0],[8,1,9,1],[8,2,9,2],[8,3,9,3],[8,4,8,6],[8,7,8,9]]}
[]
[]
[]
[]
[{"$nulls":11},"Back To Main Page"]
["FOR INTRA DAY TRADING",{"$nulls":9},{"$f":"Main!B10","v":"2019-06-26"}]
[null,null," "]
[]
["Sr.no","Scrip","CLOSE RATE","Pivot Point","Supports",null,null,"Resistances"]
[null,null,"Point",null,"S1","S2","S3","R1","R2","R3","HIGH","LOW","Total Trade Quanity in Lakhs"]
[1,"3MINDIA",23183.9,{"v":23259.533333333336,"d":"23259.53"},{"v":22624.366666666672,"d":"22624.37"},{"v":22064.833333333336,"d":"22064.83"},{"v":21429.66666666667,"d":"21429.67"},{"v":23819.066666666673,"d":"23819.07"},{"v":24454.233333333337,"d":"24454.23"},{"v":25013.766666666674,"d":"25013.77"},23894.7,22700,0.01707]
[2,"ABB",1559.05,{"v":1555.9833333333336,"d":"1555.98"},{"v":1543.9666666666672,"d":"1543.97"},{"v":1528.8833333333337,"d":"1528.88"},{"v":1516.8666666666672,"d":"1516.87"},{"v":1571.066666666667,"d":"1571.07"},{"v":1583.0833333333335,"d":"1583.08"},{"v":1598.166666666667,"d":"1598.17"},1568,1540.9,0.27457]
[3,"ACC",1554.55,{"v":1547.5999999999997,"d":"1547.60"},{"v":1533.2999999999993,"d":"1533.30"},{"v":1512.0499999999995,"d":"1512.05"},{"v":1497.749999999999,"d":"1497.75"},{"v":1568.8499999999995,"d":"1568.85"},1583.15,{"v":1604.3999999999996,"d":"1604.40"},1561.9,1526.35,4.75097]
[4,"AIAENG",1747.1,1750.05,{"v":1733.1,"d":"1733.10"},{"v":1719.1,"d":"1719.10"},{"v":1702.1499999999999,"d":"1702.15"},1764.05,{"v":1781.0000000000002,"d":"1781.00"},{"v":1795,"d":"1795.00"},1767,1736.05,0.30608]
[5,"APLAPOLLO",1539.65,{"v":1532.5166666666667,"d":"1532.52"},{"v":1520.1333333333332,"d":"1520.13"},{"v":1500.6166666666666,"d":"1500.62"},{"v":1488.2333333333331,"d":"1488.23"},{"v":1552.0333333333333,"d":"1552.03"},{"v":1564.416666666667,"d":"1564.42"},{"v":1583.9333333333334,"d":"1583.93"},1544.9,1513,0.10827]
[6,"AUBANK",698.75,{"v":696.5500000000001,"d":"696.55"},{"v":688.2000000000002,"d":"688.20"},{"v":677.6500000000001,"d":"677.65"},{"v":669.3000000000002,"d":"669.30"},{"v":707.1000000000001,"d":"707.10"},715.45,{"v":726.0000000000001,"d":"726.00"},704.9,686,6.5842]
[7,"AAVAS",1491.75,{"v":1494.9166666666667,"d":"1494.92"},{"v":1469.8333333333335,"d":"1469.83"},{"v":1447.9166666666667,"d":"1447.92"},{"v":1422.8333333333335,"d":"1422.83"},{"v":1516.8333333333335,"d":"1516.83"},{"v":1541.916666666667,"d":"1541.92"},{"v":1563.8333333333335,"d":"1563.83"},1520,1473,1.27781]
[8,"ADANIGREEN",41.35,41.35,40.75,40.15,39.55,41.95,{"v":42.55000000000001,"d":"42.55"},{"v":43.150000000000006,"d":"43.15"},41.95,40.75,4.20526]
[9,"ADANIPORTS",405.65,{"v":405.1666666666667,"d":"405.17"},{"v":403.1333333333334,"d":"403.13"},{"v":400.6166666666667,"d":"400.62"},{"v":398.58333333333337,"d":"398.58"},{"v":407.6833333333334,"d":"407.68"},{"v":409.7166666666667,"d":"409.72"},{"v":412.2333333333334,"d":"412.23"},407.2,402.65,20.99347]
[10,"ADANIPOWER",50.55,{"v":50.11666666666667,"d":"50.12"},{"v":49.333333333333336,"d":"49.33"},{"v":48.11666666666667,"d":"48.12"},{"v":47.333333333333336,"d":"47.33"},{"v":51.333333333333336,"d":"51.33"},{"v":52.11666666666667,"d":"52.12"},{"v":53.333333333333336,"d":"53.33"},50.9,48.9,147.32369]
{"$rows_left_out":513}
{"sheet":"Bulk Deals","index":4,"n_rows":98,"n_cols":8,"rows_kept":98,"merged":[[4,0,4,1],[4,2,4,3],[6,1,6,2]]}
[" "]
[]
[]
[]
[]
[{"$nulls":4},"Back To Main Page"]
["Subject :","BULK DEAL",null,{"$f":"Main!B10","v":"2019-06-26"}]
[]
["Date","Scrip code","Scrip Name","Client Name","Buy / Sell","Quantity Traded","Trade Price / Wt.Avg.trade price","Exchange  "]
["2019-06-25",538778,"AKASHDEEP","SIRIUS ADVISORS PRIVATE LIMITED.","SELL",{"v":85867,"d":"85,867"},42.26,"BSE"]
["2019-06-25",538778,"AKASHDEEP","ARNOLD HOLDINGS LIMITED","BUY",{"v":127000,"d":"127,000"},42.31,"BSE"]
["2019-06-25",500343,"AMJLAND","CHEM MACH PRIVATE LIMITED","BUY",{"v":1712850,"d":"1,712,850"},16.3,"BSE"]
["2019-06-25",500343,"AMJLAND","PUDUMJEE INDUSTRIES LTD","SELL",{"v":1712850,"d":"1,712,850"},16.3,"BSE"]
["2019-06-25",541401,"ARIHANTINS","GUNJAN CHOKSHI","SELL",{"v":56000,"d":"56,000"},5.41,"BSE"]
["2019-06-25",537766,"BCP","GEETHA JAIN","BUY",{"v":295000,"d":"295,000"},40.55,"BSE"]
["2019-06-25",537766,"BCP","KAMLESH S JAIN","BUY",{"v":435000,"d":"435,000"},40.48,"BSE"]
["2019-06-25",537766,"BCP","BON LON SECURITIES LTD","SELL",{"v":1839500,"d":"1,839,500"},40.59,"BSE"]
["2019-06-25",539770,"DARJEELING","SHASHIKANT CHINUBHAI KAPADIA","BUY",{"v":11700,"d":"11,700"},96.66,"BSE"]
["2019-06-25",539770,"DARJEELING","SHASHIKANT CHINUBHAI KAPADIA","SELL",{"v":15999,"d":"15,999"},96.03,"BSE"]
["2019-06-25",539098,"FILTRA","ANKITCHHIKARA","SELL",{"v":45000,"d":"45,000"},10.89,"BSE"]
{"$rows_left_out":79}
{"sheet":"Call Tracker (Equity & F&O)","index":5,"n_rows":330,"n_cols":20,"rows_kept":330,"merged":[[119,0,120,0],[119,1,120,1],[119,9,120,9],[119,11,120,11],[119,12,120,12],[119,13,120,13],[119,14,120,14]]}
[]
[]
[]
[]
[{"$nulls":12},"Back To Main Page"]
["Retail Research Technical Calls & Fundamental Performance Report for the month of June-2019 "]
[{"$nulls":12},{"$f":"Main!B10","v":"2019-06-26"}]
[null,"Positional  Call"]
["Sr.no","Date",null,"Company","Rec","Rec Price","Stop Loss***","Call Closed At","Target","Remark","Profit / Loss per Share","Gain / Loss  %","Status","Closed Date","NSE Closed Price"]
[1,"2019-04-23",null,"DMART","Buy",1305,1265,1350,"1470-1500","Part Profit of Rs.45/-",{"$f":"H10-F10","v":45},{"$f":"K10/F10","v":{"v":0.034482758620689655,"d":"3.45%"}},"Successful","2019-05-24",{"$f":"VLOOKUP(D10,Sheet2!A45:M1840,6,0)","v":1330.65},null,null,"R"]
[2,"2019-05-08",null,"COLPAL","Buy",1137,1081,1185,1242," Profit of Rs.48/-",{"$f":"H11-F11","v":48},{"$f":"K11/F11","v":{"v":0.04221635883905013,"d":"4.22%"}},"Successful","2019-06-14",{"$nulls":3},"H"]
[3,"2019-05-20",null,"TCS","Buy",2112,2195,2221,2405,"  Profit of Rs.109/-",{"$f":"H12-F12","v":109},{"$f":"K12/F12","v":{"v":0.05160984848484849,"d":"5.16%"}},"Successful","2019-06-10",{"$nulls":3},"H"]
[4,"2019-05-24",null,"SBIN","Sell",351,372,336.5,"320-310","  Profit of Rs.14.5/-",{"$f":"F13-H13","v":14.5},{"v":0.04131054131054131,"d":"4.13%"},"Successful","2019-06-06",{"$nulls":3},"H"]
[5,"2019-05-27",null,"GRASIM","Sell",927.5,972.6,862.5,"840-820","  Profit of Rs.65/-",{"$f":"F14-H14","v":65},{"$f":"K14/F14","v":{"v":0.07008086253369272,"d":"7.01%"}},"Successful","2019-06-06",{"$nulls":3},"R"]
[6,"2019-05-27",null,"TATAELXSI","Buy","870-878",818.7,null,"970-990","Open",{"$nulls":4},{"$f":"VLOOKUP(D15,Sheet2!A50:M1845,6,0)","v":858.1},null,null,"R"]
[7,"2019-05-28",null,"ASTRAZEN","Buy",2030,1883.3,1883.3,"2310-2330","Loss of Rs. 146.7/-",{"$f":"H16-F16","v":-146.70000000000005},{"$f":"K16/F16","v":{"v":-0.07226600985221678,"d":"-7.23%"}},"UnSuccessful","2019-06-06",{"$nulls":3},"R"]
[8,"2019-05-28",null,"BAJAJFINSV","Sell","8150-8200",8625,null,7300,"Open",{"$nulls":4},{"$f":"VLOOKUP(D17,Sheet2!A54:M1849,6,0)","v":8346.15},null,null,"H"]
[9,"2019-05-28",null,"CEATLTD","Buy",1000,945,960,"1100-1120","Loss of Rs. 40/-",-40,{"v":-0.04,"d":"-4.00%"},"UnSuccessful","2019-06-11",{"$nulls":3},"H"]
[10,"2019-05-30",null,"ENDURANCE","Buy",1205,1128,1127.5,1350,"Loss of Rs. 77.5/-",-77.5,{"v":-0.06431535269709543,"d":"-6.43%"},"UnSuccessful","2019-06-24",{"$nulls":3},"H"]
[11,"2019-05-31",null,"BALKRISIND","Buy",802.5,748,760,900,"Loss of Rs. 42.5/-",{"$f":"H20-F20","v":-42.5},{"$f":"K20/F20","v":{"v":-0.0529595015576324,"d":"-5.30%"}},"UnSuccessful","2019-06-17",{"$nulls":3},"H"]
{"$rows_left_out":299}
{"sheet":"Sheet2","index":6,"n_rows":1641,"n_cols":14,"rows_kept":1641,"hidden":true}
["SYMBOL","SERIES","OPEN","HIGH","LOW","CLOSE","LAST","PREVCLOSE","TOTTRDQTY","TOTTRDVAL","TIMESTAMP","TOTALTRADES","ISIN","ISIN"]
["20MICRONS","EQ",35.8,36.7,35,36.2,36,35.85,16948,614916.4,"2019-06-25",180,"INE144J01027"]
["21STCENMGM","EQ",18.25,18.55,17.9,17.9,17.9,18.25,3072,55592.4,"2019-06-25",24,"INE253B01015"]
["3IINFOTECH","EQ",3.25,3.4,3.2,3.3,3.35,3.2,1416936,4628744.4,"2019-06-25",486,"INE748C01020"]
["3MINDIA","EQ",23511.05,23894.7,22700,23183.9,23150.05,23779.1,1707,39631884.95,"2019-06-25",863,"INE470A01017"]
["5PAISA","EQ",200.05,207.9,193.5,201.7,201,203.4,1721,348005.15,"2019-06-25",278,"INE618L01018"]
["63MOONS","EQ",117,117,111.15,112.55,112.2,115.7,65760,7500031.95,"2019-06-25",1221,"INE111B01023"]
["8KMILES","EQ",84.65,84.65,84.65,84.65,84.65,80.65,22432,1898868.8,"2019-06-25",129,"INE650K01021"]
["A2ZINFRA","EQ",13.45,13.75,12.85,13,13,13.35,250435,3313640.8,"2019-06-25",851,"INE619I01012"]
["AARTIDRUGS","EQ",534.3,534.3,520.05,529.95,530,530,6312,3326584.15,"2019-06-25",1098,"INE767A01016"]
["AARTIIND","EQ",1818,1828.25,1785.1,1796.7,1801,1803.2,81425,147451467,"2019-06-25",7993,"INE769A01020"]
["AARVEEDEN","EQ",21.45,21.85,20.6,21.35,21.5,21.5,1081,23013.85,"2019-06-25",52,"INE273D01019"]
["AAVAS","EQ",1473,1520,1473,1491.75,1495,1473.25,127781,191671922.6,"2019-06-25",3688,"INE216P01012"]
["ABAN","EQ",37.5,37.9,36,36.2,36.05,37,61021,2226427.75,"2019-06-25",823,"INE421A01028"]
["ABB","EQ",1564,1568,1540.9,1559.05,1553.7,1560.9,27457,42671513.45,"2019-06-25",3080,"INE117A01022"]
["ABBOTINDIA","EQ",8600,8600,8500,8557.75,8550,8541.85,2575,22012311.2,"2019-06-25",474,"INE358A01014"]
["ABCAPITAL","EQ",92,92.8,91.35,92.05,91.95,92.15,500352,46093982.1,"2019-06-25",6189,"INE674K01013"]
["ABFRL","EQ",207.7,215.6,199.85,212.65,213.7,207.7,776725,160250897.9,"2019-06-25",6883,"INE647O01011"]
["ABMINTLTD","BE",13.35,13.35,13.35,13.35,13.35,13.35,100,1335,"2019-06-25",1,"INE251C01017"]
["ABSLNN50ET","EQ",269.77,269.77,267.7,267.7,267.7,268.05,11,2946.77,"2019-06-25",3,"INF209KB1B87"]
{"$rows_left_out":1622}
{"sheet":"Sheet1","index":7,"n_rows":0,"n_cols":0,"rows_kept":0,"hidden":true}

{"sheet":"Sheet3","index":8,"n_rows":0,"n_cols":0,"rows_kept":0,"hidden":true}

{"sheet":"Sheet4","index":9,"n_rows":0,"n_cols":0,"rows_kept":0,"hidden":true}