{"text_format":"3","workbook":"xlsx","n_sheets":6,"sheets":["Main","Future Intra","Cash Intra","MidCap Intra","Bulk Deals","Call Tracker (Equity & F&O)"],"not_rendered":{"images":2,"defined_names":3},"read":"whole","date_system":"1900"}

{"sheet":"Main","index":0,"n_rows":27,"n_cols":11,"rows_kept":27}
[null,"                                                                                                 "]
{"$rows_empty":8}
[null,"2023-05-03"]
[]
[null,"Sheet No.","Template Name","Summary"]
[null,1,"Future Intra","For Intraday trading in F&O segment"]
[null,2,"Cash Intra","For Intraday trading in cash market segment"]
[null,3,"Mid-cap Intra","For Intraday trading in Mid-cap stocks"]
[null,4,"Bulk Deals","Reveals Bulk Deals carried on NSE & BSE"]
[null,5,"Call Tracker"]
{"$rows_empty":9}
[{"$nulls":10},"`"]

{"sheet":"Future Intra","index":1,"n_rows":236,"n_cols":16,"rows_kept":236,"merged":[[8,0,9,0],[8,1,9,1],[8,2,9,2],[8,3,9,3],[8,6,8,8],[8,9,8,11]]}
[]
[]
[]
[]
[{"$nulls":12},"Back to Main Page"]
["FOR INTRA DAY TRADING",{"$nulls":10},{"$f":"Main!B10","v":"2023-05-03"}]
[]
[]
["Sr.no","Sector","Scrip","Expiry Date","CLOSE RATE","Pivot Point","Supports",null,null,"Resistances"]
[{"$nulls":4},"Point","Point","S1","S2","S3","R1","R2","R3","HIGH","LOW","OI","% Change in OI"]
[1,"Index","NIFTY","2023-05-25",18213.15,{"v":18213.61666666667,"d":"18213.62"},{"v":18179.983333333337,"d":"18179.98"},{"v":18146.81666666667,"d":"18146.82"},{"v":18113.183333333338,"d":"18113.18"},{"v":18246.783333333336,"d":"18246.78"},{"v":18280.416666666668,"d":"18280.42"},{"v":18313.583333333336,"d":"18313.58"},18247.25,18180.45,10525200,{"v":0.09163887923747491,"d":"9.16%"}]
[2,"Index","BANKNIFTY","2023-05-25",43367.25,{"v":43367.299999999996,"d":"43367.30"},{"v":43255.59999999999,"d":"43255.60"},43143.95,{"v":43032.24999999999,"d":"43032.25"},{"v":43478.94999999999,"d":"43478.95"},{"v":43590.64999999999,"d":"43590.65"},{"v":43702.29999999999,"d":"43702.30"},43479,43255.65,2531310,{"v":0.01750775297406698,"d":"1.75%"}]
[3,"Index","FINNIFTY","2023-05-30",19217.35,{"v":19067.783333333333,"d":"19067.78"},{"v":18860.566666666666,"d":"18860.57"},{"v":18503.783333333333,"d":"18503.78"},{"v":18296.566666666666,"d":"18296.57"},{"v":19424.566666666666,"d":"19424.57"},{"v":19631.783333333333,"d":"19631.78"},{"v":19988.566666666666,"d":"19988.57"},19275,18711,38040,{"v":-0.0838150289017341,"d":"-8.38%"}]
[4,"Index","MIDCPNIFTY","2023-05-31",7199.25,2399.75,{"v":4799.5,"d":"4799.50"},2399.75,{"v":4799.5,"d":"4799.50"},{"v":4799.5,"d":"4799.50"},2399.75,{"v":4799.5,"d":"4799.50"},0,0,75,{"v":0,"d":"0.00%"}]
[5,"Chemical","AARTIIND","2023-05-25",559.65,{"v":562.2166666666667,"d":"562.22"},{"v":556.0333333333334,"d":"556.03"},{"v":552.4166666666667,"d":"552.42"},{"v":546.2333333333335,"d":"546.23"},{"v":565.8333333333334,"d":"565.83"},{"v":572.0166666666668,"d":"572.02"},{"v":575.6333333333333,"d":"575.63"},568.4,558.6,3516450,{"v":0.05,"d":"5.00%"}]
[6,"Capital_Goods","ABB","2023-05-25",3458.05,{"v":3451.0166666666664,"d":"3451.02"},{"v":3419.033333333333,"d":"3419.03"},{"v":3380.0166666666664,"d":"3380.02"},{"v":3348.033333333333,"d":"3348.03"},{"v":3490.033333333333,"d":"3490.03"},{"v":3522.0166666666664,"d":"3522.02"},{"v":3561.033333333333,"d":"3561.03"},3483,3412,1320750,{"v":0.005136986301369863,"d":"0.51%"}]
[7,"Pharma","ABBOTINDIA","2023-05-25",22499.75,{"v":22562.666666666668,"d":"22562.67"},{"v":22387.233333333337,"d":"22387.23"},{"v":22274.71666666667,"d":"22274.72"},{"v":22099.28333333334,"d":"22099.28"},{"v":22675.183333333334,"d":"22675.18"},{"v":22850.61666666666,"d":"22850.62"},{"v":22963.13333333333,"d":"22963.13"},22738.1,22450.15,66440,{"v":0.02341343191620456,"d":"2.34%"}]
[8,"Others","ABCAPITAL","2023-05-25",169.05,{"v":169.66666666666669,"d":"169.67"},{"v":167.93333333333337,"d":"167.93"},{"v":166.8166666666667,"d":"166.82"},{"v":165.08333333333337,"d":"165.08"},{"v":170.78333333333336,"d":"170.78"},{"v":172.5166666666667,"d":"172.52"},{"v":173.63333333333335,"d":"173.63"},171.4,168.55,28317600,{"v":0.011183956806787505,"d":"1.12%"}]
[9,"Textile","ABFRL","2023-05-25",{"v":225.8,"d":"225.80"},{"v":225.23333333333335,"d":"225.23"},{"v":223.5166666666667,"d":"223.52"},{"v":221.23333333333335,"d":"221.23"},{"v":219.5166666666667,"d":"219.52"},{"v":227.5166666666667,"d":"227.52"},{"v":229.23333333333335,"d":"229.23"},{"v":231.5166666666667,"d":"231.52"},226.95,222.95,22406800,{"v":-0.02456140350877193,"d":"-2.46%"}]
[10,"Cement","ACC","2023-05-25",{"v":1775.2,"d":"1775.20"},{"v":1773.3166666666666,"d":"1773.32"},{"v":1759.6833333333332,"d":"1759.68"},{"v":1744.1666666666665,"d":"1744.17"},{"v":1730.533333333333,"d":"1730.53"},{"v":1788.8333333333333,"d":"1788.83"},{"v":1802.4666666666665,"d":"1802.47"},{"v":1817.9833333333333,"d":"1817.98"},1786.95,1757.8,3766700,{"v":0.035703974593398136,"d":"3.57%"}]
{"$rows_left_out":202}
{"sheet":"Cash Intra","index":2,"n_rows":246,"n_cols":13,"rows_kept":246,"merged":[[7,0,8,0],[7,1,8,1],[7,2,8,2],[7,3,8,3],[7,4,7,6],[7,7,7,9]]}
[]
[]
[]
[]
[{"$nulls":12},"Back to Main Page"]
["FOR INTRA DAY TRADING",{"$nulls":9},{"$f":"Main!B10","v":"2023-05-03"}]
[]
["Sr.no",null,"CLOSE RATE","Pivot Point","Supports",null,null,"Resistances"]
[{"$nulls":4},"S1","S2","S3","R1","R2","R3","HIGH","LOW","Total Trade Quanity in Lakhs"]
[1,"Nifty 50",18147.65,{"v":18143.216666666667,"d":"18143.22"},{"v":18106.183333333334,"d":"18106.18"},{"v":18064.716666666667,"d":"18064.72"},{"v":18027.683333333334,"d":"18027.68"},{"v":18184.683333333334,"d":"18184.68"},{"v":18221.716666666667,"d":"18221.72"},{"v":18263.183333333334,"d":"18263.18"},18180.25,18101.75]
[2,"Nifty Bank",{"v":43352.1,"d":"43352.10"},{"v":43368.450000000004,"d":"43368.45"},{"v":43253.05000000001,"d":"43253.05"},{"v":43154.00000000001,"d":"43154.00"},{"v":43038.60000000001,"d":"43038.60"},{"v":43467.50000000001,"d":"43467.50"},{"v":43582.9,"d":"43582.90"},{"v":43681.950000000004,"d":"43681.95"},43483.85,{"v":43269.4,"d":"43269.40"}]
[3,"Nifty CPSE",3107.95,{"v":3095.566666666667,"d":"3095.57"},{"v":3077.383333333334,"d":"3077.38"},{"v":3046.816666666667,"d":"3046.82"},{"v":3028.633333333334,"d":"3028.63"},{"v":3126.133333333334,"d":"3126.13"},{"v":3144.3166666666675,"d":"3144.32"},{"v":3174.883333333334,"d":"3174.88"},3113.75,{"v":3065,"d":"3065.00"}]
[4,"Nifty Infra",{"v":5387.2,"d":"5387.20"},{"v":5386.266666666666,"d":"5386.27"},{"v":5372.4333333333325,"d":"5372.43"},{"v":5357.666666666666,"d":"5357.67"},{"v":5343.833333333332,"d":"5343.83"},{"v":5401.033333333333,"d":"5401.03"},{"v":5414.866666666667,"d":"5414.87"},{"v":5429.633333333333,"d":"5429.63"},{"v":5400.1,"d":"5400.10"},{"v":5371.5,"d":"5371.50"}]
[5,"Nifty IT",{"v":28025,"d":"28025.00"},{"v":27978.36666666667,"d":"27978.37"},{"v":27802.63333333334,"d":"27802.63"},{"v":27580.26666666667,"d":"27580.27"},{"v":27404.53333333334,"d":"27404.53"},{"v":28200.733333333337,"d":"28200.73"},{"v":28376.466666666667,"d":"28376.47"},{"v":28598.833333333336,"d":"28598.83"},{"v":28154.1,"d":"28154.10"},{"v":27756,"d":"27756.00"}]
[6,"Nifty PSE",{"v":4758.6,"d":"4758.60"},{"v":4742.250000000001,"d":"4742.25"},{"v":4717.700000000002,"d":"4717.70"},{"v":4676.800000000001,"d":"4676.80"},{"v":4652.250000000002,"d":"4652.25"},{"v":4783.1500000000015,"d":"4783.15"},{"v":4807.700000000001,"d":"4807.70"},{"v":4848.600000000001,"d":"4848.60"},{"v":4766.8,"d":"4766.80"},4701.35]
[7,"Nifty Midcap 50",{"v":9062.2,"d":"9062.20"},{"v":9046.616666666667,"d":"9046.62"},{"v":9012.533333333333,"d":"9012.53"},{"v":8962.866666666667,"d":"8962.87"},{"v":8928.783333333333,"d":"8928.78"},{"v":9096.283333333333,"d":"9096.28"},{"v":9130.366666666665,"d":"9130.37"},{"v":9180.033333333333,"d":"9180.03"},{"v":9080.7,"d":"9080.70"},8996.95]
[8,"ABB",3442.15,{"v":3432.2666666666664,"d":"3432.27"},{"v":3400.283333333333,"d":"3400.28"},{"v":3358.4166666666665,"d":"3358.42"},{"v":3326.433333333333,"d":"3326.43"},{"v":3474.1333333333328,"d":"3474.13"},{"v":3506.1166666666663,"d":"3506.12"},{"v":3547.9833333333327,"d":"3547.98"},3464.25,3390.4,3.31768]
[9,"ACC",1764.15,{"v":1763.8999999999999,"d":"1763.90"},{"v":1750.7999999999997,"d":"1750.80"},{"v":1737.4499999999998,"d":"1737.45"},{"v":1724.3499999999997,"d":"1724.35"},{"v":1777.2499999999998,"d":"1777.25"},{"v":1790.3499999999997,"d":"1790.35"},{"v":1803.6999999999998,"d":"1803.70"},1777,1750.55,5.03277]
[10,"AUBANK",684,{"v":677.6833333333333,"d":"677.68"},{"v":670.3666666666666,"d":"670.37"},{"v":656.7333333333332,"d":"656.73"},{"v":649.4166666666665,"d":"649.42"},{"v":691.3166666666666,"d":"691.32"},{"v":698.6333333333334,"d":"698.63"},{"v":712.2666666666667,"d":"712.27"},685,664.05,20.07742]
[11,"ABBOTINDIA",22379.85,{"v":22422.233333333334,"d":"22422.23"},{"v":22256.466666666667,"d":"22256.47"},{"v":22133.083333333332,"d":"22133.08"},{"v":21967.316666666666,"d":"21967.32"},{"v":22545.61666666667,"d":"22545.62"},{"v":22711.38333333334,"d":"22711.38"},{"v":22834.76666666667,"d":"22834.77"},22588,22298.85,0.0754]
{"$rows_left_out":227}
{"sheet":"MidCap Intra","index":3,"n_rows":532,"n_cols":13,"rows_kept":532,"merged":[[0,0,0,1],[8,0,9,0],[8,1,9,1],[8,2,9,2],[8,3,9,3],[8,4,8,6],[8,7,8,9]]}
[]
[]
[]
[]
[{"$nulls":11},"Back To Main Page"]
["FOR INTRA DAY TRADING",{"$nulls":9},{"$f":"Main!B10","v":"2023-05-03"}]
[null,null," "]
[]
["Sr.no","Scrip","CLOSE RATE","Pivot Point","Supports",null,null,"Resistances"]
[{"$nulls":4},"S1","S2","S3","R1","R2","R3","HIGH","LOW","Total Trade Quanity in Lakhs"]
[1,"360ONE",418.3,{"v":418.2666666666667,"d":"418.27"},{"v":412.63333333333344,"d":"412.63"},{"v":406.96666666666675,"d":"406.97"},{"v":401.3333333333335,"d":"401.33"},{"v":423.9333333333334,"d":"423.93"},{"v":429.5666666666667,"d":"429.57"},{"v":435.23333333333335,"d":"435.23"},423.9,412.6,1.76212]
[2,"3MINDIA",22390,{"v":22442,"d":"22442.00"},{"v":22304,"d":"22304.00"},{"v":22218,"d":"22218.00"},{"v":22080,"d":"22080.00"},{"v":22528,"d":"22528.00"},{"v":22666,"d":"22666.00"},{"v":22752,"d":"22752.00"},22580,22356,0.02285]
[3,"ABB",3442.15,{"v":3432.2666666666664,"d":"3432.27"},{"v":3400.283333333333,"d":"3400.28"},{"v":3358.4166666666665,"d":"3358.42"},{"v":3326.433333333333,"d":"3326.43"},{"v":3474.1333333333328,"d":"3474.13"},{"v":3506.1166666666663,"d":"3506.12"},{"v":3547.9833333333327,"d":"3547.98"},3464.25,3390.4,3.31768]
[4,"ACC",1764.15,{"v":1763.8999999999999,"d":"1763.90"},{"v":1750.7999999999997,"d":"1750.80"},{"v":1737.4499999999998,"d":"1737.45"},{"v":1724.3499999999997,"d":"1724.35"},{"v":1777.2499999999998,"d":"1777.25"},{"v":1790.3499999999997,"d":"1790.35"},{"v":1803.6999999999998,"d":"1803.70"},1777,1750.55,5.03277]
[5,"AIAENG",2777.6,{"v":2760.6,"d":"2760.60"},2735.75,{"v":2693.9,"d":"2693.90"},2669.05,2802.45,{"v":2827.2999999999993,"d":"2827.30"},{"v":2869.1499999999996,"d":"2869.15"},2785.45,2718.75,0.43262]
[6,"APLAPOLLO",1199.7,{"v":1204.5,"d":"1204.50"},{"v":1189,"d":"1189.00"},{"v":1178.3,"d":"1178.30"},{"v":1162.8,"d":"1162.80"},{"v":1215.2,"d":"1215.20"},{"v":1230.7,"d":"1230.70"},{"v":1241.4,"d":"1241.40"},1220,1193.8,2.45423]
[7,"AUBANK",684,{"v":677.6833333333333,"d":"677.68"},{"v":670.3666666666666,"d":"670.37"},{"v":656.7333333333332,"d":"656.73"},{"v":649.4166666666665,"d":"649.42"},{"v":691.3166666666666,"d":"691.32"},{"v":698.6333333333334,"d":"698.63"},{"v":712.2666666666667,"d":"712.27"},685,664.05,20.07742]
[8,"AARTIDRUGS",457.8,450.75,{"v":429.9,"d":"429.90"},{"v":402,"d":"402.00"},381.15,478.65,{"v":499.5,"d":"499.50"},{"v":527.4,"d":"527.40"},471.6,422.85,51.12515]
[9,"AAVAS",1399.15,{"v":1399.5666666666666,"d":"1399.57"},{"v":1385.1333333333332,"d":"1385.13"},{"v":1371.1166666666666,"d":"1371.12"},{"v":1356.6833333333332,"d":"1356.68"},{"v":1413.5833333333333,"d":"1413.58"},{"v":1428.0166666666667,"d":"1428.02"},{"v":1442.0333333333333,"d":"1442.03"},1414,1385.55,2.4316]
[10,"ABBOTINDIA",22379.85,{"v":22422.233333333334,"d":"22422.23"},{"v":22256.466666666667,"d":"22256.47"},{"v":22133.083333333332,"d":"22133.08"},{"v":21967.316666666666,"d":"21967.32"},{"v":22545.61666666667,"d":"22545.62"},{"v":22711.38333333334,"d":"22711.38"},{"v":22834.76666666667,"d":"22834.77"},22588,22298.85,0.0754]
{"$rows_left_out":513}
{"sheet":"Bulk Deals","index":4,"n_rows":91,"n_cols":8,"rows_kept":91,"merged":[[4,0,4,1],[4,2,4,3],[6,1,6,2]]}
[" "]
[]
[]
[]
[]
[{"$nulls":4},"Back To Main Page"]
["Subject :","BULK DEAL",null,{"$f":"Main!B10","v":"2023-05-03"}]
[]
["Date","Scrip code","Scrip Name","Client Name","Buy / Sell","Quantity Traded","Trade Price / Wt.Avg.trade price","Exchange  "]
["2023-05-02",537766,"BCP","AMIT BHALLA","SELL",{"v":434000,"d":"434,000"},3.93,"BSE"]
["2023-05-02",514440,"BPTEX","HANUMANMAL MOTILAL CHHAGANMAL PAGARIA","SELL",{"v":2000,"d":"2,000"},37.03,"BSE"]
["2023-05-02",532541,"COFORGE","MOTILAL OSWAL A/C MOTILAL OSWAL MOST FOCUSED MULTICAP 35 FUND","BUY",{"v":484848,"d":"484,848"},4125,"BSE"]
["2023-05-02",532541,"COFORGE","HULST B V","SELL",{"v":2150000,"d":"2,150,000"},4125.44,"BSE"]
["2023-05-02",504340,"CONFINT","MANOJ VIMALSINGH PAMECHA","SELL",{"v":51747,"d":"51,747"},5.82,"BSE"]
["2023-05-02",504340,"CONFINT","AMIT SUBHASHCHANDRA BHALGAT","BUY",{"v":51500,"d":"51,500"},5.82,"BSE"]
["2023-05-02",531553,"DRL","BHAVYAKUMAR DINESHBHAI TURAKHIA","SELL",{"v":70300,"d":"70,300"},8.89,"BSE"]
["2023-05-02",531553,"DRL","TARABAI KAMALKISHORE GOENKA","BUY",{"v":7641,"d":"7,641"},8.31,"BSE"]
["2023-05-02",531553,"DRL","TARABAI KAMALKISHORE GOENKA","SELL",{"v":38538,"d":"38,538"},9.1,"BSE"]
["2023-05-02",531553,"DRL","NANDHAGOPAN POTTI RAJAN","BUY",{"v":93213,"d":"93,213"},8.89,"BSE"]
["2023-05-02",543895,"EXHICON","VINEY EQUITY MARKET LLP","SELL",{"v":60000,"d":"60,000"},101.8,"BSE"]
{"$rows_left_out":72}
{"sheet":"Call Tracker (Equity & F&O)","index":5,"n_rows":256,"n_cols":18,"rows_kept":256}
[]
[]
[]
[]
[{"$nulls":12},"Back To Main Page"]
["Retail Research Technical Calls & Fundamental Performance Report for the month of May-2023"]
[{"$nulls":12},{"$f":"Main!B10","v":"2023-05-03"}]
[null,"Positional  Call"]
["Sr.no","Date",null,"Company","Rec","Rec Price","Stop Loss***","Call Closed At","Target","Remark","Profit / Loss per Share","All charges","Net Gain / Loss  %","Status","Closed Date","Market Closing Price"]
[1,"2023-04-11",null,"SHARDACROP","Accu","452.5-467.5",425,null,"500-530","Open",{"$nulls":5},{"$f":"VLOOKUP(D10,'MidCap Intra'!B27:C527,2,0)","v":475.25},null,"H"]
[2,"2023-04-12",null,"SUDARSCHEM","Accu","390-410",377,null,"440-460","Open",{"$nulls":5},{"$f":"VLOOKUP(D11,'MidCap Intra'!B28:C528,2,0)","v":{"v":412.8,"d":"412.80"}},null,"H"]
[3,"2023-04-17",null,"REDINGTON","Accu","165-170",158,null,"180-190","Open",{"$nulls":5},{"$f":"VLOOKUP(D12,'MidCap Intra'!B29:C529,2,0)","v":{"v":171.7,"d":"171.70"}},null,"H"]
[4,"2023-04-17",null,"HCLTECH","Accu","1000-1035",945,null,"1150-1200","Open",{"$nulls":5},{"$f":"VLOOKUP(D13,'MidCap Intra'!B30:C530,2,0)","v":1067.55},null,"H"]
[5,"2023-04-17",null,"KOLTEPATIL","Accu","243.5-253.5",233,null,"280-290","Open",{"$nulls":7},"N"]
[6,"2023-04-24",null,"BHARTIARTL","Accu","755-790",735,null,"850-900","Open",{"$nulls":5},{"$f":"VLOOKUP(D15,'MidCap Intra'!B33:C533,2,0)","v":{"v":790.2,"d":"790.20"}},null,"H"]
[7,"2023-04-25",null,"MASTEK","Accu","1640-1715",1550,null,"1900-2000","Open",{"$nulls":5},{"$f":"VLOOKUP(D16,'MidCap Intra'!B34:C534,2,0)","v":{"v":1755.7,"d":"1755.70"}},null,"H"]
[8,"2023-04-28",null,"GNFC","Accu","550-580",530,null,"640-680","Open",{"$nulls":5},{"$f":"VLOOKUP(D17,'MidCap Intra'!B35:C535,2,0)","v":597.15},null,"H"]
[]
[]
[]
{"$rows_left_out":236}