{"text_format":"3","workbook":"xlsx","n_sheets":11,"sheets":["Main","Future Intra","Cash Intra","MidCap Intra","Bulk Deals","Call Tracker (Equity & F&O)","Sheet2","Sheet1","Sheet3","Sheet4","Sheet5"],"not_rendered":{"images":4,"defined_names":5},"read":"whole","date_system":"1900"}

{"sheet":"Main","index":0,"n_rows":27,"n_cols":11,"rows_kept":27}
[null,"                                                                                                 "]
{"$rows_empty":8}
[null,"2020-03-03"]
[]
[null,"Sheet No.","Template Name","Summary"]
[null,1,"Future Intra","For Intraday trading in F&O segment"]
[null,2,"Cash Intra","For Intraday trading in cash market segment"]
[null,3,"Mid-cap Intra","For Intraday trading in Mid-cap stocks"]
[null,4,"Bulk Deals","Reveals Bulk Deals carried on NSE & BSE"]
[null,5,"Call Tracker"]
{"$rows_empty":9}
[{"$nulls":10},"`"]

{"sheet":"Future Intra","index":1,"n_rows":190,"n_cols":15,"rows_kept":190,"merged":[[8,0,9,0],[8,1,9,1],[8,2,9,2],[8,5,8,7],[8,8,8,10]]}
[]
[]
[]
[]
[{"$nulls":12},"Back to Main Page"]
["FOR INTRA DAY TRADING",{"$nulls":10},{"$f":"Main!B10","v":"2020-03-03"}]
[]
[]
["Sr.no","Sector","Scrip","CLOSE RATE","Pivot Point","Supports",null,null,"Resistances"]
[null,"Sector",null,"Point","Point","S1","S2","S3","R1","R2","R3","HIGH","LOW","OI","% Change in OI"]
[1,"Index","BANKNIFTY",28885.15,{"v":29044.399999999998,"d":"29044.40"},{"v":28440.799999999996,"d":"28440.80"},{"v":27996.449999999997,"d":"27996.45"},{"v":27392.849999999995,"d":"27392.85"},{"v":29488.749999999996,"d":"29488.75"},{"v":30092.349999999995,"d":"30092.35"},{"v":30536.699999999997,"d":"30536.70"},29648,28600.05,1272080,{"v":-0.02465803839784089,"d":"-2.47%"}]
[2,"Index","NIFTY",{"v":11123.7,"d":"11123.70"},{"v":11188.550000000001,"d":"11188.55"},{"v":10959.100000000002,"d":"10959.10"},{"v":10794.500000000002,"d":"10794.50"},{"v":10565.050000000003,"d":"10565.05"},{"v":11353.150000000001,"d":"11353.15"},{"v":11582.600000000002,"d":"11582.60"},{"v":11747.2,"d":"11747.20"},11418,11023.95,15238575,{"v":-0.09088021047733252,"d":"-9.09%"}]
[3,"Index","NIFTYIT",{"v":15410,"d":"15410.00"},{"v":15451.666666666666,"d":"15451.67"},{"v":15248.333333333332,"d":"15248.33"},{"v":15086.666666666666,"d":"15086.67"},{"v":14883.333333333332,"d":"14883.33"},{"v":15613.333333333332,"d":"15613.33"},{"v":15816.666666666664,"d":"15816.67"},{"v":15978.333333333332,"d":"15978.33"},15655,15290,4550,{"v":-0.09900990099009901,"d":"-9.90%"}]
[4,"Cement","ACC",1283.65,{"v":1303.3999999999999,"d":"1303.40"},{"v":1250.7999999999997,"d":"1250.80"},{"v":1217.9499999999998,"d":"1217.95"},{"v":1165.3499999999997,"d":"1165.35"},{"v":1336.2499999999998,"d":"1336.25"},{"v":1388.8499999999997,"d":"1388.85"},{"v":1421.6999999999998,"d":"1421.70"},1356,1270.55,3625200,{"v":-0.023488848184462882,"d":"-2.35%"}]
[5,"Others","ADANIENT",218.55,{"v":220.55000000000004,"d":"220.55"},{"v":214.30000000000007,"d":"214.30"},{"v":210.05000000000004,"d":"210.05"},{"v":203.80000000000007,"d":"203.80"},{"v":224.80000000000007,"d":"224.80"},231.05,{"v":235.30000000000007,"d":"235.30"},226.8,216.3,28024000,{"v":-0.020002797594069102,"d":"-2.00%"}]
[6,"Others","ADANIPORTS",{"v":340.1,"d":"340.10"},{"v":342.93333333333334,"d":"342.93"},{"v":334.7166666666667,"d":"334.72"},{"v":329.33333333333337,"d":"329.33"},{"v":321.11666666666673,"d":"321.12"},{"v":348.31666666666666,"d":"348.32"},{"v":356.53333333333325,"d":"356.53"},{"v":361.91666666666663,"d":"361.92"},351.15,337.55,32100000,{"v":0.03807906863934028,"d":"3.81%"}]
[7,"Power","ADANIPOWER",{"v":47.2,"d":"47.20"},{"v":47.98333333333334,"d":"47.98"},{"v":45.86666666666668,"d":"45.87"},{"v":44.53333333333334,"d":"44.53"},{"v":42.41666666666668,"d":"42.42"},{"v":49.316666666666684,"d":"49.32"},{"v":51.433333333333344,"d":"51.43"},{"v":52.76666666666669,"d":"52.77"},50.1,46.65,73240000,{"v":-0.012671879212725803,"d":"-1.27%"}]
[8,"Automobile","AMARAJABAT",{"v":624.6,"d":"624.60"},{"v":637.1833333333334,"d":"637.18"},{"v":607.5666666666668,"d":"607.57"},{"v":590.5333333333334,"d":"590.53"},{"v":560.9166666666669,"d":"560.92"},{"v":654.2166666666668,"d":"654.22"},{"v":683.8333333333334,"d":"683.83"},{"v":700.8666666666668,"d":"700.87"},666.8,620.15,2185600,{"v":0.05117352828010773,"d":"5.12%"}]
[9,"Cement","AMBUJACEM",{"v":202.4,"d":"202.40"},{"v":205.9,"d":"205.90"},{"v":196.5,"d":"196.50"},{"v":190.6,"d":"190.60"},{"v":181.2,"d":"181.20"},{"v":211.8,"d":"211.80"},{"v":221.20000000000005,"d":"221.20"},{"v":227.10000000000002,"d":"227.10"},215.3,200,19737500,{"v":-0.012384288216162121,"d":"-1.24%"}]
[10,"Others","APOLLOHOSP",1728.75,{"v":1740.6166666666668,"d":"1740.62"},{"v":1703.2333333333336,"d":"1703.23"},{"v":1677.7166666666667,"d":"1677.72"},{"v":1640.3333333333335,"d":"1640.33"},{"v":1766.1333333333337,"d":"1766.13"},{"v":1803.5166666666669,"d":"1803.52"},{"v":1829.0333333333338,"d":"1829.03"},1778,1715.1,1808000,{"v":-0.035990402559317514,"d":"-3.60%"}]
{"$rows_left_out":155}
{"sheet":"Cash Intra","index":2,"n_rows":247,"n_cols":13,"rows_kept":247,"merged":[[7,0,8,0],[7,1,8,1],[7,2,8,2],[7,3,8,3],[7,4,7,6],[7,7,7,9]]}
[]
[]
[]
[]
[{"$nulls":12},"Back to Main Page"]
["FOR INTRA DAY TRADING",{"$nulls":9},{"$f":"Main!B10","v":"2020-03-03"}]
[]
["Sr.no","Scrip","CLOSE RATE","Pivot Point","Supports",null,null,"Resistances"]
[null,null,"Point",null,"S1","S2","S3","R1","R2","R3","HIGH","LOW","Total Trade Quanity in Lakhs"]
[1,"Nifty 50",11132.75,{"v":11200.666666666666,"d":"11200.67"},{"v":10968.333333333332,"d":"10968.33"},{"v":10803.916666666666,"d":"10803.92"},{"v":10571.583333333332,"d":"10571.58"},{"v":11365.083333333332,"d":"11365.08"},{"v":11597.416666666664,"d":"11597.42"},{"v":11761.833333333332,"d":"11761.83"},11433,11036.25]
[2,"Nifty Bank",28868.4,{"v":29077.083333333332,"d":"29077.08"},{"v":28363.016666666663,"d":"28363.02"},{"v":27857.63333333333,"d":"27857.63"},{"v":27143.566666666662,"d":"27143.57"},{"v":29582.466666666664,"d":"29582.47"},{"v":30296.533333333336,"d":"30296.53"},{"v":30801.916666666664,"d":"30801.92"},29791.15,28571.7]
[3,"Nifty CPSE",1529.65,{"v":1546.0833333333333,"d":"1546.08"},{"v":1501.7666666666664,"d":"1501.77"},{"v":1473.8833333333332,"d":"1473.88"},{"v":1429.5666666666664,"d":"1429.57"},{"v":1573.9666666666665,"d":"1573.97"},{"v":1618.2833333333335,"d":"1618.28"},{"v":1646.1666666666665,"d":"1646.17"},1590.4,1518.2]
[4,"Nifty Infra",2972.35,{"v":3001.566666666666,"d":"3001.57"},{"v":2918.6833333333325,"d":"2918.68"},{"v":2865.0166666666664,"d":"2865.02"},{"v":2782.1333333333328,"d":"2782.13"},{"v":3055.233333333332,"d":"3055.23"},{"v":3138.1166666666663,"d":"3138.12"},{"v":3191.783333333332,"d":"3191.78"},3084.45,2947.9]
[5,"Nifty IT",15427.65,{"v":15482.550000000001,"d":"15482.55"},{"v":15243.100000000002,"d":"15243.10"},{"v":15058.550000000001,"d":"15058.55"},{"v":14819.100000000002,"d":"14819.10"},{"v":15667.100000000002,"d":"15667.10"},{"v":15906.550000000003,"d":"15906.55"},{"v":16091.100000000002,"d":"16091.10"},15722,15298]
[6,"Nifty PSE",2675.7,{"v":2708.0333333333333,"d":"2708.03"},{"v":2620.5666666666666,"d":"2620.57"},{"v":2565.4333333333334,"d":"2565.43"},{"v":2477.9666666666667,"d":"2477.97"},{"v":2763.1666666666665,"d":"2763.17"},{"v":2850.6333333333328,"d":"2850.63"},{"v":2905.7666666666664,"d":"2905.77"},2795.5,2652.9]
[7,"Nifty Midcap 50",4469.25,{"v":4514.466666666666,"d":"4514.47"},{"v":4392.133333333332,"d":"4392.13"},{"v":4315.016666666666,"d":"4315.02"},{"v":4192.6833333333325,"d":"4192.68"},{"v":4591.583333333332,"d":"4591.58"},{"v":4713.916666666666,"d":"4713.92"},{"v":4791.033333333332,"d":"4791.03"},4636.8,4437.35]
[8,"ACC",1284.2,1303.55,{"v":1250.6499999999999,"d":"1250.65"},{"v":1217.1,"d":"1217.10"},{"v":1164.1999999999998,"d":"1164.20"},{"v":1337.1,"d":"1337.10"},{"v":1390,"d":"1390.00"},1423.55,1356.45,1270,5.14199]
[9,"AUBANK",1155.75,{"v":1171.2666666666667,"d":"1171.27"},{"v":1124.5333333333333,"d":"1124.53"},{"v":1093.3166666666666,"d":"1093.32"},{"v":1046.5833333333333,"d":"1046.58"},{"v":1202.4833333333333,"d":"1202.48"},{"v":1249.2166666666665,"d":"1249.22"},{"v":1280.4333333333334,"d":"1280.43"},1218,1140.05,4.21839]
[10,"ADANIPORTS",340.65,{"v":343.3333333333333,"d":"343.33"},{"v":335.6166666666666,"d":"335.62"},{"v":330.5833333333333,"d":"330.58"},{"v":322.8666666666666,"d":"322.87"},{"v":348.3666666666666,"d":"348.37"},{"v":356.0833333333333,"d":"356.08"},{"v":361.1166666666666,"d":"361.12"},351.05,338.3,29.12256]
[11,"ADANIPOWER",47.05,47.85,{"v":45.650000000000006,"d":"45.65"},{"v":44.25000000000001,"d":"44.25"},{"v":42.05000000000001,"d":"42.05"},49.25,51.45,{"v":52.849999999999994,"d":"52.85"},50.05,46.45,57.54033]
{"$rows_left_out":228}
{"sheet":"MidCap Intra","index":3,"n_rows":545,"n_cols":13,"rows_kept":545,"merged":[[0,0,0,1],[8,0,9,0],[8,1,9,1],[8,2,9,2],[8,3,9,3],[8,4,8,6],[8,7,8,9]]}
[]
[]
[]
[]
[{"$nulls":11},"Back To Main Page"]
["FOR INTRA DAY TRADING",{"$nulls":9},{"$f":"Main!B10","v":"2020-03-03"}]
[null,null," "]
[]
["Sr.no","Scrip","CLOSE RATE","Pivot Point","Supports",null,null,"Resistances"]
[null,null,"Point",null,"S1","S2","S3","R1","R2","R3","HIGH","LOW","Total Trade Quanity in Lakhs"]
[1,"3MINDIA",20131.65,20375.55,{"v":19756.1,"d":"19756.10"},19380.55,{"v":18761.1,"d":"18761.10"},{"v":20751.1,"d":"20751.10"},{"v":21370.550000000003,"d":"21370.55"},{"v":21746.1,"d":"21746.10"},20995,20000,0.03958]
[2,"AARTIIND",971,{"v":975.5,"d":"975.50"},{"v":951.5,"d":"951.50"},{"v":932,"d":"932.00"},{"v":908,"d":"908.00"},{"v":995,"d":"995.00"},{"v":1019,"d":"1019.00"},{"v":1038.5,"d":"1038.50"},999.5,956,3.0652]
[3,"AAVAS",1858.4,{"v":1873.5833333333333,"d":"1873.58"},{"v":1831.1666666666665,"d":"1831.17"},{"v":1803.9333333333332,"d":"1803.93"},{"v":1761.5166666666664,"d":"1761.52"},{"v":1900.8166666666666,"d":"1900.82"},{"v":1943.2333333333331,"d":"1943.23"},{"v":1970.4666666666667,"d":"1970.47"},1916,1846.35,1.83494]
[4,"ABBOTINDIA",15393.6,{"v":15567.833333333334,"d":"15567.83"},{"v":15035.766666666668,"d":"15035.77"},{"v":14677.933333333334,"d":"14677.93"},{"v":14145.866666666669,"d":"14145.87"},{"v":15925.666666666668,"d":"15925.67"},{"v":16457.733333333334,"d":"16457.73"},{"v":16815.566666666666,"d":"16815.57"},16099.9,15210,0.15393]
[5,"ABCAPITAL",76.7,{"v":77.43333333333334,"d":"77.43"},{"v":75.06666666666668,"d":"75.07"},{"v":73.43333333333334,"d":"73.43"},{"v":71.06666666666668,"d":"71.07"},{"v":79.06666666666668,"d":"79.07"},{"v":81.43333333333335,"d":"81.43"},{"v":83.06666666666668,"d":"83.07"},79.8,75.8,12.38881]
[6,"ABFRL",238,{"v":244.1833333333333,"d":"244.18"},{"v":228.36666666666662,"d":"228.37"},{"v":218.73333333333332,"d":"218.73"},{"v":202.91666666666663,"d":"202.92"},{"v":253.8166666666666,"d":"253.82"},{"v":269.63333333333327,"d":"269.63"},{"v":279.2666666666666,"d":"279.27"},260,234.55,6.66569]
[7,"ACC",1284.2,1303.55,{"v":1250.6499999999999,"d":"1250.65"},{"v":1217.1,"d":"1217.10"},{"v":1164.1999999999998,"d":"1164.20"},{"v":1337.1,"d":"1337.10"},{"v":1390,"d":"1390.00"},1423.55,1356.45,1270,6.12866]
[8,"ADANIGAS",133.7,{"v":136.88333333333335,"d":"136.88"},{"v":127.3666666666667,"d":"127.37"},{"v":121.03333333333336,"d":"121.03"},{"v":111.51666666666671,"d":"111.52"},{"v":143.2166666666667,"d":"143.22"},{"v":152.73333333333335,"d":"152.73"},{"v":159.0666666666667,"d":"159.07"},146.4,130.55,55.83534]
[9,"ADANIGREEN",156.05,{"v":156.23333333333335,"d":"156.23"},{"v":149.8166666666667,"d":"149.82"},{"v":143.58333333333334,"d":"143.58"},{"v":137.16666666666669,"d":"137.17"},{"v":162.4666666666667,"d":"162.47"},{"v":168.88333333333333,"d":"168.88"},{"v":175.1166666666667,"d":"175.12"},162.65,150,11.27956]
[10,"ADANIPORTS",340.65,{"v":343.3333333333333,"d":"343.33"},{"v":335.6166666666666,"d":"335.62"},{"v":330.5833333333333,"d":"330.58"},{"v":322.8666666666666,"d":"322.87"},{"v":348.3666666666666,"d":"348.37"},{"v":356.0833333333333,"d":"356.08"},{"v":361.1166666666666,"d":"361.12"},351.05,338.3,25.10491]
{"$rows_left_out":514}
{"sheet":"Bulk Deals","index":4,"n_rows":41,"n_cols":8,"rows_kept":41,"merged":[[4,0,4,1],[4,2,4,3],[6,1,6,2]]}
[" "]
[]
[]
[]
[]
[{"$nulls":4},"Back To Main Page"]
["Subject :","BULK DEAL",null,{"$f":"Main!B10","v":"2020-03-03"}]
[]
["Date","Scrip code","Scrip Name","Client Name","Buy / Sell","Quantity Traded","Trade Price / Wt.Avg.trade price","Exchange  "]
["2020-03-02",506197,"BLISSGVS","BHARAT SURESH PARIKH(H U F)","BUY",{"v":527200,"d":"527,200"},99.62,"BSE"]
["2020-03-02",542934,"CBPL","SUFAL INVESTMENT","SELL",{"v":38000,"d":"38,000"},43.9,"BSE"]
["2020-03-02",522292,"CHANDNI","REENA ASHISH AJMERA","SELL",{"v":100000,"d":"100,000"},25,"BSE"]
["2020-03-02",540080,"NARAYANI","RIKHAV SECURITIES LIMITED","BUY",{"v":84000,"d":"84,000"},35.85,"BSE"]
["2020-03-02",542771,"NOVATEOR","YASH DEEPAKKUMAR JAIN","BUY",{"v":258000,"d":"258,000"},8.83,"BSE"]
["2020-03-02",542771,"NOVATEOR","JHAVERI TRADING AND INVESTMENT PVT LTD","SELL",{"v":60000,"d":"60,000"},8.83,"BSE"]
["2020-03-02",542771,"NOVATEOR","VIVIDOFFSET PRINTERS PRIVATELIMITED","SELL",{"v":180000,"d":"180,000"},8.83,"BSE"]
["2020-03-02",519439,"PIONAGR","OSCAR RETAILERS LIMITED","SELL",{"v":50000,"d":"50,000"},8.75,"BSE"]
["2020-03-02",519439,"PIONAGR","SAMRAAT FINLEASE PRIVATE LIMITED","BUY",{"v":49496,"d":"49,496"},8.75,"BSE"]
["2020-03-02",538452,"QUASAR","AKSHIKA TRADING ENTERPRISES PRIVATE LIMITED","SELL",{"v":28751,"d":"28,751"},4.23,"BSE"]
["2020-03-02",539026,"SSPNFIN","RAJESH RAMANLAL KAPADIA","BUY",{"v":24000,"d":"24,000"},51,"BSE"]
{"$rows_left_out":22}
{"sheet":"Call Tracker (Equity & F&O)","index":5,"n_rows":248,"n_cols":18,"rows_kept":248,"merged":[[62,0,63,0],[62,1,63,1],[62,9,63,9],[62,11,63,11],[62,12,63,12],[62,13,63,13],[62,14,63,14],[73,0,74,0],[73,1,74,1],[73,9,74,9],[73,11,74,11],[73,12,74,12],[73,13,74,13],[73,14,74,14],[76,0,77,0],[76,1,77,1],[76,9,77,9],[76,11,77,11],[76,12,77,12],[76,13,77,13],[76,14,77,14],[78,0,79,0],[78,1,79,1],[78,9,79,9],[78,11,79,11],[78,12,79,12],[78,13,79,13],[78,14,79,14]]}
[]
[]
[]
[]
[{"$nulls":12},"Back To Main Page"]
["Retail Research Technical Calls & Fundamental Performance Report for the month of March-2020 "]
[{"$nulls":12},{"$f":"Main!B10","v":"2020-03-03"}]
[null,"Positional  Call"]
["Sr.no","Date",null,"Company","Rec","Rec Price","Stop Loss***","Call Closed At","Target","Remark","Profit / Loss per Share","Gain / Loss  %","Status","Closed Date","NSE Closed Price"]
[1,"2020-02-04",null,"MARICO","Buy","306-308",287.8,null,"335-345","Open",{"$nulls":4},{"$f":"VLOOKUP(D10,Sheet2!A2:H1667,6,0)","v":291.25},null,null,"R"]
[2,"2020-02-05",null,"FINPIPE","Buy",552,518,568.5,"600-630","Part Profit of Rs.16.5/-",{"$f":"H11-F11","v":16.5},{"$f":"K11/F11","v":{"v":0.029891304347826088,"d":"2.99%"}},"Successful","2020-02-24",{"$f":"VLOOKUP(D11,Sheet2!A5:H1670,6,0)","v":545.8},null,null,"H"]
[3,"2020-02-05",null,"IOC","Buy",114,107,118,"124-128","Part Profit of Rs.4/-",{"$f":"H12-F12","v":4},{"$f":"K12/F12","v":{"v":0.03508771929824561,"d":"3.51%"}},"Successful","2020-02-10",{"$f":"VLOOKUP(D12,Sheet2!A6:H1671,6,0)","v":103.95},null,null,"H"]
[4,"2020-02-26",null,"TITAN","Buy","1255-1265",1189,null,"1350-1400","Open",{"$nulls":4},{"$f":"VLOOKUP(D13,Sheet2!A15:H1680,6,0)","v":1244.15},null,null,"H"]
[5,"2020-02-26",null,"WHIRLPOOL","Buy","2240-2250",2145,null,"2430-2450","Open",{"$nulls":4},{"$f":"VLOOKUP(D14,Sheet2!A19:H1684,6,0)","v":2213.25},null,null,"R"]
[6,"2020-02-27",null,"MARUTI","Buy",6300,6100,6305,6700,"Profit of Rs.5/-",{"$f":"H15-F15","v":5},{"$f":"K15/F15","v":{"v":7.9365079365079365E-4,"d":"0.08%"}},"Neutral","2020-03-02",{"$nulls":3},"A"]
[7,"2020-02-27",null,"JKPAPER","Buy","120-122",113,null,"132-135","Open",{"$nulls":4},{"$f":"VLOOKUP(D16,Sheet2!A21:H1686,6,0)","v":114},null,null,"N"]
[8,"2020-02-27",null,"SUNPHARMA","Buy",390,370,369,430,"Loss of Rs.21/-",{"$f":"H17-F17","v":-21},{"$f":"K17/F17","v":{"v":-0.05384615384615385,"d":"-5.38%"}},"Unsuccessful","2020-03-02",{"$nulls":3},"A"]
[9,"2020-02-27",null,"HDFCLIFE","Buy","565-567",535,null,625,"Open",{"$nulls":4},{"$f":"VLOOKUP(D18,Sheet2!A23:H1688,6,0)","v":554.5},null,null,"N"]
[10,"2020-02-28",null,"NTPC","Buy","108-110",102,null,125,"Open",{"$nulls":4},{"$f":"VLOOKUP(D19,Sheet2!A24:H1689,6,0)","v":103.9},null,null,"R"]
[11,"2020-03-02",null,"M&M","Buy",447.5,420,468,"490-500","Profit of Rs.20.50/-",{"$f":"H20-F20","v":20.5},{"$f":"K20/F20","v":{"v":0.04581005586592179,"d":"4.58%"}},"Successful","2020-03-02",{"$nulls":3},"N"]
{"$rows_left_out":205}
{"sheet":"Sheet2","index":6,"n_rows":1899,"n_cols":14,"rows_kept":1899,"hidden":true}
["SYMBOL","SERIES","OPEN","HIGH","LOW","CLOSE","LAST","PREVCLOSE","TOTTRDQTY","TOTTRDVAL","TIMESTAMP","TOTALTRADES","ISIN","ISIN"]
["20MICRONS","EQ",31.6,32.6,30.15,31.15,30.25,31.2,30895,975811.95,"2020-03-02",292,"INE144J01027"]
["21STCENMGM","EQ",12.1,12.5,12.1,12.1,12.1,12.3,35334,439541.4,"2020-03-02",19,"INE253B01015"]
["3IINFOTECH","EQ",2,2.05,1.9,1.9,1.95,1.95,1659814,3251102.1,"2020-03-02",724,"INE748C01020"]
["3MINDIA","EQ",20805,20995,20000,20131.65,20100,20575.25,3958,81098715.15,"2020-03-02",1484,"INE470A01017"]
["3PLAND","EQ",4.75,4.75,4.35,4.5,4.5,4.55,156,684.65,"2020-03-02",7,"INE105C01023"]
["5PAISA","EQ",189.9,189.9,155.6,162.1,160.5,158.9,5856,957152.3,"2020-03-02",201,"INE618L01018"]
["63MOONS","EQ",89.2,94.7,86.05,87.95,87,88.7,107060,9664322.05,"2020-03-02",2322,"INE111B01023"]
["A2ZINFRA","EQ",4.8,4.8,4.1,4.4,4.2,4.5,188793,849907.65,"2020-03-02",372,"INE619I01012"]
["AARTIDRUGS","EQ",702,729,660,668.3,675,692.95,82483,57671768.75,"2020-03-02",5310,"INE767A01016"]
["AARTIIND","EQ",986,999.5,956,971,977.4,976.05,306520,301501168.25,"2020-03-02",12384,"INE769A01020"]
["AARVEEDEN","EQ",12.05,12.8,11.7,11.8,11.75,12.2,3360,40491.35,"2020-03-02",135,"INE273D01019"]
["AAVAS","EQ",1877,1916,1846.35,1858.4,1850,1878.85,183494,342717035.4,"2020-03-02",8615,"INE216P01012"]
["ABAN","EQ",20.5,20.9,20,20.15,20.15,20.25,51886,1061495.55,"2020-03-02",688,"INE421A01028"]
["ABB","EQ",1185,1198.9,1182.05,1190.2,1190,1185,99510,118515856.25,"2020-03-02",2500,"INE117A01022"]
["ABBOTINDIA","EQ",15875,16099.9,15210,15393.6,15400,15718.95,15393,240980627,"2020-03-02",4211,"INE358A01014"]
["ABCAPITAL","EQ",79,79.8,75.8,76.7,76.6,77.5,1238881,96896882.35,"2020-03-02",18353,"INE674K01013"]
["ABFRL","EQ",252.1,260,234.55,238,240.65,251.4,666569,163897202.05,"2020-03-02",18442,"INE647O01011"]
["ABSLBANETF","EQ",292.49,292.49,292.49,292.49,292.49,292,1,292.49,"2020-03-02",1,"INF209KB1O58"]
["ABSLNN50ET","EQ",300,300,270,270,270,267.85,60,16260.6,"2020-03-02",6,"INF209KB1B87"]
{"$rows_left_out":1698}
{"sheet":"Sheet1","index":7,"n_rows":0,"n_cols":0,"rows_kept":0,"hidden":true}

{"sheet":"Sheet3","index":8,"n_rows":0,"n_cols":0,"rows_kept":0,"hidden":true}

{"sheet":"Sheet4","index":9,"n_rows":0,"n_cols":0,"rows_kept":0,"hidden":true}

{"sheet":"Sheet5","index":10,"n_rows":0,"n_cols":0,"rows_kept":0,"hidden":true}