{"text_format":"3","workbook":"xlsx","n_sheets":11,"sheets":["Main","Future Intra","Cash Intra","MidCap Intra","Bulk Deals","Call Tracker (Equity & F&O)","Sheet2","Sheet1","Sheet3","Sheet4","Sheet5"],"not_rendered":{"images":4,"defined_names":5},"read":"whole","date_system":"1900"}

{"sheet":"Main","index":0,"n_rows":27,"n_cols":11,"rows_kept":27}
[null,"                                                                                                 "]
{"$rows_empty":8}
[null,"2019-12-02"]
[]
[null,"Sheet No.","Template Name","Summary"]
[null,1,"Future Intra","For Intraday trading in F&O segment"]
[null,2,"Cash Intra","For Intraday trading in cash market segment"]
[null,3,"Mid-cap Intra","For Intraday trading in Mid-cap stocks"]
[null,4,"Bulk Deals","Reveals Bulk Deals carried on NSE & BSE"]
[null,5,"Call Tracker"]
{"$rows_empty":9}
[{"$nulls":10},"`"]

{"sheet":"Future Intra","index":1,"n_rows":193,"n_cols":15,"rows_kept":193,"merged":[[8,0,9,0],[8,1,9,1],[8,2,9,2],[8,5,8,7],[8,8,8,10]]}
[]
[]
[]
[]
[{"$nulls":12},"Back to Main Page"]
["FOR INTRA DAY TRADING",{"$nulls":10},{"$f":"Main!B10","v":"2019-12-02"}]
[]
[]
["Sr.no","Sector","Scrip","CLOSE RATE","Pivot Point","Supports",null,null,"Resistances"]
[null,"Sector",null,"Point","Point","S1","S2","S3","R1","R2","R3","HIGH","LOW","OI","% Change in OI"]
[1,"Index","BANKNIFTY",32003.85,{"v":31990.61666666667,"d":"31990.62"},{"v":31833.233333333337,"d":"31833.23"},{"v":31662.61666666667,"d":"31662.62"},{"v":31505.233333333337,"d":"31505.23"},{"v":32161.233333333337,"d":"32161.23"},{"v":32318.61666666667,"d":"32318.62"},{"v":32489.233333333337,"d":"32489.23"},32148,31820,1731060,{"v":-0.08637687890559027,"d":"-8.64%"}]
[2,"Index","NIFTY",12099.85,{"v":12108.583333333334,"d":"12108.58"},{"v":12042.266666666668,"d":"12042.27"},{"v":11984.683333333334,"d":"11984.68"},{"v":11918.366666666669,"d":"11918.37"},{"v":12166.166666666668,"d":"12166.17"},{"v":12232.483333333334,"d":"12232.48"},{"v":12290.066666666668,"d":"12290.07"},12174.9,12051,14175675,{"v":-0.03542722415297702,"d":"-3.54%"}]
[3,"Index","NIFTYIT",{"v":15124,"d":"15124.00"},{"v":15161.333333333334,"d":"15161.33"},{"v":15072.666666666668,"d":"15072.67"},{"v":15021.333333333334,"d":"15021.33"},{"v":14932.666666666668,"d":"14932.67"},{"v":15212.666666666668,"d":"15212.67"},{"v":15301.333333333336,"d":"15301.33"},{"v":15352.666666666668,"d":"15352.67"},15250,15110,10100,{"v":0.0918918918918919,"d":"9.19%"}]
[4,"Cement","ACC",{"v":1526.2,"d":"1526.20"},{"v":1527.6333333333332,"d":"1527.63"},{"v":1514.3166666666664,"d":"1514.32"},{"v":1502.4333333333332,"d":"1502.43"},{"v":1489.1166666666663,"d":"1489.12"},{"v":1539.5166666666664,"d":"1539.52"},{"v":1552.833333333333,"d":"1552.83"},{"v":1564.7166666666665,"d":"1564.72"},1540.95,1515.75,3223600,{"v":-0.014912602371348246,"d":"-1.49%"}]
[5,"Others","ADANIENT",215.05,{"v":216.66666666666666,"d":"216.67"},{"v":210.98333333333332,"d":"210.98"},{"v":206.91666666666666,"d":"206.92"},{"v":201.23333333333332,"d":"201.23"},{"v":220.73333333333332,"d":"220.73"},{"v":226.41666666666666,"d":"226.42"},{"v":230.48333333333332,"d":"230.48"},222.35,212.6,29512000,{"v":0.012904997254255904,"d":"1.29%"}]
[6,"Others","ADANIPORTS",384.25,{"v":381.40000000000003,"d":"381.40"},{"v":375.30000000000007,"d":"375.30"},366.35,{"v":360.25000000000006,"d":"360.25"},{"v":390.3500000000001,"d":"390.35"},{"v":396.4500000000001,"d":"396.45"},{"v":405.4000000000001,"d":"405.40"},387.5,372.45,34180000,{"v":0.6438619694601418,"d":"64.39%"}]
[7,"Power","ADANIPOWER",63.65,{"v":64,"d":"64.00"},61.25,58.85,{"v":56.1,"d":"56.10"},{"v":66.4,"d":"66.40"},69.15,71.55,66.75,61.6,75790000,{"v":-0.010057471264367816,"d":"-1.01%"}]
[8,"Automobile","AMARAJABAT",{"v":752.9,"d":"752.90"},{"v":752.1999999999999,"d":"752.20"},{"v":746.5999999999999,"d":"746.60"},{"v":740.3,"d":"740.30"},{"v":734.6999999999999,"d":"734.70"},{"v":758.4999999999999,"d":"758.50"},{"v":764.1,"d":"764.10"},{"v":770.3999999999999,"d":"770.40"},757.8,745.9,1379400,{"v":-0.02859154929577465,"d":"-2.86%"}]
[9,"Cement","AMBUJACEM",{"v":205.6,"d":"205.60"},{"v":206.5666666666667,"d":"206.57"},{"v":204.0333333333334,"d":"204.03"},{"v":202.4666666666667,"d":"202.47"},{"v":199.9333333333334,"d":"199.93"},{"v":208.13333333333338,"d":"208.13"},{"v":210.66666666666669,"d":"210.67"},{"v":212.23333333333338,"d":"212.23"},209.1,205,17562500,{"v":0.011810456574967593,"d":"1.18%"}]
[10,"Others","APOLLOHOSP",{"v":1446.4,"d":"1446.40"},{"v":1451.5166666666664,"d":"1451.52"},{"v":1432.983333333333,"d":"1432.98"},{"v":1419.5666666666664,"d":"1419.57"},{"v":1401.0333333333328,"d":"1401.03"},{"v":1464.933333333333,"d":"1464.93"},{"v":1483.4666666666667,"d":"1483.47"},{"v":1496.883333333333,"d":"1496.88"},1470.05,1438.1,1407500,{"v":-7.0997515086971955E-4,"d":"-0.07%"}]
{"$rows_left_out":159}
{"sheet":"Cash Intra","index":2,"n_rows":247,"n_cols":13,"rows_kept":247,"merged":[[7,0,8,0],[7,1,8,1],[7,2,8,2],[7,3,8,3],[7,4,7,6],[7,7,7,9]]}
[]
[]
[]
[]
[{"$nulls":12},"Back to Main Page"]
["FOR INTRA DAY TRADING",{"$nulls":9},{"$f":"Main!B10","v":"2019-12-02"}]
[]
["Sr.no","Scrip","CLOSE RATE","Pivot Point","Supports",null,null,"Resistances"]
[null,null,"Point",null,"S1","S2","S3","R1","R2","R3","HIGH","LOW","Total Trade Quanity in Lakhs"]
[1,"Nifty 50",12056.05,{"v":12073.616666666667,"d":"12073.62"},{"v":11999.833333333334,"d":"11999.83"},{"v":11943.616666666667,"d":"11943.62"},{"v":11869.833333333334,"d":"11869.83"},{"v":12129.833333333334,"d":"12129.83"},{"v":12203.616666666667,"d":"12203.62"},{"v":12259.833333333334,"d":"12259.83"},12147.4,12017.4]
[2,"Nifty Bank",31946.1,{"v":31934.61666666667,"d":"31934.62"},{"v":31782.283333333336,"d":"31782.28"},{"v":31618.466666666667,"d":"31618.47"},{"v":31466.133333333335,"d":"31466.13"},{"v":32098.433333333338,"d":"32098.43"},{"v":32250.766666666666,"d":"32250.77"},{"v":32414.58333333334,"d":"32414.58"},32086.95,31770.8]
[3,"Nifty CPSE",1943,{"v":1947.6166666666668,"d":"1947.62"},{"v":1930.4333333333336,"d":"1930.43"},{"v":1917.8666666666668,"d":"1917.87"},{"v":1900.6833333333336,"d":"1900.68"},{"v":1960.1833333333336,"d":"1960.18"},{"v":1977.366666666667,"d":"1977.37"},{"v":1989.9333333333336,"d":"1989.93"},1964.8,1935.05]
[4,"Nifty Infra",3323.3,3329.65,{"v":3307.8500000000004,"d":"3307.85"},{"v":3292.4,"d":"3292.40"},{"v":3270.6000000000004,"d":"3270.60"},{"v":3345.1000000000004,"d":"3345.10"},{"v":3366.9000000000005,"d":"3366.90"},{"v":3382.3500000000004,"d":"3382.35"},3351.45,3314.2]
[5,"Nifty IT",14998.05,{"v":15036.516666666668,"d":"15036.52"},{"v":14925.783333333336,"d":"14925.78"},{"v":14853.516666666668,"d":"14853.52"},{"v":14742.783333333336,"d":"14742.78"},{"v":15108.783333333336,"d":"15108.78"},{"v":15219.51666666667,"d":"15219.52"},{"v":15291.783333333336,"d":"15291.78"},15147.25,14964.25]
[6,"Nifty PSE",3261.6,{"v":3268.433333333333,"d":"3268.43"},{"v":3243.766666666666,"d":"3243.77"},{"v":3225.933333333333,"d":"3225.93"},{"v":3201.266666666666,"d":"3201.27"},{"v":3286.266666666666,"d":"3286.27"},{"v":3310.933333333333,"d":"3310.93"},{"v":3328.766666666666,"d":"3328.77"},3293.1,3250.6]
[7,"Nifty Midcap 50",4722.8,{"v":4733.483333333334,"d":"4733.48"},{"v":4688.516666666667,"d":"4688.52"},{"v":4654.233333333334,"d":"4654.23"},{"v":4609.266666666667,"d":"4609.27"},{"v":4767.766666666667,"d":"4767.77"},{"v":4812.7333333333345,"d":"4812.73"},{"v":4847.016666666667,"d":"4847.02"},4778.45,4699.2]
[8,"ACC",1522.15,{"v":1522.3833333333332,"d":"1522.38"},{"v":1509.7666666666664,"d":"1509.77"},{"v":1497.3833333333332,"d":"1497.38"},{"v":1484.7666666666664,"d":"1484.77"},{"v":1534.7666666666664,"d":"1534.77"},{"v":1547.3833333333332,"d":"1547.38"},{"v":1559.7666666666664,"d":"1559.77"},1535,1510,8.51825]
[9,"AUBANK",823.75,{"v":818.7666666666668,"d":"818.77"},{"v":810.9833333333336,"d":"810.98"},{"v":798.2166666666668,"d":"798.22"},{"v":790.4333333333336,"d":"790.43"},{"v":831.5333333333335,"d":"831.53"},{"v":839.3166666666666,"d":"839.32"},{"v":852.0833333333335,"d":"852.08"},826.55,806,1.77876]
[10,"ADANIPORTS",382.05,{"v":379.26666666666665,"d":"379.27"},{"v":373.5833333333333,"d":"373.58"},{"v":365.1166666666667,"d":"365.12"},{"v":359.43333333333334,"d":"359.43"},{"v":387.7333333333333,"d":"387.73"},{"v":393.4166666666667,"d":"393.42"},{"v":401.88333333333327,"d":"401.88"},384.95,370.8,301.11277]
[11,"ADANIPOWER",63.6,{"v":63.916666666666664,"d":"63.92"},{"v":61.18333333333332,"d":"61.18"},{"v":58.76666666666666,"d":"58.77"},{"v":56.03333333333332,"d":"56.03"},{"v":66.33333333333333,"d":"66.33"},{"v":69.06666666666666,"d":"69.07"},{"v":71.48333333333333,"d":"71.48"},66.65,61.5,201.90214]
{"$rows_left_out":228}
{"sheet":"MidCap Intra","index":3,"n_rows":545,"n_cols":13,"rows_kept":545,"merged":[[0,0,0,1],[8,0,9,0],[8,1,9,1],[8,2,9,2],[8,3,9,3],[8,4,8,6],[8,7,8,9]]}
[]
[]
[]
[]
[{"$nulls":11},"Back To Main Page"]
["FOR INTRA DAY TRADING",{"$nulls":9},{"$f":"Main!B10","v":"2019-12-02"}]
[null,null," "]
[]
["Sr.no","Scrip","CLOSE RATE","Pivot Point","Supports",null,null,"Resistances"]
[null,null,"Point",null,"S1","S2","S3","R1","R2","R3","HIGH","LOW","Total Trade Quanity in Lakhs"]
[1,"3MINDIA",22241.75,{"v":22299.433333333334,"d":"22299.43"},{"v":22099.36666666667,"d":"22099.37"},{"v":21956.983333333334,"d":"21956.98"},{"v":21756.916666666668,"d":"21756.92"},{"v":22441.81666666667,"d":"22441.82"},{"v":22641.883333333335,"d":"22641.88"},{"v":22784.26666666667,"d":"22784.27"},22499.5,22157.05,0.01233]
[2,"ACC",1522.15,{"v":1522.3833333333332,"d":"1522.38"},{"v":1509.7666666666664,"d":"1509.77"},{"v":1497.3833333333332,"d":"1497.38"},{"v":1484.7666666666664,"d":"1484.77"},{"v":1534.7666666666664,"d":"1534.77"},{"v":1547.3833333333332,"d":"1547.38"},{"v":1559.7666666666664,"d":"1559.77"},1535,1510,8.51825]
[3,"AIAENG",1644.25,{"v":1640.7666666666667,"d":"1640.77"},{"v":1629.5333333333333,"d":"1629.53"},{"v":1614.8166666666666,"d":"1614.82"},{"v":1603.5833333333333,"d":"1603.58"},{"v":1655.4833333333333,"d":"1655.48"},{"v":1666.7166666666665,"d":"1666.72"},{"v":1681.4333333333334,"d":"1681.43"},1652,1626.05,0.105]
[4,"APLAPOLLO",1565.95,{"v":1563.2666666666667,"d":"1563.27"},{"v":1553.9333333333334,"d":"1553.93"},{"v":1541.9166666666667,"d":"1541.92"},{"v":1532.5833333333335,"d":"1532.58"},{"v":1575.2833333333333,"d":"1575.28"},{"v":1584.6166666666668,"d":"1584.62"},{"v":1596.6333333333332,"d":"1596.63"},1572.6,1551.25,0.10771]
[5,"AUBANK",823.75,{"v":818.7666666666668,"d":"818.77"},{"v":810.9833333333336,"d":"810.98"},{"v":798.2166666666668,"d":"798.22"},{"v":790.4333333333336,"d":"790.43"},{"v":831.5333333333335,"d":"831.53"},{"v":839.3166666666666,"d":"839.32"},{"v":852.0833333333335,"d":"852.08"},826.55,806,1.77876]
[6,"AAVAS",1773.25,{"v":1788.4166666666667,"d":"1788.42"},{"v":1736.8333333333335,"d":"1736.83"},{"v":1700.4166666666667,"d":"1700.42"},{"v":1648.8333333333335,"d":"1648.83"},{"v":1824.8333333333335,"d":"1824.83"},{"v":1876.416666666667,"d":"1876.42"},{"v":1912.8333333333335,"d":"1912.83"},1840,1752,4.15805]
[7,"ABBOTINDIA",12578.4,{"v":12626.800000000001,"d":"12626.80"},{"v":12461.600000000002,"d":"12461.60"},{"v":12344.800000000001,"d":"12344.80"},{"v":12179.600000000002,"d":"12179.60"},{"v":12743.600000000002,"d":"12743.60"},{"v":12908.800000000003,"d":"12908.80"},{"v":13025.600000000002,"d":"13025.60"},12792,12510,0.05272]
[8,"ADANIGAS",161.35,{"v":159.71666666666667,"d":"159.72"},{"v":150.73333333333335,"d":"150.73"},{"v":140.11666666666667,"d":"140.12"},{"v":131.13333333333335,"d":"131.13"},{"v":170.33333333333334,"d":"170.33"},{"v":179.31666666666663,"d":"179.32"},{"v":189.93333333333334,"d":"189.93"},168.7,149.1,104.14685]
[9,"ADANIGREEN",137.1,{"v":136.0666666666667,"d":"136.07"},{"v":133.38333333333338,"d":"133.38"},{"v":129.66666666666669,"d":"129.67"},{"v":126.98333333333338,"d":"126.98"},{"v":139.7833333333334,"d":"139.78"},{"v":142.46666666666673,"d":"142.47"},{"v":146.1833333333334,"d":"146.18"},138.75,132.35,57.16364]
[10,"ADANIPORTS",382.05,{"v":379.26666666666665,"d":"379.27"},{"v":373.5833333333333,"d":"373.58"},{"v":365.1166666666667,"d":"365.12"},{"v":359.43333333333334,"d":"359.43"},{"v":387.7333333333333,"d":"387.73"},{"v":393.4166666666667,"d":"393.42"},{"v":401.88333333333327,"d":"401.88"},384.95,370.8,301.11277]
{"$rows_left_out":513}
{"sheet":"Bulk Deals","index":4,"n_rows":72,"n_cols":8,"rows_kept":72,"merged":[[4,0,4,1],[4,2,4,3],[6,1,6,2]]}
[" "]
[]
[]
[]
[]
[{"$nulls":4},"Back To Main Page"]
["Subject :","BULK DEAL",null,{"$f":"Main!B10","v":"2019-12-02"}]
[]
["Date","Scrip code","Scrip Name","Client Name","Buy / Sell","Quantity Traded","Trade Price / Wt.Avg.trade price","Exchange  "]
["2019-11-29",532921,"ADANIPORTS","NEW WORLD FUND INC","SELL",{"v":10687163,"d":"10,687,163"},375.34,"BSE"]
["2019-11-29",539621,"BCLENTERPR","ARYADEEP INFRAHOMES PRIVATE LIMITED","BUY",{"v":46510,"d":"46,510"},12.82,"BSE"]
["2019-11-29",533144,"COX&KINGS","IFCI LTD.","SELL",{"v":900000,"d":"900,000"},2,"BSE"]
["2019-11-29",539032,"FRASER","RAVINDRA NATH MISHRA","SELL",{"v":55632,"d":"55,632"},14.23,"BSE"]
["2019-11-29",530733,"NOVAPUB","SEKH GOLAMAHEMAD RAZA","SELL",{"v":78025,"d":"78,025"},11.56,"BSE"]
["2019-11-29",541634,"RAWEDGE","NNM SECURITIES PVT LTD","BUY",{"v":64000,"d":"64,000"},69.75,"BSE"]
["2019-11-29",541634,"RAWEDGE","NIKUNJ ANILKUMAR MITTAL","SELL",{"v":64000,"d":"64,000"},69.75,"BSE"]
["2019-11-29",532092,"SAGARPROD","SANJIB CHAKRABORTY","BUY",{"v":232490,"d":"232,490"},11.41,"BSE"]
["2019-11-29",532092,"SAGARPROD","SANJIB CHAKRABORTY","SELL",{"v":10000,"d":"10,000"},11.26,"BSE"]
["2019-11-29",524324,"SEYAIND","BEACON TRUSTEESHIP LIMITED","SELL",{"v":198879,"d":"198,879"},90.49,"BSE"]
["2019-11-29",531925,"SHAQUAK","WAYS VINIMAY PRIVATE LIMITED","SELL",{"v":335333,"d":"335,333"},0.21,"BSE"]
{"$rows_left_out":53}
{"sheet":"Call Tracker (Equity & F&O)","index":5,"n_rows":406,"n_cols":18,"rows_kept":406,"merged":[[148,0,149,0],[148,1,149,1],[148,9,149,9],[148,11,149,11],[148,12,149,12],[148,13,149,13],[148,14,149,14],[150,0,151,0],[150,1,151,1],[150,9,151,9],[150,11,151,11],[150,12,151,12],[150,13,151,13],[150,14,151,14],[152,0,153,0],[152,1,153,1],[152,9,153,9],[152,11,153,11],[152,12,153,12],[152,13,153,13],[152,14,153,14],[154,0,155,0],[154,1,155,1],[154,9,155,9],[154,11,155,11],[154,12,155,12],[154,13,155,13],[154,14,155,14],[156,0,157,0],[156,1,157,1],[156,9,157,9],[156,11,157,11],[156,12,157,12],[156,13,157,13],[156,14,157,14],[158,0,159,0],[158,1,159,1],[158,9,159,9],[158,11,159,11],[158,12,159,12],[158,13,159,13],[158,14,159,14],[160,0,161,0],[160,1,161,1],[160,9,161,9],[160,11,161,11],[160,12,161,12],[160,13,161,13],[160,14,161,14],[162,0,163,0],[162,1,163,1],[162,9,163,9],[162,11,163,11],[162,12,163,12],[162,13,163,13],[162,14,163,14],[164,0,165,0],[164,1,165,1],[164,9,165,9],[164,11,165,11],[164,12,165,12],[164,13,165,13],[164,14,165,14],[166,0,167,0],[166,1,167,1],[166,9,167,9],[166,11,167,11],[166,12,167,12],[166,13,167,13],[166,14,167,14],[168,0,169,0],[168,1,169,1],[168,9,169,9],[168,11,169,11],[168,12,169,12],[168,13,169,13],[168,14,169,14],[170,0,171,0],[170,1,171,1],[170,9,171,9],[170,11,171,11],[170,12,171,12],[170,13,171,13],[170,14,171,14],[172,0,173,0],[172,1,173,1],[172,9,173,9],[172,11,173,11],[172,12,173,12],[172,13,173,13],[172,14,173,14],[174,0,175,0],[174,1,175,1],[174,9,175,9],[174,11,175,11],[174,12,175,12],[174,13,175,13],[174,14,175,14],[176,0,177,0],[176,1,177,1],[176,9,177,9],[176,11,177,11],[176,12,177,12],[176,13,177,13],[176,14,177,14],[178,0,179,0],[178,1,179,1],[178,9,179,9],[178,11,179,11],[178,12,179,12],[178,13,179,13],[178,14,179,14],[180,0,181,0],[180,1,181,1],[180,9,181,9],[180,11,181,11],[180,12,181,12],[180,13,181,13],[180,14,181,14],[183,0,184,0],[183,1,184,1],[183,9,184,9],[183,11,184,11],[183,12,184,12],[183,13,184,13],[183,14,184,14],[185,0,186,0],[185,1,186,1],[185,9,186,9],[185,11,186,11],[185,12,186,12],[185,13,186,13],[185,14,186,14],[196,0,197,0],[196,1,197,1],[196,9,197,9],[196,11,197,11],[196,12,197,12],[196,13,197,13],[196,14,197,14],[198,0,199,0],[198,1,199,1],[198,9,199,9],[198,11,199,11],[198,12,199,12],[198,13,199,13],[198,14,199,14],[201,0,202,0],[201,1,202,1],[201,9,202,9],[201,11,202,11],[201,12,202,12],[201,13,202,13],[201,14,202,14],[203,0,204,0],[203,1,204,1],[203,9,204,9],[203,11,204,11],[203,12,204,12],[203,13,204,13],[203,14,204,14],[205,0,206,0],[205,1,206,1],[205,9,206,9],[205,11,206,11],[205,12,206,12],[205,13,206,13],[205,14,206,14],[207,0,208,0],[207,1,208,1],[207,9,208,9],[207,11,208,11],[207,12,208,12],[207,13,208,13],[207,14,208,14],[209,0,210,0],[209,1,210,1],[209,9,210,9],[209,11,210,11],[209,12,210,12],[209,13,210,13],[209,14,210,14],[212,0,213,0],[212,1,213,1],[212,9,213,9],[212,11,213,11],[212,12,213,12],[212,13,213,13],[212,14,213,14],[214,0,215,0],[214,1,215,1],[214,9,215,9],[214,11,215,11],[214,12,215,12],[214,13,215,13],[214,14,215,14],[216,0,217,0],[216,1,217,1],[216,9,217,9],[216,11,217,11],[216,12,217,12],[216,13,217,13],[216,14,217,14],[220,0,221,0],[220,1,221,1],[220,9,221,9],[220,11,221,11],[220,12,221,12],[220,13,221,13],[220,14,221,14],[222,0,223,0],[222,1,223,1],[222,9,223,9],[222,11,223,11],[222,12,223,12],[222,13,223,13],[222,14,223,14],[224,0,225,0],[224,1,225,1],[224,9,225,9],[224,11,225,11],[224,12,225,12],[224,13,225,13],[224,14,225,14]]}
[]
[]
[]
[]
[{"$nulls":12},"Back To Main Page"]
["Retail Research Technical Calls & Fundamental Performance Report for the month of November-2019 "]
[{"$nulls":12},{"$f":"Main!B10","v":"2019-12-02"}]
[null,"Positional  Call"]
["Sr.no","Date",null,"Company","Rec","Rec Price","Stop Loss***","Call Closed At","Target","Remark","Profit / Loss per Share","Gain / Loss  %","Status","Closed Date","NSE Closed Price"]
[1,"2019-09-26",null,"HDFC","Buy",2070,1940,2165,"2250-2300","Profit of Rs.95/-",{"$f":"H10-F10","v":95},{"$f":"K10/F10","v":{"v":0.04589371980676329,"d":"4.59%"}},"Successful","2019-11-01",{"$nulls":3},"H"]
[2,"2019-10-01",null,"UPL","Buy{}",595,564,599.5,"650-660","Profit of Rs.4.50/-",4.5,{"v":0.007563025210084034,"d":"0.76%"},"Neutral","2019-11-07",{"$nulls":3},"R"]
[3,"2019-10-07",null,"PIDILITIND","Buy{}",1367.5,1297,1413.5,"1500-1520","Part Profit of Rs.46/-",{"$f":"H12-F12","v":46},{"$f":"K12/F12","v":{"v":0.03363802559414991,"d":"3.36%"}},"Successful","2019-10-31",{"$f":"VLOOKUP(D12,Sheet2!A51:M1690,6,0)","v":1303},null,null,"R"]
[4,"2019-10-22",null,"HEIDELBERG","Buy{}",188.5,178,199,"205-210","Profit of Rs.10.50/-",10.5,{"v":0.05570291777188329,"d":"5.57%"},"Successful","2019-11-05",{"$nulls":3},"H"]
[5,"2019-10-27",null,"AMBUJACEM","Buy{}",197,185.4,207,"216-220","Profit of Rs.10/-",{"$f":"H14-F14","v":10},{"$f":"K14/F14","v":{"v":0.050761421319796954,"d":"5.08%"}},"Successful","2019-11-29",{"$nulls":3},"R"]
[6,"2019-11-04",null,"UBL","Buy{}",1240,1178,1292.5,"1340-1360","Profit of Rs.52.5/-",{"$f":"H15-F15","v":52.5},{"$f":"K15/F15","v":{"v":0.04233870967741935,"d":"4.23%"}},"Successful","2019-11-08",{"$nulls":3},"H"]
[7,"2019-11-05",null,"TATAMOTORS","Sell",173,183.3,163,"158-155","Profit of Rs.10/-",{"$f":"F16-H16","v":10},{"v":0.057803468208092484,"d":"5.78%"},"Successful","2019-11-21",{"$nulls":3},"R"]
[8,"2019-11-06",null,"BANDHANBNK","Buy",572.5,538,547,"630-650","Loss of Rs.25.5/-",-25.5,{"$f":"K17/F17","v":{"v":-0.0445414847161572,"d":"-4.45%"}},"Unsuccessful","2019-11-11",{"$nulls":3},"H"]
[9,"2019-11-07",null,"PRESTIGE","Buy",312,288,288.5,"340-360","Loss of Rs.23.5/-",{"$f":"H18-F18","v":-23.5},{"$f":"K18/F18","v":{"v":-0.07532051282051282,"d":"-7.53%"}},"Unsuccessful","2019-11-15",{"$nulls":3},"H"]
[10,"2019-11-07",null,"JINDALSTEL","Sell",138,148.3,143,"120-117","Loss of Rs.5/-",{"$f":"F19-H19","v":-5},{"$f":"K19/F19","v":{"v":-0.036231884057971016,"d":"-3.62%"}},"Unsuccessful","2019-11-07",{"$nulls":3},"R"]
[11,"2019-11-08",null,"CIPLA","Sell{}",465,491.3,440,"425-418","Profit of Rs.25/-",{"$f":"F20-H20","v":25},{"v":0.053763440860215055,"d":"5.38%"},"Successful","2019-11-15",{"$nulls":3},"R"]
{"$rows_left_out":367}
{"sheet":"Sheet2","index":6,"n_rows":1899,"n_cols":14,"rows_kept":1899,"hidden":true}
["SYMBOL","SERIES","OPEN","HIGH","LOW","CLOSE","LAST","PREVCLOSE","TOTTRDQTY","TOTTRDVAL","TIMESTAMP","TOTALTRADES","ISIN","ISIN"]
["20MICRONS","EQ",33.85,34.4,33.4,33.55,33.4,34.1,37909,1285362.25,"2019-11-29",621,"INE144J01027"]
["21STCENMGM","EQ",13.1,13.35,13.1,13.35,13.35,13.1,154,2055.65,"2019-11-29",8,"INE253B01015"]
["3IINFOTECH","EQ",2,2.05,1.95,1.95,1.95,2,1358174,2677450.95,"2019-11-29",625,"INE748C01020"]
["3MINDIA","EQ",22370.1,22499.5,22157.05,22241.75,22275,22352.65,1233,27442348.3,"2019-11-29",342,"INE470A01017"]
["3PLAND","EQ",6.45,6.45,5.85,5.85,5.85,6.15,1096,7032.75,"2019-11-29",8,"INE105C01023"]
["5PAISA","EQ",164.4,166,160.8,165.45,166,162.95,4253,698827.45,"2019-11-29",277,"INE618L01018"]
["63MOONS","EQ",104.7,107.9,103.35,104.85,104.8,104.15,131757,13904066.95,"2019-11-29",2723,"INE111B01023"]
["A2ZINFRA","EQ",8.95,8.95,8.8,8.85,8.85,8.95,73977,653630.2,"2019-11-29",250,"INE619I01012"]
["AARTIDRUGS","EQ",520.3,525.95,518.05,520,519.95,520.95,3903,2032554.45,"2019-11-29",626,"INE767A01016"]
["AARTIIND","EQ",848.5,854.8,825,843.65,840,847.8,95209,80446997.75,"2019-11-29",9415,"INE769A01020"]
["AARVEEDEN","EQ",12.55,12.8,12.2,12.6,12.8,12.6,6502,79985.1,"2019-11-29",57,"INE273D01019"]
["AAVAS","EQ",1799.95,1840,1752,1773.25,1760,1794.3,415805,748246007.35,"2019-11-29",5518,"INE216P01012"]
["ABAN","BE",26.7,26.9,26,26.55,26.5,26.3,17640,466703.65,"2019-11-29",232,"INE421A01028"]
["ABB","EQ",1452,1480,1441.3,1447.8,1445,1447,58803,85945432.9,"2019-11-29",5147,"INE117A01022"]
["ABBOTINDIA","EQ",12750,12792,12510,12578.4,12650,12743.1,5272,66590038.75,"2019-11-29",1781,"INE358A01014"]
["ABCAPITAL","EQ",110.3,114.6,108.8,109.45,109.15,110.15,6000573,668549125.15,"2019-11-29",51298,"INE674K01013"]
["ABFRL","EQ",221.6,228,221.6,225.25,225,220.9,903609,203768825.05,"2019-11-29",17257,"INE647O01011"]
["ABSLBANETF","EQ",320,325,320,323.33,325,319.51,50,16100,"2019-11-29",5,"INF209KB1O58"]
["ABSLNN50ET","EQ",280.87,289.73,280.87,286.3,286.3,289.18,83,23612.59,"2019-11-29",6,"INF209KB1B87"]
{"$rows_left_out":1696}
{"sheet":"Sheet1","index":7,"n_rows":0,"n_cols":0,"rows_kept":0,"hidden":true}

{"sheet":"Sheet3","index":8,"n_rows":0,"n_cols":0,"rows_kept":0,"hidden":true}

{"sheet":"Sheet4","index":9,"n_rows":0,"n_cols":0,"rows_kept":0,"hidden":true}

{"sheet":"Sheet5","index":10,"n_rows":0,"n_cols":0,"rows_kept":0,"hidden":true}