{"text_format":"3","workbook":"xlsx","n_sheets":11,"sheets":["Main","Future Intra","Cash Intra","MidCap Intra","Bulk Deals","Call Tracker (Equity & F&O)","Sheet2","Sheet1","Sheet3","Sheet4","Sheet5"],"not_rendered":{"images":4,"defined_names":5},"read":"whole","date_system":"1900"}

{"sheet":"Main","index":0,"n_rows":27,"n_cols":11,"rows_kept":27}
[null,"                                                                                                 "]
{"$rows_empty":8}
[null,"2019-10-01"]
[]
[null,"Sheet No.","Template Name","Summary"]
[null,1,"Future Intra","For Intraday trading in F&O segment"]
[null,2,"Cash Intra","For Intraday trading in cash market segment"]
[null,3,"Mid-cap Intra","For Intraday trading in Mid-cap stocks"]
[null,4,"Bulk Deals","Reveals Bulk Deals carried on NSE & BSE"]
[null,5,"Call Tracker"]
{"$rows_empty":9}
[{"$nulls":10},"`"]

{"sheet":"Future Intra","index":1,"n_rows":193,"n_cols":15,"rows_kept":193,"merged":[[8,0,9,0],[8,1,9,1],[8,2,9,2],[8,5,8,7],[8,8,8,10]]}
[]
[]
[]
[]
[{"$nulls":12},"Back to Main Page"]
["FOR INTRA DAY TRADING",{"$nulls":10},{"$f":"Main!B10","v":"2019-10-01"}]
[]
[]
["Sr.no","Sector","Scrip","CLOSE RATE","Pivot Point","Supports",null,null,"Resistances"]
[null,"Sector",null,"Point","Point","S1","S2","S3","R1","R2","R3","HIGH","LOW","OI","% Change in OI"]
[1,"Index","BANKNIFTY",{"v":29324.7,"d":"29324.70"},{"v":29461.266666666666,"d":"29461.27"},{"v":28966.933333333334,"d":"28966.93"},{"v":28609.166666666668,"d":"28609.17"},{"v":28114.833333333336,"d":"28114.83"},{"v":29819.033333333333,"d":"29819.03"},{"v":30313.36666666667,"d":"30313.37"},{"v":30671.13333333333,"d":"30671.13"},29955.6,29103.5,1375660,{"v":0.3735173129917329,"d":"37.35%"}]
[2,"Index","NIFTY",{"v":11534.6,"d":"11534.60"},{"v":11519.699999999999,"d":"11519.70"},{"v":11459.899999999998,"d":"11459.90"},{"v":11385.199999999999,"d":"11385.20"},{"v":11325.399999999998,"d":"11325.40"},{"v":11594.399999999998,"d":"11594.40"},{"v":11654.199999999997,"d":"11654.20"},{"v":11728.899999999998,"d":"11728.90"},11579.5,11445,15513750,{"v":0.011753657427108249,"d":"1.18%"}]
[3,"Index","NIFTYIT",{"v":15556,"d":"15556.00"},{"v":15505.333333333334,"d":"15505.33"},{"v":15420.666666666668,"d":"15420.67"},{"v":15285.333333333334,"d":"15285.33"},{"v":15200.666666666668,"d":"15200.67"},{"v":15640.666666666668,"d":"15640.67"},{"v":15725.333333333336,"d":"15725.33"},{"v":15860.666666666668,"d":"15860.67"},15590,15370,10350,{"v":-0.20384615384615384,"d":"-20.38%"}]
[4,"Cement","ACC",{"v":1617.9,"d":"1617.90"},{"v":1622.7,"d":"1622.70"},{"v":1601.5,"d":"1601.50"},{"v":1585.1,"d":"1585.10"},{"v":1563.8999999999999,"d":"1563.90"},{"v":1639.1000000000001,"d":"1639.10"},{"v":1660.3000000000004,"d":"1660.30"},{"v":1676.7000000000003,"d":"1676.70"},1643.9,1606.3,2067600,{"v":0.027634194831013918,"d":"2.76%"}]
[5,"Others","ADANIENT",146.45,{"v":146.9333333333333,"d":"146.93"},{"v":143.41666666666663,"d":"143.42"},{"v":140.38333333333333,"d":"140.38"},{"v":136.86666666666665,"d":"136.87"},{"v":149.9666666666666,"d":"149.97"},{"v":153.48333333333332,"d":"153.48"},{"v":156.5166666666666,"d":"156.52"},150.45,143.9,25280000,{"v":1.1088230635197213E-3,"d":"0.11%"}]
[6,"Others","ADANIPORTS",{"v":415.6,"d":"415.60"},{"v":412.3833333333334,"d":"412.38"},{"v":407.8166666666668,"d":"407.82"},{"v":400.0333333333334,"d":"400.03"},{"v":395.4666666666668,"d":"395.47"},{"v":420.16666666666674,"d":"420.17"},{"v":424.73333333333335,"d":"424.73"},{"v":432.5166666666667,"d":"432.52"},416.95,404.6,10930000,{"v":-0.017748820489777578,"d":"-1.77%"}]
[7,"Power","ADANIPOWER",64.55,{"v":65.06666666666666,"d":"65.07"},{"v":63.03333333333333,"d":"63.03"},{"v":61.516666666666666,"d":"61.52"},{"v":59.483333333333334,"d":"59.48"},{"v":66.58333333333333,"d":"66.58"},{"v":68.61666666666666,"d":"68.62"},{"v":70.13333333333333,"d":"70.13"},67.1,63.55,91940000,{"v":-0.020664678312739666,"d":"-2.07%"}]
[8,"Automobile","AMARAJABAT",{"v":719.8,"d":"719.80"},{"v":715,"d":"715.00"},707.25,{"v":694.7,"d":"694.70"},686.95,727.55,{"v":735.3,"d":"735.30"},{"v":747.8499999999999,"d":"747.85"},722.75,702.45,1673000,{"v":-0.018077239112571898,"d":"-1.81%"}]
[9,"Cement","AMBUJACEM",205.45,{"v":205.64999999999998,"d":"205.65"},{"v":203.69999999999996,"d":"203.70"},201.95,{"v":199.99999999999997,"d":"200.00"},{"v":207.39999999999995,"d":"207.40"},209.35,{"v":211.09999999999994,"d":"211.10"},207.6,203.9,24175000,{"v":-0.011550649085147704,"d":"-1.16%"}]
[10,"Others","APOLLOHOSP",{"v":1401.7,"d":"1401.70"},{"v":1395.7,"d":"1395.70"},{"v":1378,"d":"1378.00"},{"v":1354.3,"d":"1354.30"},{"v":1336.6,"d":"1336.60"},{"v":1419.4,"d":"1419.40"},{"v":1437.1000000000004,"d":"1437.10"},{"v":1460.8000000000002,"d":"1460.80"},1413.4,1372,1835000,{"v":0.013812154696132596,"d":"1.38%"}]
{"$rows_left_out":160}
{"sheet":"Cash Intra","index":2,"n_rows":247,"n_cols":13,"rows_kept":247,"merged":[[7,0,8,0],[7,1,8,1],[7,2,8,2],[7,3,8,3],[7,4,7,6],[7,7,7,9]]}
[]
[]
[]
[]
[{"$nulls":12},"Back to Main Page"]
["FOR INTRA DAY TRADING",{"$nulls":9},{"$f":"Main!B10","v":"2019-10-01"}]
[]
["Sr.no","Scrip","CLOSE RATE","Pivot Point","Supports",null,null,"Resistances"]
[null,null,"Point",null,"S1","S2","S3","R1","R2","R3","HIGH","LOW","Total Trade Quanity in Lakhs"]
[1,"Nifty 50",11474.45,{"v":11457.833333333334,"d":"11457.83"},{"v":11407.416666666668,"d":"11407.42"},{"v":11340.383333333333,"d":"11340.38"},{"v":11289.966666666667,"d":"11289.97"},{"v":11524.866666666669,"d":"11524.87"},{"v":11575.283333333336,"d":"11575.28"},{"v":11642.31666666667,"d":"11642.32"},11508.25,11390.8]
[2,"Nifty Bank",29103.15,{"v":29267,"d":"29267.00"},{"v":28779.6,"d":"28779.60"},28456.05,{"v":27968.649999999998,"d":"27968.65"},29590.55,30077.95,{"v":30401.5,"d":"30401.50"},29754.4,28943.45]
[3,"Nifty CPSE",1963.5,{"v":1955.0833333333333,"d":"1955.08"},{"v":1939.5666666666666,"d":"1939.57"},{"v":1915.6333333333334,"d":"1915.63"},{"v":1900.1166666666668,"d":"1900.12"},{"v":1979.0166666666664,"d":"1979.02"},{"v":1994.5333333333333,"d":"1994.53"},{"v":2018.4666666666662,"d":"2018.47"},1970.6,1931.15]
[4,"Nifty Infra",3208.4,{"v":3198.1,"d":"3198.10"},3175.45,{"v":3142.5,"d":"3142.50"},3119.85,{"v":3231.0499999999997,"d":"3231.05"},{"v":3253.7000000000003,"d":"3253.70"},{"v":3286.6499999999996,"d":"3286.65"},3220.75,3165.15]
[5,"Nifty IT",15540.15,{"v":15456.133333333331,"d":"15456.13"},{"v":15343.816666666662,"d":"15343.82"},{"v":15147.48333333333,"d":"15147.48"},{"v":15035.16666666666,"d":"15035.17"},{"v":15652.466666666664,"d":"15652.47"},{"v":15764.783333333333,"d":"15764.78"},{"v":15961.116666666665,"d":"15961.12"},15568.45,15259.8]
[6,"Nifty PSE",3243.7,{"v":3231.433333333333,"d":"3231.43"},{"v":3210.3166666666657,"d":"3210.32"},{"v":3176.933333333333,"d":"3176.93"},{"v":3155.8166666666657,"d":"3155.82"},{"v":3264.8166666666657,"d":"3264.82"},{"v":3285.9333333333334,"d":"3285.93"},{"v":3319.3166666666657,"d":"3319.32"},3252.55,3198.05]
[7,"Nifty Midcap 50",4394,{"v":4404.483333333333,"d":"4404.48"},{"v":4341.416666666665,"d":"4341.42"},{"v":4288.833333333332,"d":"4288.83"},{"v":4225.766666666665,"d":"4225.77"},{"v":4457.066666666666,"d":"4457.07"},{"v":4520.133333333333,"d":"4520.13"},{"v":4572.716666666666,"d":"4572.72"},4467.55,4351.9]
[8,"ABB",1515.35,{"v":1518.4333333333334,"d":"1518.43"},{"v":1501.9166666666667,"d":"1501.92"},{"v":1488.4833333333333,"d":"1488.48"},{"v":1471.9666666666667,"d":"1471.97"},{"v":1531.8666666666668,"d":"1531.87"},{"v":1548.3833333333332,"d":"1548.38"},{"v":1561.8166666666668,"d":"1561.82"},1534.95,1505,1.56032]
[9,"ACC",1608.15,{"v":1612.3999999999999,"d":"1612.40"},{"v":1590.7999999999997,"d":"1590.80"},{"v":1573.4499999999998,"d":"1573.45"},{"v":1551.8499999999997,"d":"1551.85"},{"v":1629.7499999999998,"d":"1629.75"},{"v":1651.3499999999997,"d":"1651.35"},{"v":1668.6999999999998,"d":"1668.70"},1634,1595.05,5.52438]
[10,"AUBANK",659.5,{"v":658.5666666666667,"d":"658.57"},{"v":651.9333333333334,"d":"651.93"},{"v":644.3666666666667,"d":"644.37"},{"v":637.7333333333333,"d":"637.73"},{"v":666.1333333333334,"d":"666.13"},{"v":672.7666666666669,"d":"672.77"},{"v":680.3333333333335,"d":"680.33"},665.2,651,2.00065]
[11,"ADANIPORTS",413.95,{"v":410.31666666666666,"d":"410.32"},{"v":405.0833333333333,"d":"405.08"},{"v":396.21666666666664,"d":"396.22"},{"v":390.9833333333333,"d":"390.98"},{"v":419.18333333333334,"d":"419.18"},{"v":424.4166666666667,"d":"424.42"},{"v":433.28333333333336,"d":"433.28"},415.55,401.45,31.52658]
{"$rows_left_out":228}
{"sheet":"MidCap Intra","index":3,"n_rows":545,"n_cols":13,"rows_kept":545,"merged":[[0,0,0,1],[8,0,9,0],[8,1,9,1],[8,2,9,2],[8,3,9,3],[8,4,8,6],[8,7,8,9]]}
[]
[]
[]
[]
[{"$nulls":11},"Back To Main Page"]
["FOR INTRA DAY TRADING",{"$nulls":9},{"$f":"Main!B10","v":"2019-10-01"}]
[null,null," "]
[]
["Sr.no","Scrip","CLOSE RATE","Pivot Point","Supports",null,null,"Resistances"]
[null,null,"Point",null,"S1","S2","S3","R1","R2","R3","HIGH","LOW","Total Trade Quanity in Lakhs"]
[1,"3MINDIA",20671.05,{"v":20457.483333333334,"d":"20457.48"},{"v":20124.316666666666,"d":"20124.32"},{"v":19577.583333333332,"d":"19577.58"},{"v":19244.416666666664,"d":"19244.42"},{"v":21004.216666666667,"d":"21004.22"},{"v":21337.38333333333,"d":"21337.38"},{"v":21884.11666666667,"d":"21884.12"},20790.65,19910.75,0.02831]
[2,"ABB",1515.35,{"v":1518.4333333333334,"d":"1518.43"},{"v":1501.9166666666667,"d":"1501.92"},{"v":1488.4833333333333,"d":"1488.48"},{"v":1471.9666666666667,"d":"1471.97"},{"v":1531.8666666666668,"d":"1531.87"},{"v":1548.3833333333332,"d":"1548.38"},{"v":1561.8166666666668,"d":"1561.82"},1534.95,1505,1.56032]
[3,"ACC",1608.15,{"v":1612.3999999999999,"d":"1612.40"},{"v":1590.7999999999997,"d":"1590.80"},{"v":1573.4499999999998,"d":"1573.45"},{"v":1551.8499999999997,"d":"1551.85"},{"v":1629.7499999999998,"d":"1629.75"},{"v":1651.3499999999997,"d":"1651.35"},{"v":1668.6999999999998,"d":"1668.70"},1634,1595.05,5.52438]
[4,"AIAENG",1784.05,{"v":1778.1833333333334,"d":"1778.18"},{"v":1756.3166666666668,"d":"1756.32"},{"v":1728.5833333333335,"d":"1728.58"},{"v":1706.716666666667,"d":"1706.72"},{"v":1805.9166666666667,"d":"1805.92"},{"v":1827.7833333333335,"d":"1827.78"},{"v":1855.5166666666667,"d":"1855.52"},1800.05,1750.45,0.11933]
[5,"APLAPOLLO",1362.35,{"v":1375.0833333333333,"d":"1375.08"},{"v":1337.2666666666664,"d":"1337.27"},{"v":1312.1833333333332,"d":"1312.18"},{"v":1274.3666666666663,"d":"1274.37"},{"v":1400.1666666666665,"d":"1400.17"},{"v":1437.9833333333336,"d":"1437.98"},{"v":1463.0666666666666,"d":"1463.07"},1412.9,1350,0.58563]
[6,"AUBANK",659.5,{"v":658.5666666666667,"d":"658.57"},{"v":651.9333333333334,"d":"651.93"},{"v":644.3666666666667,"d":"644.37"},{"v":637.7333333333333,"d":"637.73"},{"v":666.1333333333334,"d":"666.13"},{"v":672.7666666666669,"d":"672.77"},{"v":680.3333333333335,"d":"680.33"},665.2,651,2.00065]
[7,"AAVAS",1596.1,{"v":1590.3666666666668,"d":"1590.37"},{"v":1561.3333333333335,"d":"1561.33"},{"v":1526.5666666666666,"d":"1526.57"},{"v":1497.5333333333333,"d":"1497.53"},{"v":1625.1333333333337,"d":"1625.13"},{"v":1654.166666666667,"d":"1654.17"},{"v":1688.9333333333338,"d":"1688.93"},1619.4,1555.6,0.18842]
[8,"ADANIGREEN",58.25,{"v":58.5,"d":"58.50"},55.55,{"v":52.849999999999994,"d":"52.85"},{"v":49.89999999999999,"d":"49.90"},{"v":61.2,"d":"61.20"},64.15,{"v":66.85000000000001,"d":"66.85"},61.45,55.8,40.85782]
[9,"ADANIPORTS",413.95,{"v":410.31666666666666,"d":"410.32"},{"v":405.0833333333333,"d":"405.08"},{"v":396.21666666666664,"d":"396.22"},{"v":390.9833333333333,"d":"390.98"},{"v":419.18333333333334,"d":"419.18"},{"v":424.4166666666667,"d":"424.42"},{"v":433.28333333333336,"d":"433.28"},415.55,401.45,31.52658]
[10,"ADANIPOWER",64.3,{"v":64.88333333333334,"d":"64.88"},{"v":62.81666666666668,"d":"62.82"},{"v":61.333333333333336,"d":"61.33"},{"v":59.26666666666667,"d":"59.27"},{"v":66.36666666666667,"d":"66.37"},{"v":68.43333333333334,"d":"68.43"},{"v":69.91666666666669,"d":"69.92"},66.95,63.4,116.03051]
{"$rows_left_out":513}
{"sheet":"Bulk Deals","index":4,"n_rows":104,"n_cols":8,"rows_kept":104,"merged":[[4,0,4,1],[4,2,4,3],[6,1,6,2]]}
[" "]
[]
[]
[]
[]
[{"$nulls":4},"Back To Main Page"]
["Subject :","BULK DEAL",null,{"$f":"Main!B10","v":"2019-10-01"}]
[]
["Date","Scrip code","Scrip Name","Client Name","Buy / Sell","Quantity Traded","Trade Price / Wt.Avg.trade price","Exchange  "]
["2019-09-30",542580,"AARTECH","MURALIDHAR TIWARI","BUY",{"v":36000,"d":"36,000"},{"v":36.4,"d":"36.40"},"BSE"]
["2019-09-30",542580,"AARTECH","AMRITA TIWARI","BUY",{"v":36000,"d":"36,000"},{"v":36.4,"d":"36.40"},"BSE"]
["2019-09-30",542580,"AARTECH","RAKHI JAIN","BUY",{"v":36000,"d":"36,000"},36.4,"BSE"]
["2019-09-30",542580,"AARTECH","ANJU RAMESHLAL MAKHIJA","BUY",{"v":36000,"d":"36,000"},36.4,"BSE"]
["2019-09-30",542580,"AARTECH","AKHILESH SHUKLA","SELL",{"v":144000,"d":"144,000"},36.4,"BSE"]
["2019-09-30",539570,"ACEWIN","SIVAKUMARAN","BUY",{"v":67200,"d":"67,200"},5.53,"BSE"]
["2019-09-30",542721,"ARL","SAVJANI ENTERPRISE","BUY",{"v":256000,"d":"256,000"},32.46,"BSE"]
["2019-09-30",542721,"ARL","AMRAPALI FINCAP PVT LTD","SELL",{"v":260000,"d":"260,000"},32.46,"BSE"]
["2019-09-30",530355,"ASIANOI","ASIAN OILFIELD SERVICES LIMITED EMPLOYEES WELFARE TRUST","BUY",{"v":200744,"d":"200,744"},78.18,"BSE"]
["2019-09-30",517421,"BUTTERFLY","RELIANCE ALTERNATIVE INVESTMENTS FUND","SELL",{"v":964800,"d":"964,800"},145.65,"BSE"]
["2019-09-30",542216,"DALBHARAT","KRITAGYATA TRUST","BUY",{"v":1951062,"d":"1,951,062"},816,"BSE"]
{"$rows_left_out":85}
{"sheet":"Call Tracker (Equity & F&O)","index":5,"n_rows":354,"n_cols":18,"rows_kept":354,"merged":[[138,0,139,0],[138,1,139,1],[138,9,139,9],[138,11,139,11],[138,12,139,12],[138,13,139,13],[138,14,139,14],[140,0,141,0],[140,1,141,1],[140,9,141,9],[140,11,141,11],[140,12,141,12],[140,13,141,13],[140,14,141,14],[142,0,143,0],[142,1,143,1],[142,9,143,9],[142,11,143,11],[142,12,143,12],[142,13,143,13],[142,14,143,14],[144,0,145,0],[144,1,145,1],[144,9,145,9],[144,11,145,11],[144,12,145,12],[144,13,145,13],[144,14,145,14],[146,0,147,0],[146,1,147,1],[146,9,147,9],[146,11,147,11],[146,12,147,12],[146,13,147,13],[146,14,147,14],[148,0,149,0],[148,1,149,1],[148,9,149,9],[148,11,149,11],[148,12,149,12],[148,13,149,13],[148,14,149,14],[150,0,151,0],[150,1,151,1],[150,9,151,9],[150,11,151,11],[150,12,151,12],[150,13,151,13],[150,14,151,14],[163,0,164,0],[163,1,164,1],[163,9,164,9],[163,11,164,11],[163,12,164,12],[163,13,164,13],[163,14,164,14],[167,0,168,0],[167,1,168,1],[167,9,168,9],[167,11,168,11],[167,12,168,12],[167,13,168,13],[167,14,168,14],[180,0,181,0],[180,1,181,1],[180,9,181,9],[180,11,181,11],[180,12,181,12],[180,13,181,13],[180,14,181,14]]}
[]
[]
[]
[]
[{"$nulls":12},"Back To Main Page"]
["Retail Research Technical Calls & Fundamental Performance Report for the month of September-2019 "]
[{"$nulls":12},{"$f":"Main!B10","v":"2019-10-01"}]
[null,"Positional  Call"]
["Sr.no","Date",null,"Company","Rec","Rec Price","Stop Loss***","Call Closed At","Target","Remark","Profit / Loss per Share","Gain / Loss  %","Status","Closed Date","NSE Closed Price"]
[1,"2019-08-01",null,"HDFCBANK","Buy{}",1105,{"$f":"2130/2","v":1065},1155,{"$f":"2350/2","v":1175},"Profit of Rs.50/-",{"$f":"H10-F10","v":50},{"$f":"K10/F10","v":{"v":0.04524886877828054,"d":"4.52%"}},"Successful","2019-09-20",{"$nulls":3},"H"]
[2,"2019-08-02",null,"LT","Buy{}",1350,1270,1485,1500,"Profit of Rs.135/-",135,{"v":0.1,"d":"10.00%"},"Successful","2019-09-23",{"$nulls":3},"H"]
[3,"2019-08-09",null,"TATACHEM","Buy",566,534,583.5,"620-640","Profit of Rs.17.50/-",{"$f":"H12-F12","v":17.5},{"$f":"K12/F12","v":{"v":0.030918727915194347,"d":"3.09%"}},"Successful","2019-09-05",{"$nulls":3},"H"]
[4,"2019-08-19",null,"TATAELXSI","Buy{}",635,597,681.5,"700-720","Profit of Rs.46.50/-",{"$f":"H13-F13","v":46.5},{"$f":"K13/F13","v":{"v":0.07322834645669292,"d":"7.32%"}},"Successful","2019-09-24",{"$nulls":3},"R"]
[5,"2019-08-23",null,"IOC","Buy{}",122.5,114.4,122.75,135,"Neutral",{"$f":"H14-F14","v":0.25},{"$f":"K14/F14","v":{"v":2.0408163265306124E-3,"d":"0.20%"}},"Neutral","2019-09-03",{"$nulls":3},"H"]
[6,"2019-08-30",null,"BIOCON","Buy{}",229.5,214.3,237,"255-260","Part Profit of Rs.7.5/-",{"$f":"H15-F15","v":7.5},{"$f":"K15/F15","v":{"v":0.032679738562091505,"d":"3.27%"}},"Successful","2019-08-30",{"$f":"VLOOKUP(D15,Sheet2!A38:M1677,6,0)","v":222.95},null,null,"R"]
[7,"2019-09-03",null,"POWERGRID","Buy{}",198,186,208.5,"220-224","Profit of Rs.10.5/-",10.5,{"v":0.05303030303030303,"d":"5.30%"},"Successful","2019-09-20",{"$nulls":3},"R"]
[8,"2019-09-04",null,"JUSTDIAL","Buy{}",709.5,673,703.75,"775-785","Neutral",{"$f":"H17-F17","v":-5.75},{"$f":"K17/F17","v":{"v":-0.00810429880197322,"d":"-0.81%"}},"Neutral","2019-09-20",{"$nulls":3},"R"]
[9,"2019-09-09",null,"TATAGLOBAL","Buy",266,256,255,"281-285","Loss of Rs.11/-",-11,{"v":-0.041353383458646614,"d":"-4.14%"},"Unsuccessful","2019-09-18",{"$nulls":3},"R"]
[10,"2019-09-09",null,"TORNTPHARM","Sell",1705,1808,1647.5,"1560-1540","Part Profit of Rs.57.5/-",{"$f":"F19-H19","v":57.5},{"v":0.03372434017595308,"d":"3.37%"},"Successful","2019-09-30",{"$f":"VLOOKUP(D19,Sheet2!A34:M1673,6,0)","v":1667.4},null,null,"R"]
[11,"2019-09-11",null,"LICHSGFIN","Buy{}",400.5,379,431,"440-450","Profit of Rs.30.50/-",{"$f":"H20-F20","v":30.5},{"$f":"K20/F20","v":{"v":0.07615480649188515,"d":"7.62%"}},"Successful","2019-09-23",{"$nulls":3},"H"]
{"$rows_left_out":335}
{"sheet":"Sheet2","index":6,"n_rows":1899,"n_cols":14,"rows_kept":1899,"hidden":true}
["SYMBOL","SERIES","OPEN","HIGH","LOW","CLOSE","LAST","PREVCLOSE","TOTTRDQTY","TOTTRDVAL","TIMESTAMP","TOTALTRADES","ISIN","ISIN"]
["20MICRONS","EQ",41,41.6,39.85,40.05,40,40.75,67628,2712102.7,"2019-09-30",1076,"INE144J01027"]
["21STCENMGM","EQ",12.9,12.9,12.6,12.9,12.9,12.85,1726,22116.4,"2019-09-30",10,"INE253B01015"]
["3IINFOTECH","EQ",2.1,2.1,1.95,2,2.05,2.05,1291505,2582134.2,"2019-09-30",426,"INE748C01020"]
["3MINDIA","EQ",20450,20790.65,19910.75,20671.05,20659.95,20517.4,2831,58214947.3,"2019-09-30",985,"INE470A01017"]
["5PAISA","EQ",190.3,190.3,190.3,190.3,190.3,181.25,15669,2981810.7,"2019-09-30",119,"INE618L01018"]
["63MOONS","EQ",131.5,133.85,122.5,125,124.3,127.5,251054,32363487.4,"2019-09-30",5788,"INE111B01023"]
["A2ZINFRA","EQ",10.3,10.7,10.15,10.35,10.35,10.6,272188,2830289.95,"2019-09-30",408,"INE619I01012"]
["AARTIDRUGS","EQ",477.95,477.95,452,453.85,452.5,460.55,5088,2332501.85,"2019-09-30",1631,"INE767A01016"]
["AARTIIND","EQ",835,835,797,800.7,800,813.3,101866,83047975.6,"2019-09-30",13814,"INE769A01020"]
["AARVEEDEN","EQ",16.9,16.9,15.5,15.9,16.2,16.15,1553,25182.65,"2019-09-30",74,"INE273D01019"]
["AAVAS","EQ",1591.9,1619.4,1555.6,1596.1,1577,1591.85,18842,30097165.55,"2019-09-30",3908,"INE216P01012"]
["ABAN","BE",27.55,27.55,26.25,26.25,26.25,27.6,19631,516326.95,"2019-09-30",246,"INE421A01028"]
["ABB","EQ",1534.95,1534.95,1505,1515.35,1518.95,1545.35,156032,236369274.15,"2019-09-30",10256,"INE117A01022"]
["ABBOTINDIA","EQ",10747,10750.9,10512,10596.55,10600,10688.8,4657,49498614.35,"2019-09-30",1347,"INE358A01014"]
["ABCAPITAL","EQ",89.7,89.8,84.55,84.85,84.9,89.7,1792857,154478271.6,"2019-09-30",17384,"INE674K01013"]
["ABFRL","EQ",206.8,213.9,201.25,211.35,208.5,205.3,550223,113501604.55,"2019-09-30",7159,"INE647O01011"]
["ABMINTLTD","BE",14.1,14.1,14.1,14.1,14.1,14,27,380.7,"2019-09-30",2,"INE251C01017"]
["ABSLNN50ET","EQ",278.42,278.42,275.32,275.32,275.32,280.91,63,17376.15,"2019-09-30",4,"INF209KB1B87"]
["ACC","EQ",1632.2,1634,1595.05,1608.15,1611,1634.6,552438,892556420.25,"2019-09-30",17309,"INE012A01025"]
{"$rows_left_out":1701}
{"sheet":"Sheet1","index":7,"n_rows":0,"n_cols":0,"rows_kept":0,"hidden":true}

{"sheet":"Sheet3","index":8,"n_rows":0,"n_cols":0,"rows_kept":0,"hidden":true}

{"sheet":"Sheet4","index":9,"n_rows":0,"n_cols":0,"rows_kept":0,"hidden":true}

{"sheet":"Sheet5","index":10,"n_rows":0,"n_cols":0,"rows_kept":0,"hidden":true}