{"text_format":"3","workbook":"xlsx","n_sheets":6,"sheets":["Main","Future Intra","Cash Intra","MidCap Intra","Bulk Deals","Call Tracker (Equity & F&O)"],"not_rendered":{"images":2,"defined_names":3},"read":"whole","date_system":"1900"}

{"sheet":"Main","index":0,"n_rows":27,"n_cols":11,"rows_kept":27}
[null,"                                                                                                 "]
{"$rows_empty":8}
[null,"2023-03-31"]
[]
[null,"Sheet No.","Template Name","Summary"]
[null,1,"Future Intra","For Intraday trading in F&O segment"]
[null,2,"Cash Intra","For Intraday trading in cash market segment"]
[null,3,"Mid-cap Intra","For Intraday trading in Mid-cap stocks"]
[null,4,"Bulk Deals","Reveals Bulk Deals carried on NSE & BSE"]
[null,5,"Call Tracker"]
{"$rows_empty":9}
[{"$nulls":10},"`"]

{"sheet":"Future Intra","index":1,"n_rows":236,"n_cols":16,"rows_kept":236,"merged":[[8,0,9,0],[8,1,9,1],[8,2,9,2],[8,3,9,3],[8,6,8,8],[8,9,8,11]]}
[]
[]
[]
[]
[{"$nulls":12},"Back to Main Page"]
["FOR INTRA DAY TRADING",{"$nulls":10},{"$f":"Main!B10","v":"2023-03-31"}]
[]
[]
["Sr.no","Sector","Scrip","Expiry Date","CLOSE RATE","Pivot Point","Supports",null,null,"Resistances"]
[{"$nulls":4},"Point","Point","S1","S2","S3","R1","R2","R3","HIGH","LOW","OI","% Change in OI"]
[1,"Index","NIFTY","2023-04-27",{"v":17213.1,"d":"17213.10"},{"v":17168.033333333333,"d":"17168.03"},{"v":17097.066666666666,"d":"17097.07"},{"v":16981.033333333333,"d":"16981.03"},{"v":16910.066666666666,"d":"16910.07"},{"v":17284.066666666666,"d":"17284.07"},{"v":17355.033333333333,"d":"17355.03"},{"v":17471.066666666666,"d":"17471.07"},17239,17052,13605200,{"v":-0.1788563910046715,"d":"-17.89%"}]
[2,"Index","BANKNIFTY","2023-04-27",{"v":40221.6,"d":"40221.60"},{"v":40134.166666666664,"d":"40134.17"},{"v":39957.283333333326,"d":"39957.28"},{"v":39692.96666666666,"d":"39692.97"},{"v":39516.08333333332,"d":"39516.08"},{"v":40398.48333333333,"d":"40398.48"},{"v":40575.366666666676,"d":"40575.37"},{"v":40839.683333333334,"d":"40839.68"},40311.05,39869.85,5050200,{"v":-0.12303123968951325,"d":"-12.30%"}]
[3,"Index","FINNIFTY","2023-04-25",17931.05,17900.95,{"v":17836.9,"d":"17836.90"},17742.75,{"v":17678.7,"d":"17678.70"},{"v":17995.100000000002,"d":"17995.10"},{"v":18059.149999999998,"d":"18059.15"},{"v":18153.300000000003,"d":"18153.30"},17965,17806.8,17400,{"v":0.24641833810888253,"d":"24.64%"}]
[4,"Index","MIDCPNIFTY","2023-04-25",7045.15,{"v":2348.383333333333,"d":"2348.38"},{"v":4696.766666666666,"d":"4696.77"},{"v":2348.383333333333,"d":"2348.38"},{"v":4696.766666666666,"d":"4696.77"},{"v":4696.766666666666,"d":"4696.77"},{"v":2348.383333333333,"d":"2348.38"},{"v":4696.766666666666,"d":"4696.77"},0,0,0,{"$error":"#DIV/0!"}]
[5,"Chemical","AARTIIND","2023-04-27",514.05,{"v":508.3166666666666,"d":"508.32"},{"v":496.73333333333323,"d":"496.73"},{"v":479.41666666666663,"d":"479.42"},{"v":467.83333333333326,"d":"467.83"},{"v":525.6333333333332,"d":"525.63"},{"v":537.2166666666667,"d":"537.22"},{"v":554.5333333333332,"d":"554.53"},519.9,491,3756150,{"v":-0.12199483409497318,"d":"-12.20%"}]
[6,"Capital_Goods","ABB","2023-04-27",{"v":3382.9,"d":"3382.90"},{"v":3378.366666666667,"d":"3378.37"},{"v":3334.8833333333337,"d":"3334.88"},{"v":3286.866666666667,"d":"3286.87"},{"v":3243.3833333333337,"d":"3243.38"},{"v":3426.3833333333337,"d":"3426.38"},{"v":3469.8666666666672,"d":"3469.87"},{"v":3517.8833333333337,"d":"3517.88"},3421.85,3330.35,1468500,{"v":-0.07423167848699763,"d":"-7.42%"}]
[7,"Pharma","ABBOTINDIA","2023-04-27",{"v":21990.2,"d":"21990.20"},{"v":21961.733333333334,"d":"21961.73"},{"v":21853.466666666667,"d":"21853.47"},{"v":21716.733333333334,"d":"21716.73"},{"v":21608.466666666667,"d":"21608.47"},{"v":22098.466666666667,"d":"22098.47"},{"v":22206.733333333337,"d":"22206.73"},{"v":22343.466666666667,"d":"22343.47"},22070,21825,42560,{"v":-0.07558644656820157,"d":"-7.56%"}]
[8,"Others","ABCAPITAL","2023-04-27",154.55,{"v":152.43333333333334,"d":"152.43"},{"v":149.81666666666666,"d":"149.82"},{"v":145.08333333333331,"d":"145.08"},{"v":142.46666666666664,"d":"142.47"},{"v":157.16666666666669,"d":"157.17"},{"v":159.78333333333336,"d":"159.78"},{"v":164.5166666666667,"d":"164.52"},155.05,147.7,29365200,{"v":-0.0739100817438692,"d":"-7.39%"}]
[9,"Textile","ABFRL","2023-04-27",213.05,{"v":211.88333333333333,"d":"211.88"},{"v":209.81666666666666,"d":"209.82"},{"v":206.58333333333334,"d":"206.58"},{"v":204.51666666666668,"d":"204.52"},{"v":215.11666666666665,"d":"215.12"},{"v":217.1833333333333,"d":"217.18"},{"v":220.41666666666663,"d":"220.42"},213.95,208.65,21806200,{"v":-0.09319926478538221,"d":"-9.32%"}]
[10,"Cement","ACC","2023-04-27",{"v":1641.4,"d":"1641.40"},{"v":1640.0999999999997,"d":"1640.10"},{"v":1616.8999999999994,"d":"1616.90"},{"v":1592.3999999999996,"d":"1592.40"},{"v":1569.1999999999994,"d":"1569.20"},{"v":1664.5999999999995,"d":"1664.60"},{"v":1687.7999999999997,"d":"1687.80"},{"v":1712.2999999999995,"d":"1712.30"},1663.3,1615.6,4876250,{"v":-0.015147689977278465,"d":"-1.51%"}]
{"$rows_left_out":202}
{"sheet":"Cash Intra","index":2,"n_rows":246,"n_cols":13,"rows_kept":246,"merged":[[7,0,8,0],[7,1,8,1],[7,2,8,2],[7,3,8,3],[7,4,7,6],[7,7,7,9]]}
[]
[]
[]
[]
[{"$nulls":12},"Back to Main Page"]
["FOR INTRA DAY TRADING",{"$nulls":9},{"$f":"Main!B10","v":"2023-03-31"}]
[]
["Sr.no",null,"CLOSE RATE","Pivot Point","Supports",null,null,"Resistances"]
[{"$nulls":4},"S1","S2","S3","R1","R2","R3","HIGH","LOW","Total Trade Quanity in Lakhs"]
[1,"Nifty 50",{"v":17080.7,"d":"17080.70"},17049.15,16972.15,{"v":16863.6,"d":"16863.60"},{"v":16786.6,"d":"16786.60"},{"v":17157.700000000004,"d":"17157.70"},{"v":17234.700000000004,"d":"17234.70"},{"v":17343.250000000007,"d":"17343.25"},17126.15,{"v":16940.6,"d":"16940.60"}]
[2,"Nifty Bank",39910.15,{"v":39858.23333333333,"d":"39858.23"},{"v":39661.46666666666,"d":"39661.47"},{"v":39412.78333333333,"d":"39412.78"},{"v":39216.01666666666,"d":"39216.02"},{"v":40106.91666666666,"d":"40106.92"},{"v":40303.683333333334,"d":"40303.68"},{"v":40552.366666666654,"d":"40552.37"},{"v":40055,"d":"40055.00"},39609.55]
[3,"Nifty CPSE",{"v":2880.3,"d":"2880.30"},{"v":2869.4,"d":"2869.40"},{"v":2841.2000000000003,"d":"2841.20"},{"v":2802.1000000000004,"d":"2802.10"},{"v":2773.9000000000005,"d":"2773.90"},{"v":2908.5,"d":"2908.50"},{"v":2936.7,"d":"2936.70"},{"v":2975.7999999999997,"d":"2975.80"},{"v":2897.6,"d":"2897.60"},{"v":2830.3,"d":"2830.30"}]
[4,"Nifty Infra",5013.55,{"v":5003.533333333334,"d":"5003.53"},{"v":4978.966666666667,"d":"4978.97"},{"v":4944.383333333333,"d":"4944.38"},{"v":4919.816666666667,"d":"4919.82"},{"v":5038.116666666668,"d":"5038.12"},{"v":5062.683333333335,"d":"5062.68"},{"v":5097.266666666668,"d":"5097.27"},{"v":5028.1,"d":"5028.10"},4968.95]
[5,"Nifty IT",{"v":28011.3,"d":"28011.30"},{"v":27921.63333333333,"d":"27921.63"},{"v":27729.316666666662,"d":"27729.32"},{"v":27447.333333333332,"d":"27447.33"},{"v":27255.016666666663,"d":"27255.02"},{"v":28203.61666666666,"d":"28203.62"},{"v":28395.933333333327,"d":"28395.93"},{"v":28677.91666666666,"d":"28677.92"},28113.95,27639.65]
[6,"Nifty PSE",{"v":4428.5,"d":"4428.50"},{"v":4415.883333333333,"d":"4415.88"},{"v":4384.716666666666,"d":"4384.72"},{"v":4340.933333333333,"d":"4340.93"},{"v":4309.766666666666,"d":"4309.77"},{"v":4459.666666666666,"d":"4459.67"},{"v":4490.833333333334,"d":"4490.83"},{"v":4534.616666666666,"d":"4534.62"},4447.05,{"v":4372.1,"d":"4372.10"}]
[7,"Nifty Midcap 50",{"v":8373.5,"d":"8373.50"},{"v":8329.666666666666,"d":"8329.67"},{"v":8268.883333333331,"d":"8268.88"},{"v":8164.266666666665,"d":"8164.27"},{"v":8103.48333333333,"d":"8103.48"},{"v":8434.283333333333,"d":"8434.28"},{"v":8495.06666666667,"d":"8495.07"},{"v":8599.683333333334,"d":"8599.68"},8390.45,8225.05]
[8,"ABB",3391.45,{"v":3380.0333333333333,"d":"3380.03"},{"v":3344.4166666666665,"d":"3344.42"},{"v":3297.383333333333,"d":"3297.38"},{"v":3261.7666666666664,"d":"3261.77"},{"v":3427.0666666666666,"d":"3427.07"},{"v":3462.6833333333334,"d":"3462.68"},{"v":3509.7166666666667,"d":"3509.72"},3415.65,3333,10.31003]
[9,"ACC",1625.9,{"v":1622.4166666666667,"d":"1622.42"},{"v":1595.8333333333335,"d":"1595.83"},{"v":1565.7666666666667,"d":"1565.77"},{"v":1539.1833333333334,"d":"1539.18"},{"v":1652.4833333333336,"d":"1652.48"},{"v":1679.066666666667,"d":"1679.07"},{"v":1709.1333333333337,"d":"1709.13"},1649,1592.35,10.12619]
[10,"AUBANK",585.55,{"v":579.4,"d":"579.40"},{"v":568.8499999999999,"d":"568.85"},552.15,{"v":541.5999999999999,"d":"541.60"},{"v":596.0999999999999,"d":"596.10"},{"v":606.6499999999999,"d":"606.65"},{"v":623.3499999999999,"d":"623.35"},589.95,562.7,25.05188]
[11,"ABBOTINDIA",21770.05,{"v":21748.249999999996,"d":"21748.25"},{"v":21614.649999999994,"d":"21614.65"},{"v":21459.249999999996,"d":"21459.25"},{"v":21325.649999999994,"d":"21325.65"},{"v":21903.649999999994,"d":"21903.65"},{"v":22037.249999999993,"d":"22037.25"},{"v":22192.649999999994,"d":"22192.65"},21881.85,21592.85,0.09818]
{"$rows_left_out":227}
{"sheet":"MidCap Intra","index":3,"n_rows":532,"n_cols":13,"rows_kept":532,"merged":[[0,0,0,1],[8,0,9,0],[8,1,9,1],[8,2,9,2],[8,3,9,3],[8,4,8,6],[8,7,8,9]]}
[]
[]
[]
[]
[{"$nulls":11},"Back To Main Page"]
["FOR INTRA DAY TRADING",{"$nulls":9},{"$f":"Main!B10","v":"2023-03-31"}]
[null,null," "]
[]
["Sr.no","Scrip","CLOSE RATE","Pivot Point","Supports",null,null,"Resistances"]
[{"$nulls":4},"S1","S2","S3","R1","R2","R3","HIGH","LOW","Total Trade Quanity in Lakhs"]
[1,"360ONE",438.6,{"v":434.56666666666666,"d":"434.57"},{"v":429.1333333333333,"d":"429.13"},{"v":419.6666666666667,"d":"419.67"},{"v":414.23333333333335,"d":"414.23"},{"v":444.0333333333333,"d":"444.03"},{"v":449.4666666666666,"d":"449.47"},{"v":458.9333333333333,"d":"458.93"},440,425.1,1.57615]
[2,"3MINDIA",23095,{"v":22978,"d":"22978.00"},{"v":22706,"d":"22706.00"},{"v":22317,"d":"22317.00"},{"v":22045,"d":"22045.00"},{"v":23367,"d":"23367.00"},{"v":23639,"d":"23639.00"},{"v":24028,"d":"24028.00"},23250,22589,0.01977]
[3,"ABB",3391.45,{"v":3380.0333333333333,"d":"3380.03"},{"v":3344.4166666666665,"d":"3344.42"},{"v":3297.383333333333,"d":"3297.38"},{"v":3261.7666666666664,"d":"3261.77"},{"v":3427.0666666666666,"d":"3427.07"},{"v":3462.6833333333334,"d":"3462.68"},{"v":3509.7166666666667,"d":"3509.72"},3415.65,3333,10.31003]
[4,"ACC",1625.9,{"v":1622.4166666666667,"d":"1622.42"},{"v":1595.8333333333335,"d":"1595.83"},{"v":1565.7666666666667,"d":"1565.77"},{"v":1539.1833333333334,"d":"1539.18"},{"v":1652.4833333333336,"d":"1652.48"},{"v":1679.066666666667,"d":"1679.07"},{"v":1709.1333333333337,"d":"1709.13"},1649,1592.35,10.12619]
[5,"AIAENG",2905.4,{"v":2900.7999999999997,"d":"2900.80"},{"v":2865.5999999999995,"d":"2865.60"},{"v":2825.7999999999997,"d":"2825.80"},{"v":2790.5999999999995,"d":"2790.60"},{"v":2940.5999999999995,"d":"2940.60"},{"v":2975.7999999999993,"d":"2975.80"},{"v":3015.5999999999995,"d":"3015.60"},2936,2861,0.9209]
[6,"APLAPOLLO",1200.05,{"v":1202.1000000000001,"d":"1202.10"},{"v":1188.9500000000003,"d":"1188.95"},{"v":1177.8500000000001,"d":"1177.85"},{"v":1164.7000000000003,"d":"1164.70"},{"v":1213.2000000000003,"d":"1213.20"},{"v":1226.3500000000004,"d":"1226.35"},{"v":1237.4500000000003,"d":"1237.45"},1215.25,1191,4.03616]
[7,"AUBANK",585.55,{"v":579.4,"d":"579.40"},{"v":568.8499999999999,"d":"568.85"},552.15,{"v":541.5999999999999,"d":"541.60"},{"v":596.0999999999999,"d":"596.10"},{"v":606.6499999999999,"d":"606.65"},{"v":623.3499999999999,"d":"623.35"},589.95,562.7,25.05188]
[8,"AARTIDRUGS",337.5,{"v":340.7833333333333,"d":"340.78"},{"v":328.7666666666666,"d":"328.77"},{"v":320.0333333333333,"d":"320.03"},{"v":308.0166666666666,"d":"308.02"},{"v":349.5166666666666,"d":"349.52"},{"v":361.53333333333325,"d":"361.53"},{"v":370.2666666666666,"d":"370.27"},352.8,332.05,11.31381]
[9,"AAVAS",1606.4,{"v":1611.6333333333332,"d":"1611.63"},{"v":1584.4666666666665,"d":"1584.47"},{"v":1562.5333333333333,"d":"1562.53"},{"v":1535.3666666666666,"d":"1535.37"},{"v":1633.5666666666664,"d":"1633.57"},{"v":1660.7333333333333,"d":"1660.73"},{"v":1682.6666666666663,"d":"1682.67"},1638.8,1589.7,1.13298]
[10,"ABBOTINDIA",21770.05,{"v":21748.249999999996,"d":"21748.25"},{"v":21614.649999999994,"d":"21614.65"},{"v":21459.249999999996,"d":"21459.25"},{"v":21325.649999999994,"d":"21325.65"},{"v":21903.649999999994,"d":"21903.65"},{"v":22037.249999999993,"d":"22037.25"},{"v":22192.649999999994,"d":"22192.65"},21881.85,21592.85,0.09818]
{"$rows_left_out":513}
{"sheet":"Bulk Deals","index":4,"n_rows":200,"n_cols":8,"rows_kept":200,"merged":[[4,0,4,1],[4,2,4,3],[6,1,6,2]]}
[" "]
[]
[]
[]
[]
[{"$nulls":4},"Back To Main Page"]
["Subject :","BULK DEAL",null,{"$f":"Main!B10","v":"2023-03-31"}]
[]
["Date","Scrip code","Scrip Name","Client Name","Buy / Sell","Quantity Traded","Trade Price / Wt.Avg.trade price","Exchange  "]
["2023-03-29",531156,"ALFAVIO","AMARESH GUPTA","SELL",{"v":240530,"d":"240,530"},10.25,"BSE"]
["2023-03-29",531156,"ALFAVIO","ANKIT GUPTA","BUY",{"v":256696,"d":"256,696"},10.31,"BSE"]
["2023-03-29",543453,"ALKOSIGN","MANISHA ART JEWELLERS P LTD","BUY",{"v":30000,"d":"30,000"},76,"BSE"]
["2023-03-29",500023,"ASIANHOTNR","SHYAM JATIA FAMILY TRUST","BUY",{"v":100000,"d":"100,000"},99.95,"BSE"]
["2023-03-29",513642,"AXELPOLY","BHAVYA DHIMAN","BUY",{"v":49000,"d":"49,000"},39.87,"BSE"]
["2023-03-29",513642,"AXELPOLY","AKSHAY RAJENDRABHAI OSWAL","SELL",{"v":48999,"d":"48,999"},39.87,"BSE"]
["2023-03-29",543497,"BCCL","NNM SECURITIES PVT LTD","BUY",{"v":88000,"d":"88,000"},42.99,"BSE"]
["2023-03-29",543497,"BCCL","NNM SECURITIES PVT LTD","SELL",{"v":27200,"d":"27,200"},44.94,"BSE"]
["2023-03-29",543497,"BCCL","AMRUTLAL GORDHANDAS THOBHANI","SELL",{"v":84800,"d":"84,800"},43,"BSE"]
["2023-03-29",543831,"BRIGHT","MANISHA ART JEWELLERS P LTD","BUY",{"v":134000,"d":"134,000"},151.44,"BSE"]
["2023-03-29",543831,"BRIGHT","MANISHA ART JEWELLERS P LTD","SELL",{"v":8000,"d":"8,000"},152.02,"BSE"]
{"$rows_left_out":181}
{"sheet":"Call Tracker (Equity & F&O)","index":5,"n_rows":342,"n_cols":18,"rows_kept":342,"merged":[[66,0,67,0],[66,1,67,1],[66,6,67,6],[66,9,67,9],[66,13,67,13],[66,14,67,14],[66,15,67,15],[85,0,86,0],[85,1,86,1],[85,9,86,9],[85,12,86,12],[85,13,86,13],[85,14,86,14],[85,15,86,15]]}
[]
[]
[]
[]
[{"$nulls":12},"Back To Main Page"]
["Retail Research Technical Calls & Fundamental Performance Report for the month of Mar-2023"]
[{"$nulls":12},{"$f":"Main!B10","v":"2023-03-31"}]
[null,"Positional  Call"]
["Sr.no","Date",null,"Company","Rec","Rec Price","Stop Loss***","Call Closed At","Target","Remark","Profit / Loss per Share","All charges","Net Gain / Loss  %","Status","Closed Date","Market Closing Price"]
[1,"2022-12-01",null,"TCS","Buy<>",3380,3140,{"$f":"(3565+3140)/2","v":3352.5},"3800-4000","Loss of Rs.27.5/-",{"$f":"H10-F10","v":-27.5},{"$f":"(F10*-0.7)/100","v":-23.66},{"$f":"(K10+L10)/F10","v":{"v":-0.015136094674556212,"d":"-1.51%"}},"Unsuccessful","2023-03-20",null,null,"H"]
[2,"2023-01-10",null,"BHARTIARTL","Buy","780-800",735,null,"870-900","Open",{"$nulls":5},{"$f":"VLOOKUP(D11,'MidCap Intra'!B11:C511,2,0)","v":{"v":743.6,"d":"743.60"}},null,"H"]
[3,"2023-01-24",null,"KIMS","Buy",1435,1340,{"$f":"(1512.5+1324.5)/2","v":1418.5},"1580-1650","Loss of Rs.16.5/-",{"$f":"H12-F12","v":-16.5},{"$f":"(F12*-0.7)/100","v":{"v":-10.044999999999998,"d":"-10.05"}},{"$f":"(K12+L12)/F12","v":{"v":-0.01849825783972125,"d":"-1.85%"}},"Unsuccessful","2023-03-22",null,null,"N"]
[4,"2023-02-01",null,"AXISBANK","Accu","825-850",790,null,"900-950","Open",{"$nulls":5},{"$f":"VLOOKUP(D13,'MidCap Intra'!B13:C513,2,0)","v":{"v":842.6,"d":"842.60"}},null,"H"]
[5,"2023-02-06",null,"JSWSTEEL","Accu",706.25,660,660,"770-800","Loss of Rs.46.25/-",{"$f":"H14-F14","v":-46.25},{"$f":"(F14*-0.7)/100","v":{"v":-4.94375,"d":"-4.94"}},{"$f":"(K14+L14)/F14","v":{"v":-0.07248672566371682,"d":"-7.25%"}},"Unsuccessful","2023-03-27",null,null,"H"]
[6,"2023-02-16",null,"PIDILITIND","Accu",2280,2170,2395,"2450-2500","Profit of Rs.115/-",{"$f":"H15-F15","v":115},{"$f":"(F15*-0.7)/100","v":-15.96},{"$f":"(K15+L15)/F15","v":{"v":0.04343859649122807,"d":"4.34%"}},"Successful","2023-03-22",null,null,"H"]
[7,"2023-02-20",null,"SHARDACROP","Accu",462.5,425,null,"520-550","Open",{"$nulls":5},{"$f":"VLOOKUP(D16,'MidCap Intra'!B16:C516,2,0)","v":{"v":476.1,"d":"476.10"}},null,"H"]
[8,"2023-02-21",null,"CANBK","Accu",284.5,268,303.5,"315-335","Profit of Rs.19/-",{"$f":"H17-F17","v":19},{"$f":"(F17*-0.7)/100","v":{"v":-1.9914999999999998,"d":"-1.99"}},{"$f":"(K17+L17)/F17","v":{"v":0.05978383128295255,"d":"5.98%"}},"Successful","2023-03-03",null,null,"N"]
[9,"2023-02-21",null,"HAPPIESTMNDS","Accu",{"$f":"(865+899)/2","v":882},830,830,"960-1000","Loss of Rs.52/-",{"$f":"H18-F18","v":-52},{"$f":"(F18*-0.7)/100","v":{"v":-6.1739999999999995,"d":"-6.17"}},{"$f":"(K18+L18)/F18","v":{"v":-0.06595691609977324,"d":"-6.60%"}},"Unsuccessful","2023-03-15",null,null,"H"]
[10,"2023-02-24",null,"PIIND","Accu","3110-3010",2890,null,"3300-3400","Open",{"$nulls":5},{"$f":"VLOOKUP(D19,'MidCap Intra'!B19:C519,2,0)","v":{"v":2937.9,"d":"2937.90"}},null,"H"]
[11,"2023-02-27",null,"SBIN","Accu",522.5,478,554,"570-600","Profit of Rs.31.50/-",{"$f":"H20-F20","v":31.5},{"$f":"(F20*-0.7)/100","v":{"v":-3.6575,"d":"-3.66"}},{"$f":"(K20+L20)/F20","v":{"v":0.05328708133971292,"d":"5.33%"}},"Successful","2023-03-03",null,null,"H"]
{"$rows_left_out":322}