{"text_format":"3","workbook":"xlsx","n_sheets":11,"sheets":["Main","Future Intra","Cash Intra","MidCap Intra","Bulk Deals","Call Tracker (Equity & F&O)","Sheet2","Sheet1","Sheet3","Sheet4","Sheet5"],"not_rendered":{"images":4,"defined_names":5},"read":"whole","date_system":"1900"}

{"sheet":"Main","index":0,"n_rows":27,"n_cols":11,"rows_kept":27}
[null,"                                                                                                 "]
{"$rows_empty":8}
[null,"2020-01-02"]
[]
[null,"Sheet No.","Template Name","Summary"]
[null,1,"Future Intra","For Intraday trading in F&O segment"]
[null,2,"Cash Intra","For Intraday trading in cash market segment"]
[null,3,"Mid-cap Intra","For Intraday trading in Mid-cap stocks"]
[null,4,"Bulk Deals","Reveals Bulk Deals carried on NSE & BSE"]
[null,5,"Call Tracker"]
{"$rows_empty":9}
[{"$nulls":10},"`"]

{"sheet":"Future Intra","index":1,"n_rows":190,"n_cols":15,"rows_kept":190,"merged":[[8,0,9,0],[8,1,9,1],[8,2,9,2],[8,5,8,7],[8,8,8,10]]}
[]
[]
[]
[]
[{"$nulls":12},"Back to Main Page"]
["FOR INTRA DAY TRADING",{"$nulls":10},{"$f":"Main!B10","v":"2020-01-02"}]
[]
[]
["Sr.no","Sector","Scrip","CLOSE RATE","Pivot Point","Supports",null,null,"Resistances"]
[null,"Sector",null,"Point","Point","S1","S2","S3","R1","R2","R3","HIGH","LOW","OI","% Change in OI"]
[1,"Index","BANKNIFTY",{"v":32285.2,"d":"32285.20"},{"v":32335.316666666666,"d":"32335.32"},{"v":32174.88333333333,"d":"32174.88"},{"v":32064.566666666666,"d":"32064.57"},{"v":31904.13333333333,"d":"31904.13"},{"v":32445.63333333333,"d":"32445.63"},{"v":32606.066666666666,"d":"32606.07"},{"v":32716.38333333333,"d":"32716.38"},32495.75,32225,1338300,{"v":-3.8259989281248137E-3,"d":"-0.38%"}]
[2,"Index","NIFTY",{"v":12243.8,"d":"12243.80"},{"v":12246.483333333332,"d":"12246.48"},{"v":12223.366666666663,"d":"12223.37"},{"v":12202.93333333333,"d":"12202.93"},{"v":12179.816666666662,"d":"12179.82"},{"v":12266.916666666664,"d":"12266.92"},{"v":12290.033333333333,"d":"12290.03"},{"v":12310.466666666665,"d":"12310.47"},12269.6,12226.05,13055700,{"v":-0.018045409674234944,"d":"-1.80%"}]
[3,"Index","NIFTYIT",{"v":15750,"d":"15750.00"},{"v":15729.333333333334,"d":"15729.33"},{"v":15685.666666666668,"d":"15685.67"},{"v":15621.333333333334,"d":"15621.33"},{"v":15577.666666666668,"d":"15577.67"},{"v":15793.666666666668,"d":"15793.67"},{"v":15837.333333333336,"d":"15837.33"},{"v":15901.666666666668,"d":"15901.67"},15773,15665,5100,{"v":0.009900990099009901,"d":"0.99%"}]
[4,"Cement","ACC",{"v":1449.4,"d":"1449.40"},{"v":1453.5333333333335,"d":"1453.53"},{"v":1442.266666666667,"d":"1442.27"},{"v":1435.1333333333337,"d":"1435.13"},{"v":1423.8666666666672,"d":"1423.87"},{"v":1460.666666666667,"d":"1460.67"},{"v":1471.9333333333334,"d":"1471.93"},{"v":1479.0666666666668,"d":"1479.07"},1464.8,1446.4,3333600,{"v":0.01312910284463895,"d":"1.31%"}]
[5,"Others","ADANIENT",208.75,{"v":209.1833333333333,"d":"209.18"},{"v":206.86666666666662,"d":"206.87"},{"v":204.98333333333332,"d":"204.98"},{"v":202.66666666666663,"d":"202.67"},{"v":211.0666666666666,"d":"211.07"},{"v":213.38333333333327,"d":"213.38"},{"v":215.2666666666666,"d":"215.27"},211.5,207.3,28648000,{"v":0.009727900747215565,"d":"0.97%"}]
[6,"Others","ADANIPORTS",{"v":379.1,"d":"379.10"},{"v":375.8333333333333,"d":"375.83"},{"v":370.76666666666665,"d":"370.77"},{"v":362.43333333333334,"d":"362.43"},{"v":357.3666666666667,"d":"357.37"},{"v":384.16666666666663,"d":"384.17"},{"v":389.23333333333335,"d":"389.23"},{"v":397.5666666666666,"d":"397.57"},380.9,367.5,35910000,{"v":-0.027488151658767772,"d":"-2.75%"}]
[7,"Power","ADANIPOWER",{"v":64,"d":"64.00"},{"v":63.400000000000006,"d":"63.40"},{"v":62.250000000000014,"d":"62.25"},{"v":60.50000000000001,"d":"60.50"},{"v":59.350000000000016,"d":"59.35"},65.15,{"v":66.30000000000001,"d":"66.30"},{"v":68.05000000000001,"d":"68.05"},64.55,61.65,73690000,{"v":0.010559517279210093,"d":"1.06%"}]
[8,"Automobile","AMARAJABAT",725.25,{"v":728.5833333333334,"d":"728.58"},{"v":719.8666666666668,"d":"719.87"},{"v":714.4833333333335,"d":"714.48"},{"v":705.7666666666669,"d":"705.77"},{"v":733.9666666666667,"d":"733.97"},{"v":742.6833333333332,"d":"742.68"},{"v":748.0666666666666,"d":"748.07"},737.3,723.2,1416800,{"v":-0.006172839506172839,"d":"-0.62%"}]
[9,"Cement","AMBUJACEM",197.85,{"v":197.8166666666667,"d":"197.82"},{"v":196.73333333333338,"d":"196.73"},{"v":195.61666666666667,"d":"195.62"},{"v":194.53333333333336,"d":"194.53"},{"v":198.9333333333334,"d":"198.93"},{"v":200.0166666666667,"d":"200.02"},{"v":201.1333333333334,"d":"201.13"},198.9,196.7,18937500,{"v":-3.0271123979994734E-3,"d":"-0.30%"}]
[10,"Others","APOLLOHOSP",{"v":1434.1,"d":"1434.10"},{"v":1435.0166666666667,"d":"1435.02"},{"v":1428.1333333333332,"d":"1428.13"},{"v":1422.1666666666665,"d":"1422.17"},{"v":1415.283333333333,"d":"1415.28"},{"v":1440.9833333333333,"d":"1440.98"},{"v":1447.866666666667,"d":"1447.87"},{"v":1453.8333333333335,"d":"1453.83"},1441.9,1429.05,1622000,{"v":-0.01637355973317162,"d":"-1.64%"}]
{"$rows_left_out":156}
{"sheet":"Cash Intra","index":2,"n_rows":247,"n_cols":13,"rows_kept":247,"merged":[[7,0,8,0],[7,1,8,1],[7,2,8,2],[7,3,8,3],[7,4,7,6],[7,7,7,9]]}
[]
[]
[]
[]
[{"$nulls":12},"Back to Main Page"]
["FOR INTRA DAY TRADING",{"$nulls":9},{"$f":"Main!B10","v":"2020-01-02"}]
[]
["Sr.no","Scrip","CLOSE RATE","Pivot Point","Supports",null,null,"Resistances"]
[null,null,"Point",null,"S1","S2","S3","R1","R2","R3","HIGH","LOW","Total Trade Quanity in Lakhs"]
[1,"Nifty 50",12182.5,{"v":12190,"d":"12190.00"},{"v":12157.8,"d":"12157.80"},{"v":12133.099999999999,"d":"12133.10"},{"v":12100.899999999998,"d":"12100.90"},{"v":12214.7,"d":"12214.70"},{"v":12246.900000000001,"d":"12246.90"},{"v":12271.600000000002,"d":"12271.60"},12222.2,12165.3]
[2,"Nifty Bank",32102.9,{"v":32169.36666666667,"d":"32169.37"},{"v":31990.733333333337,"d":"31990.73"},{"v":31878.56666666667,"d":"31878.57"},{"v":31699.933333333338,"d":"31699.93"},{"v":32281.533333333336,"d":"32281.53"},{"v":32460.166666666668,"d":"32460.17"},{"v":32572.333333333336,"d":"32572.33"},32348,32057.2]
[3,"Nifty CPSE",1942.95,{"v":1939.5833333333333,"d":"1939.58"},{"v":1932.8166666666666,"d":"1932.82"},{"v":1922.6833333333334,"d":"1922.68"},{"v":1915.9166666666667,"d":"1915.92"},{"v":1949.7166666666665,"d":"1949.72"},{"v":1956.4833333333333,"d":"1956.48"},{"v":1966.6166666666663,"d":"1966.62"},1946.35,1929.45]
[4,"Nifty Infra",3263.25,{"v":3264.5499999999997,"d":"3264.55"},{"v":3255.4499999999994,"d":"3255.45"},{"v":3247.6499999999996,"d":"3247.65"},{"v":3238.5499999999993,"d":"3238.55"},{"v":3272.3499999999995,"d":"3272.35"},3281.45,{"v":3289.2499999999995,"d":"3289.25"},3273.65,3256.75]
[5,"Nifty IT",15722.15,{"v":15715.033333333335,"d":"15715.03"},{"v":15683.81666666667,"d":"15683.82"},{"v":15645.483333333335,"d":"15645.48"},{"v":15614.26666666667,"d":"15614.27"},{"v":15753.366666666669,"d":"15753.37"},{"v":15784.583333333332,"d":"15784.58"},{"v":15822.916666666668,"d":"15822.92"},15746.25,15676.7]
[6,"Nifty PSE",3245.5,{"v":3238.6666666666665,"d":"3238.67"},{"v":3227.833333333333,"d":"3227.83"},{"v":3210.1666666666665,"d":"3210.17"},{"v":3199.333333333333,"d":"3199.33"},{"v":3256.333333333333,"d":"3256.33"},{"v":3267.166666666666,"d":"3267.17"},{"v":3284.833333333333,"d":"3284.83"},3249.5,3221]
[7,"Nifty Midcap 50",4711.55,{"v":4709.783333333333,"d":"4709.78"},{"v":4694.816666666666,"d":"4694.82"},{"v":4678.083333333333,"d":"4678.08"},{"v":4663.116666666666,"d":"4663.12"},{"v":4726.5166666666655,"d":"4726.52"},{"v":4741.483333333333,"d":"4741.48"},{"v":4758.216666666665,"d":"4758.22"},4724.75,4693.05]
[8,"ACC",1440.1,{"v":1445.1000000000001,"d":"1445.10"},{"v":1433.2000000000003,"d":"1433.20"},{"v":1426.3000000000002,"d":"1426.30"},{"v":1414.4000000000003,"d":"1414.40"},{"v":1452.0000000000002,"d":"1452.00"},{"v":1463.9000000000003,"d":"1463.90"},{"v":1470.8000000000002,"d":"1470.80"},1457,1438.2,3.21092]
[9,"AUBANK",797.7,799.85,789.85,{"v":782,"d":"782.00"},{"v":772,"d":"772.00"},{"v":807.7,"d":"807.70"},{"v":817.7,"d":"817.70"},{"v":825.5500000000001,"d":"825.55"},809.85,792,0.89721]
[10,"ADANIPORTS",377.65,{"v":374.3,"d":"374.30"},369.35,361.05,{"v":356.1,"d":"356.10"},{"v":382.6,"d":"382.60"},{"v":387.54999999999995,"d":"387.55"},395.85,379.25,366,113.77167]
[11,"ADANIPOWER",63.9,63.25,{"v":62.2,"d":"62.20"},{"v":60.5,"d":"60.50"},59.45,64.95,{"v":66,"d":"66.00"},{"v":67.7,"d":"67.70"},64.3,61.55,164.15397]
{"$rows_left_out":228}
{"sheet":"MidCap Intra","index":3,"n_rows":545,"n_cols":13,"rows_kept":545,"merged":[[0,0,0,1],[8,0,9,0],[8,1,9,1],[8,2,9,2],[8,3,9,3],[8,4,8,6],[8,7,8,9]]}
[]
[]
[]
[]
[{"$nulls":11},"Back To Main Page"]
["FOR INTRA DAY TRADING",{"$nulls":9},{"$f":"Main!B10","v":"2020-01-02"}]
[null,null," "]
[]
["Sr.no","Scrip","CLOSE RATE","Pivot Point","Supports",null,null,"Resistances"]
[null,null,"Point",null,"S1","S2","S3","R1","R2","R3","HIGH","LOW","Total Trade Quanity in Lakhs"]
[1,"3MINDIA",21721.95,{"v":21630.56666666667,"d":"21630.57"},{"v":21440.233333333337,"d":"21440.23"},{"v":21158.516666666666,"d":"21158.52"},{"v":20968.183333333334,"d":"20968.18"},{"v":21912.28333333334,"d":"21912.28"},{"v":22102.616666666676,"d":"22102.62"},{"v":22384.333333333343,"d":"22384.33"},21820.9,21348.85,0.00773]
[2,"ACC",1440.1,{"v":1445.1000000000001,"d":"1445.10"},{"v":1433.2000000000003,"d":"1433.20"},{"v":1426.3000000000002,"d":"1426.30"},{"v":1414.4000000000003,"d":"1414.40"},{"v":1452.0000000000002,"d":"1452.00"},{"v":1463.9000000000003,"d":"1463.90"},{"v":1470.8000000000002,"d":"1470.80"},1457,1438.2,3.21092]
[3,"AIAENG",1622.6,{"v":1629.0833333333333,"d":"1629.08"},{"v":1608.6166666666666,"d":"1608.62"},{"v":1594.6333333333332,"d":"1594.63"},{"v":1574.1666666666665,"d":"1574.17"},{"v":1643.0666666666666,"d":"1643.07"},{"v":1663.5333333333333,"d":"1663.53"},{"v":1677.5166666666667,"d":"1677.52"},1649.55,1615.1,0.03912]
[4,"APLAPOLLO",1892.8,{"v":1901.2666666666667,"d":"1901.27"},{"v":1863.5333333333333,"d":"1863.53"},{"v":1834.2666666666667,"d":"1834.27"},{"v":1796.5333333333333,"d":"1796.53"},{"v":1930.5333333333333,"d":"1930.53"},{"v":1968.2666666666664,"d":"1968.27"},{"v":1997.5333333333333,"d":"1997.53"},1939,1872,0.70001]
[5,"AUBANK",797.7,799.85,789.85,{"v":782,"d":"782.00"},{"v":772,"d":"772.00"},{"v":807.7,"d":"807.70"},{"v":817.7,"d":"817.70"},{"v":825.5500000000001,"d":"825.55"},809.85,792,0.89721]
[6,"AAVAS",1969.2,{"v":1964.0666666666666,"d":"1964.07"},{"v":1930.1333333333332,"d":"1930.13"},{"v":1891.0666666666666,"d":"1891.07"},{"v":1857.1333333333332,"d":"1857.13"},{"v":2003.1333333333332,"d":"2003.13"},{"v":2037.0666666666666,"d":"2037.07"},{"v":2076.133333333333,"d":"2076.13"},1998,1925,0.45666]
[7,"ABBOTINDIA",13140,{"v":13224.050000000001,"d":"13224.05"},{"v":12995.950000000003,"d":"12995.95"},{"v":12851.900000000001,"d":"12851.90"},{"v":12623.800000000003,"d":"12623.80"},{"v":13368.100000000002,"d":"13368.10"},{"v":13596.2,"d":"13596.20"},{"v":13740.250000000002,"d":"13740.25"},13452.15,13080,0.04037]
[8,"ADANIGAS",176.85,{"v":172.31666666666663,"d":"172.32"},{"v":164.93333333333328,"d":"164.93"},{"v":153.01666666666665,"d":"153.02"},{"v":145.6333333333333,"d":"145.63"},{"v":184.23333333333326,"d":"184.23"},{"v":191.61666666666665,"d":"191.62"},{"v":203.53333333333325,"d":"203.53"},179.7,160.4,78.01084]
[9,"ADANIGREEN",174.75,{"v":172.53333333333333,"d":"172.53"},{"v":170.31666666666666,"d":"170.32"},{"v":165.88333333333333,"d":"165.88"},{"v":163.66666666666666,"d":"163.67"},{"v":176.96666666666667,"d":"176.97"},{"v":179.1833333333333,"d":"179.18"},{"v":183.61666666666667,"d":"183.62"},174.75,168.1,54.17952]
[10,"ADANIPORTS",377.65,{"v":374.3,"d":"374.30"},369.35,361.05,{"v":356.1,"d":"356.10"},{"v":382.6,"d":"382.60"},{"v":387.54999999999995,"d":"387.55"},395.85,379.25,366,113.77167]
{"$rows_left_out":513}
{"sheet":"Bulk Deals","index":4,"n_rows":52,"n_cols":8,"rows_kept":52,"merged":[[4,0,4,1],[4,2,4,3],[6,1,6,2]]}
[" "]
[]
[]
[]
[]
[{"$nulls":4},"Back To Main Page"]
["Subject :","BULK DEAL",null,{"$f":"Main!B10","v":"2020-01-02"}]
[]
["Date","Scrip code","Scrip Name","Client Name","Buy / Sell","Quantity Traded","Trade Price / Wt.Avg.trade price","Exchange  "]
["2020-01-01",531813,"GANGAPA","GOURI KUMAR PRUSTY","SELL",{"v":86000,"d":"86,000"},23.25,"BSE"]
["2020-01-01",541627,"HITECHWIND","LALIT AMRUTLAL GEDIYA","SELL",{"v":25000,"d":"25,000"},{"v":24.5,"d":"24.50"},"BSE"]
["2020-01-01",541627,"HITECHWIND","MUKESH AJMERA","SELL",{"v":49266,"d":"49,266"},24.5,"BSE"]
["2020-01-01",541627,"HITECHWIND","GODHAR RAJENDRA GANGARAM","BUY",{"v":25000,"d":"25,000"},24.5,"BSE"]
["2020-01-01",539097,"HKG","SUMIT KUMAR GUPTA","SELL",{"v":20000,"d":"20,000"},43,"BSE"]
["2020-01-01",535387,"LAKHOTIA","VAISHNO MEDIA GRAPHIX PRIVATE LIMITED","BUY",{"v":100000,"d":"100,000"},8.84,"BSE"]
["2020-01-01",535387,"LAKHOTIA","MANJU LAHOTI","BUY",{"v":110000,"d":"110,000"},8.84,"BSE"]
["2020-01-01",535387,"LAKHOTIA","INTENSIVE FINANCE PRIVATE LIMITED","SELL",{"v":210000,"d":"210,000"},8.84,"BSE"]
["2020-01-01",532256,"NSIL","PRITI RAJIV JOSHI","BUY",{"v":88665,"d":"88,665"},{"v":700,"d":"700.00"},"BSE"]
["2020-01-01",532256,"NSIL","ANIL ARYA","SELL",{"v":91997,"d":"91,997"},700.04,"BSE"]
["2020-01-01",512217,"PRISMMEDI","BHAVNA NARENDRA CHITALIA","SELL",{"v":65400,"d":"65,400"},20.35,"BSE"]
{"$rows_left_out":33}
{"sheet":"Call Tracker (Equity & F&O)","index":5,"n_rows":267,"n_cols":18,"rows_kept":267,"merged":[[73,0,74,0],[73,1,74,1],[73,9,74,9],[73,11,74,11],[73,12,74,12],[73,13,74,13],[73,14,74,14],[83,0,84,0],[83,1,84,1],[83,9,84,9],[83,11,84,11],[83,12,84,12],[83,13,84,13],[83,14,84,14],[87,0,88,0],[87,1,88,1],[87,9,88,9],[87,11,88,11],[87,12,88,12],[87,13,88,13],[87,14,88,14],[89,0,90,0],[89,1,90,1],[89,9,90,9],[89,11,90,11],[89,12,90,12],[89,13,90,13],[89,14,90,14],[91,0,92,0],[91,1,92,1],[91,9,92,9],[91,11,92,11],[91,12,92,12],[91,13,92,13],[91,14,92,14],[93,0,94,0],[93,1,94,1],[93,9,94,9],[93,11,94,11],[93,12,94,12],[93,13,94,13],[93,14,94,14],[95,0,96,0],[95,1,96,1],[95,9,96,9],[95,11,96,11],[95,12,96,12],[95,13,96,13],[95,14,96,14]]}
[]
[]
[]
[]
[{"$nulls":12},"Back To Main Page"]
["Retail Research Technical Calls & Fundamental Performance Report for the month of January-2020 "]
[{"$nulls":12},{"$f":"Main!B10","v":"2020-01-02"}]
[null,"Positional  Call"]
["Sr.no","Date",null,"Company","Rec","Rec Price","Stop Loss***","Call Closed At","Target","Remark","Profit / Loss per Share","Gain / Loss  %","Status","Closed Date","NSE Closed Price"]
[1,"2019-10-07",null,"PIDILITIND","Buy{}",1367.5,1297,1413.5,"1500-1520","Part Profit of Rs.46/-",{"$f":"H10-F10","v":46},{"$f":"K10/F10","v":{"v":0.03363802559414991,"d":"3.36%"}},"Successful","2019-10-31",{"$f":"VLOOKUP(D10,Sheet2!A51:M1690,6,0)","v":1405.35},null,null,"R"]
[2,"2019-11-14",null,"HEIDELBERG","Buy{}",186.5,174,194.5,"205-210","Part Profit of Rs.8/-",{"$f":"H11-F11","v":8},{"$f":"K11/F11","v":{"v":0.04289544235924933,"d":"4.29%"}},"Successful","2019-11-20",{"$f":"VLOOKUP(D11,Sheet2!A71:M1710,6,0)","v":174.95},null,null,"H"]
[3,"2019-11-18",null,"BAJAJ-AUTO","Sell","3180-3200",3356.7,null,"2900-2850","Open",{"$nulls":4},{"$f":"VLOOKUP(D12,Sheet2!A74:M1713,6,0)","v":3150.1},null,null,"R"]
[4,"2019-11-20",null,"BRITANNIA","Buy","3075-3100",2930,null,"3380-3420","Open",{"$nulls":4},{"$f":"VLOOKUP(D13,Sheet2!A76:M1715,6,0)","v":3039.65},null,null,"H"]
[5,"2019-11-21",null,"HINDUNILVR","Buy",2020,1917,2082,"2200-2250","Part Profit of Rs.62/-",{"$f":"H14-F14","v":62},{"$f":"K14/F14","v":{"v":0.030693069306930693,"d":"3.07%"}},"Successful","2019-11-27",{"$f":"VLOOKUP(D14,Sheet2!A77:M1716,6,0)","v":1936.55},null,null,"H"]
[6,"2019-11-27",null,"LT","Buy","1330-1340",1270,null,"1450-1500","Open",{"$nulls":4},{"$f":"VLOOKUP(D15,Sheet2!A80:M1719,6,0)","v":1309.95},null,null,"H"]
[7,"2019-12-02",null,"HAVELLS","Buy","662-667",632.7,null,"725-735","Open",{"$nulls":4},{"$f":"VLOOKUP(D16,Sheet2!A82:M1721,6,0)","v":649.5},null,null,"R"]
[8,"2019-12-06",null,"ONGC","Buy","127-128",122,null,140,"Open",{"$nulls":4},{"$f":"VLOOKUP(D17,Sheet2!A83:M1722,6,0)","v":127.45},null,null,"H"]
[9,"2019-12-23",null,"CANBK","Sell",227,238.3,220,"216-213","Part Profit of Rs.7/-",{"$f":"F18-H18","v":7},{"$f":"K18/F18","v":{"v":0.030837004405286344,"d":"3.08%"}},"Successful","2019-12-26",{"$f":"VLOOKUP(D18,Sheet2!A88:M1727,6,0)","v":221.65},null,null,"R"]
[10,"2019-12-24",null,"SBIN","Sell","333-335",351.3,null,"305-300","Open",{"$nulls":4},{"$f":"VLOOKUP(D19,Sheet2!A92:M1731,6,0)","v":334.45},null,null,"R"]
[11,"2019-12-30",null,"EIHOTEL","Buy",140,132,145.5,"152-156","Part Profit of Rs.5.50/-",{"$f":"H20-F20","v":5.5},{"$f":"K20/F20","v":{"v":0.039285714285714285,"d":"3.93%"}},"Successful","2020-01-01",{"$f":"VLOOKUP(D20,Sheet2!A90:M1729,6,0)","v":143.55},null,null,"H"]
{"$rows_left_out":222}
{"sheet":"Sheet2","index":6,"n_rows":1899,"n_cols":14,"rows_kept":1899,"hidden":true}
["SYMBOL","SERIES","OPEN","HIGH","LOW","CLOSE","LAST","PREVCLOSE","TOTTRDQTY","TOTTRDVAL","TIMESTAMP","TOTALTRADES","ISIN","ISIN"]
["20MICRONS","EQ",36,36.8,35.25,35.8,35.65,35.2,49077,1764577.1,"2020-01-01",370,"INE144J01027"]
["3IINFOTECH","EQ",2,2.05,1.95,2,2.05,1.95,800982,1595812.95,"2020-01-01",356,"INE748C01020"]
["3MINDIA","EQ",21350.7,21820.9,21348.85,21721.95,21750,21304.7,773,16728527.5,"2020-01-01",445,"INE470A01017"]
["3PLAND","EQ",6,6,6,6,6,6,167,1002,"2020-01-01",3,"INE105C01023"]
["5PAISA","EQ",192.05,211.75,192.05,205.5,206,192.5,107432,22267590.2,"2020-01-01",2576,"INE618L01018"]
["63MOONS","EQ",101.1,115,101.1,110.4,110.15,101.8,731910,81111723.9,"2020-01-01",13777,"INE111B01023"]
["A2ZINFRA","EQ",7.65,8.1,7.5,7.75,7.65,7.55,298173,2305045.9,"2020-01-01",470,"INE619I01012"]
["AARTIDRUGS","EQ",579.3,598.4,575.55,591.9,592,579.3,13121,7754724.4,"2020-01-01",1183,"INE767A01016"]
["AARTIIND","EQ",836,843,831.1,837.8,838.7,830.75,87969,73651321.35,"2020-01-01",2841,"INE769A01020"]
["AARVEEDEN","EQ",14,14.45,13.8,13.9,14.15,14,4874,68535.8,"2020-01-01",46,"INE273D01019"]
["AAVAS","EQ",1981.1,1998,1925,1969.2,1961,1981.1,45666,89371663.8,"2020-01-01",4459,"INE216P01012"]
["ABAN","EQ",26,26.15,25.25,25.55,25.6,25.7,36475,937716.05,"2020-01-01",746,"INE421A01028"]
["ABB","BE",1296.95,1296.95,1275,1290,1290,1285.25,6827,8763641.95,"2020-01-01",447,"INE117A01022"]
["ABBOTINDIA","EQ",13170.6,13452.15,13080,13140,13119.95,13075.5,4037,53288258.35,"2020-01-01",1399,"INE358A01014"]
["ABCAPITAL","EQ",103.2,103.4,101.2,101.5,101.35,102.7,982667,100300618.75,"2020-01-01",9428,"INE674K01013"]
["ABFRL","EQ",232.9,236.85,230.15,234.1,232.85,231.7,241005,56532884.85,"2020-01-01",4836,"INE647O01011"]
["ABMINTLTD","BE",14.75,14.75,14.75,14.75,14.75,14.75,105,1548.75,"2020-01-01",3,"INE251C01017"]
["ABSLBANETF","EQ",321.57,321.57,321.57,321.57,321.57,322.97,1,321.57,"2020-01-01",1,"INF209KB1O58"]
["ABSLNN50ET","EQ",286.87,286.87,286.87,286.87,286.87,286.31,6,1721.22,"2020-01-01",1,"INF209KB1B87"]
{"$rows_left_out":1699}
{"sheet":"Sheet1","index":7,"n_rows":0,"n_cols":0,"rows_kept":0,"hidden":true}

{"sheet":"Sheet3","index":8,"n_rows":0,"n_cols":0,"rows_kept":0,"hidden":true}

{"sheet":"Sheet4","index":9,"n_rows":0,"n_cols":0,"rows_kept":0,"hidden":true}

{"sheet":"Sheet5","index":10,"n_rows":0,"n_cols":0,"rows_kept":0,"hidden":true}