{"text_format":"3","workbook":"xlsx","n_sheets":6,"sheets":["Main","Future Intra","Cash Intra","MidCap Intra","Bulk Deals","Call Tracker (Equity & F&O)"],"not_rendered":{"images":4,"defined_names":1},"read":"whole","date_system":"1900"}

{"sheet":"Main","index":0,"n_rows":27,"n_cols":11,"rows_kept":27}
[null,"                                                                                                 "]
[]
[]
[]
[]
[{"$nulls":6}," "]
[]
[]
[]
[null,"2023-11-01"]
[]
[null,"Sheet No.","Template Name","Summary"]
[null,1,"Future Intra","For Intraday trading in F&O segment"]
[null,2,"Cash Intra","For Intraday trading in cash market segment"]
[null,3,"Mid-cap Intra","For Intraday trading in Mid-cap stocks"]
[null,4,"Bulk Deals","Reveals Bulk Deals carried on NSE & BSE"]
[null,5,"Call Tracker"]
{"$rows_empty":9}
[{"$nulls":10},"`"]

{"sheet":"Future Intra","index":1,"n_rows":236,"n_cols":16,"rows_kept":236,"merged":[[8,0,9,0],[8,1,9,1],[8,2,9,2],[8,3,9,3],[8,6,8,8],[8,9,8,11]]}
[]
[]
[]
[]
[{"$nulls":12},"Back to Main Page"]
["FOR INTRA DAY TRADING",{"$nulls":10},{"$f":"Main!B10","v":"2023-11-01"}]
[]
[]
["Sr.no","Sector","Scrip","Expiry Date","CLOSE RATE","Pivot Point","Supports",null,null,"Resistances"]
[{"$nulls":4},"Point","Point","S1","S2","S3","R1","R2","R3","HIGH","LOW","OI","% Change in OI"]
[1,"Index","NIFTY","2023-11-30",{"v":19158.2,"d":"19158.20"},{"v":19185.733333333334,"d":"19185.73"},{"v":19092.466666666667,"d":"19092.47"},{"v":19026.733333333334,"d":"19026.73"},{"v":18933.466666666667,"d":"18933.47"},{"v":19251.466666666667,"d":"19251.47"},{"v":19344.733333333337,"d":"19344.73"},{"v":19410.466666666667,"d":"19410.47"},19279,19120,11982750,{"v":0.01602974469420114,"d":"1.60%"}]
[2,"Index","BANKNIFTY","2023-11-30",43076.85,{"v":43233.43333333333,"d":"43233.43"},{"v":42863.81666666665,"d":"42863.82"},{"v":42650.783333333326,"d":"42650.78"},{"v":42281.16666666665,"d":"42281.17"},{"v":43446.46666666665,"d":"43446.47"},{"v":43816.083333333336,"d":"43816.08"},{"v":44029.116666666654,"d":"44029.12"},43603.05,43020.4,2644890,{"v":1.6587704647965734E-3,"d":"0.17%"}]
[3,"Index","FINNIFTY","2023-11-28",{"v":19340.5,"d":"19340.50"},{"v":19368.483333333334,"d":"19368.48"},{"v":19287.016666666666,"d":"19287.02"},{"v":19233.533333333333,"d":"19233.53"},{"v":19152.066666666666,"d":"19152.07"},{"v":19421.966666666667,"d":"19421.97"},{"v":19503.433333333334,"d":"19503.43"},{"v":19556.916666666668,"d":"19556.92"},19449.95,19315,157560,{"v":0.6117021276595744,"d":"61.17%"}]
[4,"Index","MIDCPNIFTY","2023-11-24",{"v":8722.5,"d":"8722.50"},{"v":8719.733333333334,"d":"8719.73"},{"v":8671.016666666666,"d":"8671.02"},{"v":8619.533333333333,"d":"8619.53"},{"v":8570.816666666666,"d":"8570.82"},{"v":8771.216666666667,"d":"8771.22"},{"v":8819.933333333334,"d":"8819.93"},{"v":8871.416666666668,"d":"8871.42"},8768.45,8668.25,658650,{"v":-0.33740757507167646,"d":"-33.74%"}]
[5,"Chemical","AARTIIND","2023-11-30",{"v":457.4,"d":"457.40"},{"v":459.2,"d":"459.20"},{"v":454.79999999999995,"d":"454.80"},{"v":452.2,"d":"452.20"},{"v":447.79999999999995,"d":"447.80"},{"v":461.79999999999995,"d":"461.80"},{"v":466.19999999999993,"d":"466.20"},{"v":468.79999999999995,"d":"468.80"},463.6,456.6,14928000,{"v":0.014612927343165908,"d":"1.46%"}]
[6,"Capital_Goods","ABB","2023-11-30",4133.25,{"v":4113.016666666666,"d":"4113.02"},{"v":4075.9833333333327,"d":"4075.98"},{"v":4018.7166666666662,"d":"4018.72"},{"v":3981.6833333333325,"d":"3981.68"},{"v":4170.283333333333,"d":"4170.28"},{"v":4207.316666666666,"d":"4207.32"},{"v":4264.583333333333,"d":"4264.58"},4150.05,4055.75,1412125,{"v":0.06746669186431069,"d":"6.75%"}]
[7,"Pharma","ABBOTINDIA","2023-11-30",{"v":22498.8,"d":"22498.80"},{"v":22551.233333333334,"d":"22551.23"},{"v":22386.916666666668,"d":"22386.92"},{"v":22275.033333333333,"d":"22275.03"},{"v":22110.716666666667,"d":"22110.72"},{"v":22663.11666666667,"d":"22663.12"},{"v":22827.433333333334,"d":"22827.43"},{"v":22939.31666666667,"d":"22939.32"},22715.55,22439.35,70840,{"v":-2.2535211267605635E-3,"d":"-0.23%"}]
[8,"Others","ABCAPITAL","2023-11-30",173.65,{"v":174.11666666666667,"d":"174.12"},{"v":171.83333333333334,"d":"171.83"},{"v":170.01666666666668,"d":"170.02"},{"v":167.73333333333335,"d":"167.73"},{"v":175.93333333333334,"d":"175.93"},{"v":178.21666666666664,"d":"178.22"},{"v":180.03333333333333,"d":"180.03"},176.4,172.3,43745400,{"v":0.025313251487153524,"d":"2.53%"}]
[9,"Textile","ABFRL","2023-11-30",214.65,{"v":215.4,"d":"215.40"},212.65,210.65,{"v":207.9,"d":"207.90"},{"v":217.4,"d":"217.40"},220.15,222.15,218.15,213.4,32448000,{"v":-0.011406844106463879,"d":"-1.14%"}]
[10,"Cement","ACC","2023-11-30",1896.75,{"v":1898.1333333333332,"d":"1898.13"},{"v":1886.6666666666665,"d":"1886.67"},{"v":1876.5833333333333,"d":"1876.58"},{"v":1865.1166666666666,"d":"1865.12"},{"v":1908.2166666666665,"d":"1908.22"},{"v":1919.6833333333332,"d":"1919.68"},{"v":1929.7666666666664,"d":"1929.77"},1909.6,1888.05,5402100,{"v":5.5537043207819613E-5,"d":"0.01%"}]
{"$rows_left_out":202}
{"sheet":"Cash Intra","index":2,"n_rows":245,"n_cols":13,"rows_kept":245,"merged":[[7,0,8,0],[7,1,8,1],[7,2,8,2],[7,3,8,3],[7,4,7,6],[7,7,7,9]]}
[]
[]
[]
[]
[{"$nulls":12},"Back to Main Page"]
["FOR INTRA DAY TRADING",{"$nulls":9},{"$f":"Main!B10","v":"2023-11-01"}]
[]
["Sr.no",null,"CLOSE RATE","Pivot Point","Supports",null,null,"Resistances"]
[{"$nulls":4},"S1","S2","S3","R1","R2","R3","HIGH","LOW","Total Trade Quanity in Lakhs"]
[1,"Nifty 50",{"v":19079.6,"d":"19079.60"},19123.25,{"v":19012.8,"d":"19012.80"},{"v":18946,"d":"18946.00"},18835.55,19190.05,{"v":19300.499999999996,"d":"19300.50"},{"v":19367.3,"d":"19367.30"},{"v":19233.7,"d":"19233.70"},19056.45]
[2,"Nifty Bank",42845.95,{"v":42999.98333333333,"d":"42999.98"},{"v":42643.11666666666,"d":"42643.12"},{"v":42440.28333333333,"d":"42440.28"},{"v":42083.416666666664,"d":"42083.42"},{"v":43202.81666666666,"d":"43202.82"},{"v":43559.68333333333,"d":"43559.68"},{"v":43762.516666666656,"d":"43762.52"},43356.85,42797.15]
[3,"Nifty CPSE",3882.45,{"v":3882.433333333333,"d":"3882.43"},{"v":3862.416666666666,"d":"3862.42"},{"v":3842.383333333333,"d":"3842.38"},{"v":3822.3666666666663,"d":"3822.37"},{"v":3902.466666666666,"d":"3902.47"},{"v":3922.483333333333,"d":"3922.48"},{"v":3942.5166666666655,"d":"3942.52"},3902.45,{"v":3862.4,"d":"3862.40"}]
[4,"Nifty Infra",{"v":6095.4,"d":"6095.40"},{"v":6102.016666666667,"d":"6102.02"},{"v":6072.4833333333345,"d":"6072.48"},{"v":6049.5666666666675,"d":"6049.57"},{"v":6020.033333333335,"d":"6020.03"},{"v":6124.933333333334,"d":"6124.93"},{"v":6154.466666666667,"d":"6154.47"},{"v":6177.383333333334,"d":"6177.38"},6131.55,{"v":6079.1,"d":"6079.10"}]
[5,"Nifty IT",30582.25,{"v":30582.5,"d":"30582.50"},{"v":30395.8,"d":"30395.80"},30209.35,{"v":30022.649999999998,"d":"30022.65"},30768.95,{"v":30955.649999999998,"d":"30955.65"},{"v":31142.100000000002,"d":"31142.10"},{"v":30769.2,"d":"30769.20"},30396.05]
[6,"Nifty PSE",{"v":5887.4,"d":"5887.40"},{"v":5873.933333333333,"d":"5873.93"},{"v":5847.616666666667,"d":"5847.62"},{"v":5807.833333333333,"d":"5807.83"},{"v":5781.516666666666,"d":"5781.52"},{"v":5913.716666666667,"d":"5913.72"},{"v":5940.033333333335,"d":"5940.03"},{"v":5979.8166666666675,"d":"5979.82"},5900.25,5834.15]
[7,"Nifty Midcap 50",11068.85,{"v":11063.783333333333,"d":"11063.78"},{"v":11020.066666666666,"d":"11020.07"},{"v":10971.283333333333,"d":"10971.28"},{"v":10927.566666666666,"d":"10927.57"},{"v":11112.566666666666,"d":"11112.57"},{"v":11156.283333333333,"d":"11156.28"},{"v":11205.066666666666,"d":"11205.07"},{"v":11107.5,"d":"11107.50"},{"v":11015,"d":"11015.00"}]
[8,"ABB",4109.3,{"v":4087.7166666666667,"d":"4087.72"},{"v":4050.4333333333334,"d":"4050.43"},{"v":3991.5666666666666,"d":"3991.57"},{"v":3954.2833333333333,"d":"3954.28"},{"v":4146.583333333334,"d":"4146.58"},{"v":4183.866666666667,"d":"4183.87"},{"v":4242.733333333334,"d":"4242.73"},4125,4028.85,2.05697]
[9,"ABBOTINDIA",22413.65,{"v":22462.850000000002,"d":"22462.85"},{"v":22308.850000000006,"d":"22308.85"},{"v":22204.050000000003,"d":"22204.05"},{"v":22050.050000000007,"d":"22050.05"},{"v":22567.650000000005,"d":"22567.65"},{"v":22721.649999999998,"d":"22721.65"},{"v":22826.450000000004,"d":"22826.45"},22616.85,22358.05,0.05232]
[10,"ABCAPITAL",172.45,{"v":173,"d":"173.00"},{"v":170.7,"d":"170.70"},168.95,{"v":166.64999999999998,"d":"166.65"},174.75,177.05,{"v":178.8,"d":"178.80"},175.3,171.25,31.73997]
[11,"ABFRL",214.75,{"v":215.98333333333335,"d":"215.98"},{"v":212.8166666666667,"d":"212.82"},{"v":210.88333333333335,"d":"210.88"},{"v":207.7166666666667,"d":"207.72"},{"v":217.91666666666669,"d":"217.92"},{"v":221.08333333333331,"d":"221.08"},{"v":223.01666666666668,"d":"223.02"},219.15,214.05,30.19234]
{"$rows_left_out":226}
{"sheet":"MidCap Intra","index":3,"n_rows":530,"n_cols":13,"rows_kept":530,"merged":[[0,0,0,1],[8,0,9,0],[8,1,9,1],[8,2,9,2],[8,3,9,3],[8,4,8,6],[8,7,8,9]]}
[]
[]
[]
[]
[{"$nulls":11},"Back To Main Page"]
["FOR INTRA DAY TRADING",{"$nulls":9},{"$f":"Main!B10","v":"2023-11-01"}]
[null,null," "]
[]
["Sr.no","Scrip","CLOSE RATE","Pivot Point","Supports",null,null,"Resistances"]
[{"$nulls":4},"S1","S2","S3","R1","R2","R3","HIGH","LOW","Total Trade Quanity in Lakhs"]
[1,"360ONE",525.1,{"v":524.5333333333333,"d":"524.53"},{"v":518.7166666666666,"d":"518.72"},{"v":512.3333333333333,"d":"512.33"},{"v":506.51666666666654,"d":"506.52"},{"v":530.9166666666666,"d":"530.92"},{"v":536.7333333333332,"d":"536.73"},{"v":543.1166666666667,"d":"543.12"},530.35,518.15,3.69884]
[2,"3MINDIA",29762.7,{"v":29710.88333333333,"d":"29710.88"},{"v":29551.816666666662,"d":"29551.82"},{"v":29340.93333333333,"d":"29340.93"},{"v":29181.86666666666,"d":"29181.87"},{"v":29921.766666666663,"d":"29921.77"},{"v":30080.83333333333,"d":"30080.83"},{"v":30291.716666666664,"d":"30291.72"},29869.95,29500,0.01045]
[3,"AARTIDRUGS",469.45,{"v":469.4166666666667,"d":"469.42"},{"v":465.83333333333337,"d":"465.83"},{"v":462.2166666666667,"d":"462.22"},{"v":458.6333333333334,"d":"458.63"},{"v":473.03333333333336,"d":"473.03"},{"v":476.61666666666673,"d":"476.62"},{"v":480.23333333333335,"d":"480.23"},473,465.8,1.25225]
[4,"AARTIIND",454.45,{"v":456.4166666666667,"d":"456.42"},{"v":451.1333333333334,"d":"451.13"},{"v":447.8166666666667,"d":"447.82"},{"v":442.5333333333334,"d":"442.53"},{"v":459.73333333333335,"d":"459.73"},{"v":465.01666666666665,"d":"465.02"},{"v":468.3333333333333,"d":"468.33"},461.7,453.1,5.64116]
[5,"AAVAS",1407.8,{"v":1423.6500000000003,"d":"1423.65"},{"v":1387.3000000000006,"d":"1387.30"},{"v":1366.8000000000004,"d":"1366.80"},{"v":1330.4500000000007,"d":"1330.45"},{"v":1444.1500000000005,"d":"1444.15"},{"v":1480.5000000000005,"d":"1480.50"},{"v":1501.0000000000005,"d":"1501.00"},1460,1403.15,4.92788]
[6,"ABB",4109.3,{"v":4087.7166666666667,"d":"4087.72"},{"v":4050.4333333333334,"d":"4050.43"},{"v":3991.5666666666666,"d":"3991.57"},{"v":3954.2833333333333,"d":"3954.28"},{"v":4146.583333333334,"d":"4146.58"},{"v":4183.866666666667,"d":"4183.87"},{"v":4242.733333333334,"d":"4242.73"},4125,4028.85,2.05697]
[7,"ABBOTINDIA",22413.65,{"v":22462.850000000002,"d":"22462.85"},{"v":22308.850000000006,"d":"22308.85"},{"v":22204.050000000003,"d":"22204.05"},{"v":22050.050000000007,"d":"22050.05"},{"v":22567.650000000005,"d":"22567.65"},{"v":22721.649999999998,"d":"22721.65"},{"v":22826.450000000004,"d":"22826.45"},22616.85,22358.05,0.05232]
[8,"ACC",1888.2,{"v":1891.3166666666666,"d":"1891.32"},{"v":1878.9333333333332,"d":"1878.93"},{"v":1869.6666666666665,"d":"1869.67"},{"v":1857.283333333333,"d":"1857.28"},{"v":1900.5833333333333,"d":"1900.58"},{"v":1912.9666666666665,"d":"1912.97"},{"v":1922.2333333333333,"d":"1922.23"},1903.7,1882.05,1.17831]
[9,"ADANIENT",2294.65,{"v":2296.883333333333,"d":"2296.88"},{"v":2273.7666666666664,"d":"2273.77"},{"v":2252.883333333333,"d":"2252.88"},{"v":2229.7666666666664,"d":"2229.77"},{"v":2317.7666666666664,"d":"2317.77"},{"v":2340.883333333333,"d":"2340.88"},{"v":2361.7666666666664,"d":"2361.77"},2320,2276,11.5528]
[10,"ADANIGREEN",911.65,{"v":916.3333333333334,"d":"916.33"},{"v":899.3166666666667,"d":"899.32"},{"v":886.9833333333333,"d":"886.98"},{"v":869.9666666666667,"d":"869.97"},{"v":928.6666666666667,"d":"928.67"},{"v":945.6833333333334,"d":"945.68"},{"v":958.0166666666668,"d":"958.02"},933.35,904,7.13136]
{"$rows_left_out":511}
{"sheet":"Bulk Deals","index":4,"n_rows":166,"n_cols":8,"rows_kept":166,"merged":[[4,0,4,1],[4,2,4,3],[6,1,6,2]]}
[" "]
[]
[]
[]
[]
[{"$nulls":4},"Back To Main Page"]
["Subject :","BULK DEAL",null,{"$f":"Main!B10","v":"2023-11-01"}]
[]
["Date","Scrip code","Scrip Name","Client Name","Buy / Sell","Quantity Traded","Trade Price / Wt.Avg.trade price","Exchange  "]
["2023-10-31",543941,"AHASOLAR","SAURABHTRIPATHI","SELL",{"v":47200,"d":"47,200"},281.3,"BSE"]
["2023-10-31",540718,"AKM","SKSE SECURITIES LIMITED CORP CM/TM PROP A/C","BUY",{"v":33000,"d":"33,000"},43.66,"BSE"]
["2023-10-31",540718,"AKM","SKSE SECURITIES LIMITED CORP CM/TM PROP A/C","SELL",{"v":9000,"d":"9,000"},44.4,"BSE"]
["2023-10-31",540718,"AKM","INDUBEN MANSUKHBHAI CHAVDA","SELL",{"v":36000,"d":"36,000"},44.37,"BSE"]
["2023-10-31",540718,"AKM","MITHLESH CONSULTANCY LLP","BUY",{"v":33000,"d":"33,000"},44.4,"BSE"]
["2023-10-31",540718,"AKM","PRAKASHBHAI PANCHAL","SELL",{"v":39000,"d":"39,000"},44.22,"BSE"]
["2023-10-31",540718,"AKM","GAURANGKUMAR SONI","BUY",{"v":39000,"d":"39,000"},44.28,"BSE"]
["2023-10-31",540718,"AKM","LALJIBHAI TRIVEDI","SELL",{"v":33000,"d":"33,000"},43.92,"BSE"]
["2023-10-31",539115,"ALAN SCOTT","NIKUNJ KAUSHIK SHAH","BUY",{"v":10560,"d":"10,560"},82.04,"BSE"]
["2023-10-31",508664,"BESTEAST","GCM COMMODITY AND DERIVATIVES LIMITED","SELL",{"v":100000,"d":"100,000"},25.9,"BSE"]
["2023-10-31",542627,"CHANDNIMACH","JIGAR BHAVSAR","SELL",{"v":17000,"d":"17,000"},24.72,"BSE"]
{"$rows_left_out":147}
{"sheet":"Call Tracker (Equity & F&O)","index":5,"n_rows":349,"n_cols":19,"rows_kept":349,"merged":[[78,0,79,0],[78,1,79,1],[78,9,79,9],[78,12,79,12],[78,14,79,14],[78,15,79,15],[80,0,81,0],[80,1,81,1],[80,9,81,9],[80,12,81,12],[80,14,81,14],[80,15,81,15],[82,0,83,0],[82,1,83,1],[82,9,83,9],[82,12,83,12],[82,14,83,14],[82,15,83,15],[84,0,85,0],[84,1,85,1],[84,9,85,9],[84,12,85,12],[84,14,85,14],[84,15,85,15],[86,0,87,0],[86,1,87,1],[86,9,87,9],[86,12,87,12],[86,14,87,14],[86,15,87,15],[88,0,89,0],[88,1,89,1],[88,9,89,9],[88,12,89,12],[88,14,89,14],[88,15,89,15],[90,0,91,0],[90,1,91,1],[90,9,91,9],[90,12,91,12],[90,14,91,14],[90,15,91,15],[93,0,94,0],[93,1,94,1],[93,9,94,9],[93,12,94,12],[93,14,94,14],[93,15,94,15],[95,0,96,0],[95,1,96,1],[95,9,96,9],[95,12,96,12],[95,14,96,14],[95,15,96,15],[98,0,99,0],[98,1,99,1],[98,9,99,9],[98,10,99,10],[98,12,99,12],[98,14,99,14],[98,15,99,15],[103,0,104,0],[103,1,104,1],[103,9,104,9],[103,12,104,12],[103,14,104,14],[103,15,104,15],[106,0,107,0],[106,1,107,1],[106,9,107,9],[106,12,107,12],[106,14,107,14],[106,15,107,15],[108,0,109,0],[108,1,109,1],[108,9,109,9],[108,14,109,14],[108,15,109,15],[110,0,111,0],[110,1,111,1],[110,9,111,9],[110,12,111,12],[110,14,111,14],[110,15,111,15],[112,0,113,0],[112,1,113,1],[112,9,113,9],[112,14,113,14],[112,15,113,15],[114,0,115,0],[114,1,115,1],[114,9,115,9],[114,10,115,10],[114,12,115,12],[114,14,115,14],[114,15,115,15],[118,0,119,0],[118,1,119,1],[118,9,119,9],[118,12,119,12],[118,14,119,14],[118,15,119,15],[120,0,121,0],[120,1,121,1],[120,15,121,15],[122,0,123,0],[122,1,123,1],[122,9,123,9],[122,12,123,12],[122,14,123,14],[122,15,123,15],[125,0,126,0],[125,1,126,1],[125,9,126,9]]}
[]
[]
[]
[]
[{"$nulls":12},"Back To Main Page"]
["Retail Research Technical Calls & Fundamental Performance Report for the month of October-2023"]
[{"$nulls":12},{"$f":"Main!B10","v":"2023-11-01"}]
[null,"Positional  Call"]
["Sr.no","Date",null,"Company","Rec","Rec Price","Stop Loss***","Call Closed At","Target","Remark","Profit / Loss per Share","All charges","Net Gain / Loss  %","Status","Closed Date","Market Closing Price","Second Buying Date"]
[1,"2023-09-05",null,"FLUOROCHEM","Accu <>",2963,2785,2785,"3200-3400","Loss of Rs.178/-",{"$f":"H10-F10","v":-178},{"$f":"(F10*-0.3)/100","v":{"v":-8.889,"d":"-8.89"}},{"$f":"(K10+L10)/F10","v":{"v":-0.0630742490718866,"d":"-6.31%"}},"Unsuccessful","2023-10-16",null,"2023-10-04",null,"H"]
[2,"2023-09-12",null,"ARE&M","Accu","629-649",608,null,"690-720","Open",{"$nulls":5},{"$f":"VLOOKUP(D11,'MidCap Intra'!$B$11:$C$568,2,0)","v":{"v":613.2,"d":"613.20"}},"2023-10-20",null,"H"]
[3,"2023-09-12",null,"TATAMOTORS","Accu",621,584,661,"660-700","Profit of Rs.40/-",{"$f":"H12-F12","v":40},{"$f":"(F12*-0.3)/100","v":{"v":-1.8629999999999998,"d":"-1.86"}},{"$f":"(K12+L12)/F12","v":{"v":0.0614122383252818,"d":"6.14%"}},"Successful","2023-10-13",null,"-",null,"H"]
[4,"2023-09-18",null,"MTARTECH","Accu",2525,2380,2665,"2800-2950","Profit of Rs.140/-",{"$f":"H13-F13","v":140},{"$f":"(F13*-0.3)/100","v":{"v":-7.575,"d":"-7.58"}},{"$f":"(K13+L13)/F13","v":{"v":0.05244554455445545,"d":"5.24%"}},"Successful","2023-10-04",null,"2023-09-25",null,"H"]
[5,"2023-09-20",null,"RELIANCE","Accu","2285-2385",2235,null,"2550-2700","Open",{"$nulls":5},{"$f":"VLOOKUP(D14,'MidCap Intra'!$B$11:$C$568,2,0)","v":{"v":2287.9,"d":"2287.90"}},"2023-10-04",null,"H"]
[6,"2023-09-20",null,"PIIND","Accu",3480,3370,3345,"3700-3900","Loss of Rs.135/-",{"$f":"H15-F15","v":-135},{"$f":"(F15*-0.3)/100","v":-10.44},{"$f":"(K15+L15)/F15","v":{"v":-0.04179310344827586,"d":"-4.18%"}},"Unsuccessful","2023-10-25",null,"2023-09-22",null,"H"]
[7,"2023-09-21",null,"VGUARD","Accu","285-305",276,null,"330-350","Open",{"$nulls":5},{"$f":"VLOOKUP(D16,'MidCap Intra'!$B$11:$C$568,2,0)","v":{"v":299.6,"d":"299.60"}},"2023-10-09",null,"K"]
[8,"2023-09-22",null,"EIDPARRY","Accu",516,485,472.5,"565-600","Loss of Rs.43.5/-",{"$f":"H17-F17","v":-43.5},{"$f":"(F17*-0.3)/100","v":{"v":-1.5479999999999998,"d":"-1.55"}},{"$f":"(K17+L17)/F17","v":{"v":-0.08730232558139535,"d":"-8.73%"}},"Unsuccessful","2023-10-23",{"$nulls":3},"H"]
[9,"2023-09-25",null,"JAMNAAUTO","Accu",114,108,107.5,"124-130","Loss of Rs.6.5/-",{"$f":"H18-F18","v":-6.5},{"$f":"(F18*-0.3)/100","v":{"v":-0.34199999999999997,"d":"-0.34"}},{"$f":"(K18+L18)/F18","v":{"v":-0.06001754385964912,"d":"-6.00%"}},"Unsuccessful","2023-10-25",null,"2023-10-23",null,"H"]
[10,"2023-09-29",null,"EIHOTEL","Accu",222,204,234.5,"240-260","Profit of Rs.12.50/-",{"$f":"H19-F19","v":12.5},{"$f":"(F19*-0.3)/100","v":{"v":-0.6659999999999999,"d":"-0.67"}},{"$f":"(K19+L19)/F19","v":{"v":0.053306306306306304,"d":"5.33%"}},"Successful","2023-10-03",null,"-",null,"H"]
[11,"2023-10-04",null,"SANSERA","Accu",909,845,845,"1000-1080","Loss of Rs.64/-",-64,{"$f":"(F20*-0.3)/100","v":{"v":-2.727,"d":"-2.73"}},{"v":-0.0734070407040704,"d":"-7.34%"},"Unsuccessful","2023-10-30",null,"2023-10-17",null,"H"]
{"$rows_left_out":322}