{"text_format":"3","workbook":"xlsx","n_sheets":10,"sheets":["Main","Future Intra","Cash Intra","MidCap Intra","Bulk Deals","Call Tracker (Equity & F&O)","Sheet2","Sheet1","Sheet3","Sheet4"],"not_rendered":{"images":4,"defined_names":5},"read":"whole","date_system":"1900"}

{"sheet":"Main","index":0,"n_rows":27,"n_cols":11,"rows_kept":27}
[null,"                                                                                                 "]
{"$rows_empty":8}
[null,"2019-07-31"]
[]
[null,"Sheet No.","Template Name","Summary"]
[null,1,"Future Intra","For Intraday trading in F&O segment"]
[null,2,"Cash Intra","For Intraday trading in cash market segment"]
[null,3,"Mid-cap Intra","For Intraday trading in Mid-cap stocks"]
[null,4,"Bulk Deals","Reveals Bulk Deals carried on NSE & BSE"]
[null,5,"Call Tracker"]
{"$rows_empty":9}
[{"$nulls":10},"`"]

{"sheet":"Future Intra","index":1,"n_rows":205,"n_cols":15,"rows_kept":205,"merged":[[8,0,9,0],[8,1,9,1],[8,2,9,2],[8,5,8,7],[8,8,8,10]]}
[]
[]
[]
[]
[{"$nulls":12},"Back to Main Page"]
["FOR INTRA DAY TRADING",{"$nulls":10},{"$f":"Main!B10","v":"2019-07-31"}]
[]
[]
["Sr.no","Sector","Scrip","CLOSE RATE","Pivot Point","Supports",null,null,"Resistances"]
[null,"Sector",null,"Point","Point","S1","S2","S3","R1","R2","R3","HIGH","LOW","OI","% Change in OI"]
[1,"Index","BANKNIFTY",{"v":28853.4,"d":"28853.40"},{"v":29080.88333333333,"d":"29080.88"},{"v":28573.61666666666,"d":"28573.62"},{"v":28293.83333333333,"d":"28293.83"},{"v":27786.56666666666,"d":"27786.57"},{"v":29360.666666666664,"d":"29360.67"},{"v":29867.933333333334,"d":"29867.93"},{"v":30147.716666666667,"d":"30147.72"},29588.15,28801.1,1458040,{"v":0.00612768776394601,"d":"0.61%"}]
[2,"Index","NIFTY",{"v":11095.2,"d":"11095.20"},{"v":11155.050000000001,"d":"11155.05"},{"v":11020.150000000001,"d":"11020.15"},{"v":10945.1,"d":"10945.10"},{"v":10810.2,"d":"10810.20"},{"v":11230.100000000002,"d":"11230.10"},{"v":11365,"d":"11365.00"},{"v":11440.050000000003,"d":"11440.05"},11289.95,11080,18145800,{"v":-3.8168410390701235E-3,"d":"-0.38%"}]
[3,"Index","NIFTYIT",{"v":15548,"d":"15548.00"},{"v":15529.333333333334,"d":"15529.33"},{"v":15479.666666666668,"d":"15479.67"},{"v":15411.333333333334,"d":"15411.33"},{"v":15361.666666666668,"d":"15361.67"},{"v":15597.666666666668,"d":"15597.67"},{"v":15647.333333333336,"d":"15647.33"},{"v":15715.666666666668,"d":"15715.67"},15579,15461,12700,{"v":-0.019305019305019305,"d":"-1.93%"}]
[4,"Cement","ACC",{"v":1535.6,"d":"1535.60"},{"v":1544.0833333333333,"d":"1544.08"},{"v":1520.7166666666665,"d":"1520.72"},{"v":1505.8333333333333,"d":"1505.83"},{"v":1482.4666666666665,"d":"1482.47"},{"v":1558.9666666666665,"d":"1558.97"},{"v":1582.3333333333333,"d":"1582.33"},{"v":1597.2166666666665,"d":"1597.22"},1567.45,1529.2,2148800,{"v":-0.06362210214397769,"d":"-6.36%"}]
[5,"Others","ADANIENT",{"v":125.7,"d":"125.70"},{"v":126.84999999999998,"d":"126.85"},{"v":122.49999999999997,"d":"122.50"},{"v":119.3,"d":"119.30"},{"v":114.94999999999999,"d":"114.95"},{"v":130.04999999999995,"d":"130.05"},{"v":134.39999999999995,"d":"134.40"},{"v":137.59999999999994,"d":"137.60"},131.2,123.65,30412000,{"v":0.04036672140120416,"d":"4.04%"}]
[6,"Others","ADANIPORTS",374.25,375.95,{"v":370.59999999999997,"d":"370.60"},366.95,{"v":361.59999999999997,"d":"361.60"},{"v":379.59999999999997,"d":"379.60"},384.95,{"v":388.59999999999997,"d":"388.60"},381.3,372.3,14992500,{"v":-0.02819640252795333,"d":"-2.82%"}]
[7,"Power","ADANIPOWER",{"v":60.6,"d":"60.60"},{"v":60.93333333333334,"d":"60.93"},{"v":59.716666666666676,"d":"59.72"},{"v":58.833333333333336,"d":"58.83"},{"v":57.616666666666674,"d":"57.62"},{"v":61.81666666666668,"d":"61.82"},{"v":63.033333333333346,"d":"63.03"},{"v":63.91666666666668,"d":"63.92"},62.15,60.05,113140000,{"v":-0.004750175932441942,"d":"-0.48%"}]
[8,"Automobile","AMARAJABAT",632.65,{"v":636.1166666666667,"d":"636.12"},{"v":626.5333333333333,"d":"626.53"},{"v":620.4166666666666,"d":"620.42"},{"v":610.8333333333333,"d":"610.83"},{"v":642.2333333333333,"d":"642.23"},{"v":651.8166666666666,"d":"651.82"},{"v":657.9333333333334,"d":"657.93"},645.7,630,1591800,{"v":-0.030277185501066096,"d":"-3.03%"}]
[9,"Cement","AMBUJACEM",{"v":202.9,"d":"202.90"},{"v":204.70000000000002,"d":"204.70"},{"v":200.30000000000004,"d":"200.30"},{"v":197.70000000000002,"d":"197.70"},{"v":193.30000000000004,"d":"193.30"},{"v":207.30000000000004,"d":"207.30"},{"v":211.70000000000002,"d":"211.70"},{"v":214.30000000000004,"d":"214.30"},209.1,202.1,19882500,{"v":0.019615384615384614,"d":"1.96%"}]
[10,"Others","APOLLOHOSP",1334.75,{"v":1348.1000000000001,"d":"1348.10"},{"v":1317.8500000000004,"d":"1317.85"},{"v":1300.9500000000003,"d":"1300.95"},{"v":1270.7000000000005,"d":"1270.70"},{"v":1365.0000000000002,"d":"1365.00"},{"v":1395.2499999999998,"d":"1395.25"},1412.15,1378.35,1331.2,1303000,{"v":-0.027974636329727715,"d":"-2.80%"}]
{"$rows_left_out":172}
{"sheet":"Cash Intra","index":2,"n_rows":247,"n_cols":13,"rows_kept":247,"merged":[[7,0,8,0],[7,1,8,1],[7,2,8,2],[7,3,8,3],[7,4,7,6],[7,7,7,9]]}
[]
[]
[]
[]
[{"$nulls":12},"Back to Main Page"]
["FOR INTRA DAY TRADING",{"$nulls":9},{"$f":"Main!B10","v":"2019-07-31"}]
[]
["Sr.no","Scrip","CLOSE RATE","Pivot Point","Supports",null,null,"Resistances"]
[null,null,"Point",null,"S1","S2","S3","R1","R2","R3","HIGH","LOW","Total Trade Quanity in Lakhs"]
[1,"Nifty 50",11085.4,{"v":11141.833333333334,"d":"11141.83"},{"v":11016.216666666667,"d":"11016.22"},{"v":10947.033333333333,"d":"10947.03"},{"v":10821.416666666666,"d":"10821.42"},{"v":11211.016666666668,"d":"11211.02"},{"v":11336.633333333333,"d":"11336.63"},{"v":11405.81666666667,"d":"11405.82"},11267.45,11072.65]
[2,"Nifty Bank",28791.6,{"v":29019.899999999998,"d":"29019.90"},{"v":28509.499999999996,"d":"28509.50"},{"v":28227.399999999998,"d":"28227.40"},{"v":27716.999999999996,"d":"27717.00"},{"v":29301.999999999996,"d":"29302.00"},{"v":29812.399999999998,"d":"29812.40"},{"v":30094.499999999996,"d":"30094.50"},29530.3,28737.8]
[3,"Nifty CPSE",1982.65,{"v":1993,"d":"1993.00"},{"v":1961.3,"d":"1961.30"},1939.95,1908.25,2014.35,{"v":2046.0499999999997,"d":"2046.05"},{"v":2067.3999999999996,"d":"2067.40"},2024.7,1971.65]
[4,"Nifty Infra",3076.55,{"v":3087.5333333333333,"d":"3087.53"},{"v":3059.5666666666666,"d":"3059.57"},{"v":3042.5833333333335,"d":"3042.58"},{"v":3014.616666666667,"d":"3014.62"},{"v":3104.5166666666664,"d":"3104.52"},{"v":3132.4833333333327,"d":"3132.48"},{"v":3149.4666666666662,"d":"3149.47"},3115.5,3070.55]
[5,"Nifty IT",15501.65,{"v":15463.533333333335,"d":"15463.53"},{"v":15399.56666666667,"d":"15399.57"},{"v":15297.483333333335,"d":"15297.48"},{"v":15233.51666666667,"d":"15233.52"},{"v":15565.616666666669,"d":"15565.62"},{"v":15629.583333333332,"d":"15629.58"},{"v":15731.666666666668,"d":"15731.67"},15527.5,15361.45]
[6,"Nifty PSE",3176.35,{"v":3193,"d":"3193.00"},3148.05,3119.75,{"v":3074.8,"d":"3074.80"},{"v":3221.3,"d":"3221.30"},3266.25,3294.55,3237.95,3164.7]
[7,"Nifty Midcap 50",4273.15,4313.95,4225.25,4177.35,{"v":4088.6500000000005,"d":"4088.65"},{"v":4361.849999999999,"d":"4361.85"},{"v":4450.549999999998,"d":"4450.55"},{"v":4498.449999999999,"d":"4498.45"},4402.65,4266.05]
[8,"ABB",1358.3,{"v":1371.9833333333333,"d":"1371.98"},{"v":1339.2666666666667,"d":"1339.27"},{"v":1320.2333333333333,"d":"1320.23"},{"v":1287.5166666666667,"d":"1287.52"},{"v":1391.0166666666667,"d":"1391.02"},{"v":1423.7333333333333,"d":"1423.73"},{"v":1442.7666666666667,"d":"1442.77"},1404.7,1352.95,2.91048]
[9,"ACC",1540.9,1546.75,1526.75,{"v":1512.6,"d":"1512.60"},{"v":1492.6,"d":"1492.60"},{"v":1560.9,"d":"1560.90"},{"v":1580.9,"d":"1580.90"},{"v":1595.0500000000002,"d":"1595.05"},1566.75,1532.6,10.94582]
[10,"AUBANK",654.55,654.85,{"v":644.7,"d":"644.70"},634.85,{"v":624.7,"d":"624.70"},{"v":664.7,"d":"664.70"},{"v":674.8499999999999,"d":"674.85"},{"v":684.7,"d":"684.70"},665,645,3.77646]
[11,"ADANIPORTS",373.45,{"v":374.8166666666666,"d":"374.82"},{"v":369.73333333333323,"d":"369.73"},{"v":366.01666666666665,"d":"366.02"},{"v":360.9333333333333,"d":"360.93"},{"v":378.5333333333332,"d":"378.53"},{"v":383.61666666666656,"d":"383.62"},{"v":387.33333333333314,"d":"387.33"},379.9,371.1,23.12161]
{"$rows_left_out":228}
{"sheet":"MidCap Intra","index":3,"n_rows":545,"n_cols":13,"rows_kept":545,"merged":[[0,0,0,1],[8,0,9,0],[8,1,9,1],[8,2,9,2],[8,3,9,3],[8,4,8,6],[8,7,8,9]]}
[]
[]
[]
[]
[{"$nulls":11},"Back To Main Page"]
["FOR INTRA DAY TRADING",{"$nulls":9},{"$f":"Main!B10","v":"2019-07-31"}]
[null,null," "]
[]
["Sr.no","Scrip","CLOSE RATE","Pivot Point","Supports",null,null,"Resistances"]
[null,null,"Point",null,"S1","S2","S3","R1","R2","R3","HIGH","LOW","Total Trade Quanity in Lakhs"]
[1,"3MINDIA",20989.85,{"v":21078.666666666668,"d":"21078.67"},{"v":20778.833333333336,"d":"20778.83"},{"v":20567.81666666667,"d":"20567.82"},{"v":20267.983333333337,"d":"20267.98"},{"v":21289.683333333334,"d":"21289.68"},{"v":21589.51666666667,"d":"21589.52"},{"v":21800.533333333333,"d":"21800.53"},21378.5,20867.65,0.00904]
[2,"ABB",1358.3,{"v":1371.9833333333333,"d":"1371.98"},{"v":1339.2666666666667,"d":"1339.27"},{"v":1320.2333333333333,"d":"1320.23"},{"v":1287.5166666666667,"d":"1287.52"},{"v":1391.0166666666667,"d":"1391.02"},{"v":1423.7333333333333,"d":"1423.73"},{"v":1442.7666666666667,"d":"1442.77"},1404.7,1352.95,2.91048]
[3,"ACC",1540.9,1546.75,1526.75,{"v":1512.6,"d":"1512.60"},{"v":1492.6,"d":"1492.60"},{"v":1560.9,"d":"1560.90"},{"v":1580.9,"d":"1580.90"},{"v":1595.0500000000002,"d":"1595.05"},1566.75,1532.6,10.94582]
[4,"AIAENG",1747.35,1736.95,{"v":1719,"d":"1719.00"},{"v":1690.6499999999999,"d":"1690.65"},{"v":1672.6999999999998,"d":"1672.70"},{"v":1765.3000000000002,"d":"1765.30"},{"v":1783.2500000000005,"d":"1783.25"},{"v":1811.6000000000004,"d":"1811.60"},1754.9,1708.6,0.05049]
[5,"APLAPOLLO",1355.25,{"v":1352.5833333333333,"d":"1352.58"},{"v":1305.1666666666665,"d":"1305.17"},{"v":1255.0833333333333,"d":"1255.08"},{"v":1207.6666666666665,"d":"1207.67"},{"v":1402.6666666666665,"d":"1402.67"},{"v":1450.083333333333,"d":"1450.08"},{"v":1500.1666666666665,"d":"1500.17"},1400,1302.5,0.43975]
[6,"AUBANK",654.55,654.85,{"v":644.7,"d":"644.70"},634.85,{"v":624.7,"d":"624.70"},{"v":664.7,"d":"664.70"},{"v":674.8499999999999,"d":"674.85"},{"v":684.7,"d":"684.70"},665,645,3.77646]
[7,"AAVAS",1430.2,{"v":1441.7833333333335,"d":"1441.78"},{"v":1413.566666666667,"d":"1413.57"},{"v":1396.9333333333336,"d":"1396.93"},{"v":1368.7166666666672,"d":"1368.72"},{"v":1458.416666666667,"d":"1458.42"},{"v":1486.6333333333337,"d":"1486.63"},{"v":1503.2666666666669,"d":"1503.27"},1470,1425.15,0.53478]
[8,"ADANIGREEN",46.4,{"v":47.199999999999996,"d":"47.20"},{"v":45.19999999999999,"d":"45.20"},{"v":43.99999999999999,"d":"44.00"},{"v":41.999999999999986,"d":"42.00"},{"v":48.39999999999999,"d":"48.40"},{"v":50.400000000000006,"d":"50.40"},{"v":51.599999999999994,"d":"51.60"},49.2,46,6.23197]
[9,"ADANIPORTS",373.45,{"v":374.8166666666666,"d":"374.82"},{"v":369.73333333333323,"d":"369.73"},{"v":366.01666666666665,"d":"366.02"},{"v":360.9333333333333,"d":"360.93"},{"v":378.5333333333332,"d":"378.53"},{"v":383.61666666666656,"d":"383.62"},{"v":387.33333333333314,"d":"387.33"},379.9,371.1,23.12161]
[10,"ADANIPOWER",60.65,{"v":61.03333333333334,"d":"61.03"},{"v":59.81666666666668,"d":"59.82"},{"v":58.98333333333334,"d":"58.98"},{"v":57.76666666666668,"d":"57.77"},{"v":61.866666666666674,"d":"61.87"},{"v":63.08333333333333,"d":"63.08"},{"v":63.91666666666667,"d":"63.92"},62.25,60.2,81.57234]
{"$rows_left_out":513}
{"sheet":"Bulk Deals","index":4,"n_rows":48,"n_cols":8,"rows_kept":48,"merged":[[4,0,4,1],[4,2,4,3],[6,1,6,2]]}
[" "]
[]
[]
[]
[]
[{"$nulls":4},"Back To Main Page"]
["Subject :","BULK DEAL",null,{"$f":"Main!B10","v":"2019-07-31"}]
[]
["Date","Scrip code","Scrip Name","Client Name","Buy / Sell","Quantity Traded","Trade Price / Wt.Avg.trade price","Exchange  "]
["2019-07-30",540697,"AMFL","TEJAS HARSHADBHAI PATEL","BUY",{"v":144000,"d":"144,000"},9.03,"BSE"]
["2019-07-30",540697,"AMFL","TEJAS HARSHADBHAI PATEL","SELL",{"v":24000,"d":"24,000"},9.14,"BSE"]
["2019-07-30",540697,"AMFL","THAKKAR VIJAYKUMAR JAYANTILAL","SELL",{"v":88000,"d":"88,000"},9.14,"BSE"]
["2019-07-30",537766,"BCP","ACHINTYA COMMODITIES PRIVATE LIMITED","BUY",{"v":537271,"d":"537,271"},39.37,"BSE"]
["2019-07-30",537766,"BCP","ACHINTYA COMMODITIES PRIVATE LIMITED","SELL",{"v":248768,"d":"248,768"},38.95,"BSE"]
["2019-07-30",537766,"BCP","VINCO METALS PVT. LTD.","SELL",{"v":300997,"d":"300,997"},37.71,"BSE"]
["2019-07-30",526717,"GOPALA","ANJALI JAGDISH AHUJA","SELL",{"v":69239,"d":"69,239"},21.8,"BSE"]
["2019-07-30",526717,"GOPALA","MADANMOHANRAI MAHENDRA SHAH","BUY",{"v":70100,"d":"70,100"},{"v":21.8,"d":"21.80"},"BSE"]
["2019-07-30",538765,"JSHL","JAWAHAR LAL AGARWAL","SELL",{"v":100000,"d":"100,000"},7.97,"BSE"]
["2019-07-30",538765,"JSHL","VIVEK DWIVEDI","BUY",{"v":70000,"d":"70,000"},7.97,"BSE"]
["2019-07-30",542628,"NSL","BHAVNA HITESH PATEL","SELL",{"v":138000,"d":"138,000"},27.18,"BSE"]
{"$rows_left_out":29}
{"sheet":"Call Tracker (Equity & F&O)","index":5,"n_rows":347,"n_cols":18,"rows_kept":347,"merged":[[136,0,137,0],[136,1,137,1],[136,9,137,9],[136,11,137,11],[136,12,137,12],[136,13,137,13],[136,14,137,14],[136,17,137,17],[139,0,140,0],[139,1,140,1],[139,9,140,9],[139,11,140,11],[139,12,140,12],[139,13,140,13],[139,14,140,14],[139,17,140,17],[141,0,142,0],[141,1,142,1],[141,9,142,9],[141,11,142,11],[141,12,142,12],[141,13,142,13],[141,14,142,14],[145,0,146,0],[145,1,146,1],[145,9,146,9],[145,11,146,11],[145,12,146,12],[145,13,146,13],[145,14,146,14],[145,17,146,17],[147,0,148,0],[147,1,148,1],[147,9,148,9],[147,11,148,11],[147,12,148,12],[147,13,148,13],[147,14,148,14],[149,0,150,0],[149,1,150,1],[149,9,150,9],[149,11,150,11],[149,12,150,12],[149,13,150,13],[149,14,150,14]]}
[]
[]
[]
[]
[{"$nulls":12},"Back To Main Page"]
["Retail Research Technical Calls & Fundamental Performance Report for the month of July-2019 "]
[{"$nulls":12},{"$f":"Main!B10","v":"2019-07-31"}]
[null,"Positional  Call"]
["Sr.no","Date",null,"Company","Rec","Rec Price","Stop Loss***","Call Closed At","Target","Remark","Profit / Loss per Share","Gain / Loss  %","Status","Closed Date","NSE Closed Price"]
[1,"2019-05-27",null,"TATAELXSI","Buy",874,818.7,863,"970-990","Loss of Rs.11/-",{"$f":"H10-F10","v":-11},{"$f":"K10/F10","v":{"v":-0.012585812356979404,"d":"-1.26%"}},"Unsuccessful","2019-07-16",{"$nulls":3},"R"]
[2,"2019-05-28",null,"BAJAJFINSV","Sell",8175,8625,7925,7300,"Profit of Rs.250/-",{"$f":"F11-H11","v":250},{"v":0.03058103975535168,"d":"3.06%"},"Successful","2019-07-08",{"$nulls":3},"H"]
[3,"2019-05-31",null,"ITC","Buy",286,268.3,265.5,"315-325","Loss of Rs.20.5/-",{"$f":"H12-F12","v":-20.5},{"$f":"K12/F12","v":{"v":-0.07167832167832168,"d":"-7.17%"}},"Unsuccessful","2019-07-22",{"$nulls":3},"R"]
[4,"2019-06-13",null,"GODREJCP","Buy",677.5,644,639.5,"740-750","Loss of Rs.38/-",{"$f":"H13-F13","v":-38},{"$f":"K13/F13","v":{"v":-0.05608856088560885,"d":"-5.61%"}},"Unsuccessful","2019-07-10",{"$nulls":3},"H"]
[5,"2019-06-17",null,"SUNTV","Buy",517,476,507,"575-585","Loss of Rs.10/-",{"$f":"H14-F14","v":-10},{"$f":"K14/F14","v":{"v":-0.019342359767891684,"d":"-1.93%"}},"Unsuccessful","2019-07-08",{"$nulls":3},"R"]
[6,"2019-06-21",null,"AJANTPHARM","Buy",955,897.7,894,"1060-1080","Loss of Rs.61/-",{"$f":"H15-F15","v":-61},{"$f":"K15/F15","v":{"v":-0.06387434554973823,"d":"-6.39%"}},"Unsuccessful","2019-07-11",{"$nulls":3},"R"]
[7,"2019-06-24",null,"ESCORTS","Buy",549.5,518,545.25,600,"Loss of Rs.4.25/-",-4.25,{"v":-7.7343039126478615E-3,"d":"-0.77%"},"Neutral","2019-07-08",{"$nulls":3},"H"]
[8,"2019-06-25",null,"JUBLFOOD","Buy",1262.5,1158.3,1145,"1450 -1470","Loss of Rs.117.50/-",-117.5,{"v":-0.09306930693069307,"d":"-9.31%"},"Unsuccessful","2019-07-24",{"$nulls":3},"R"]
[9,"2019-07-04",null,"TORNTPHARM","Buy",1545,1454,1638,"1730-1750","Profit of Rs.93/-",{"$f":"H18-F18","v":93},{"$f":"K18/F18","v":{"v":0.06019417475728155,"d":"6.02%"}},"Successful","2019-07-26",{"$nulls":3},"R"]
[10,"2019-07-10",null,"TCS","Buy",2110,1973,2177,"2295-2345","Part Profit of Rs.67/-",67,{"v":0.03175355450236967,"d":"3.18%"},"Successful","2019-07-30",{"$f":"VLOOKUP(D19,Sheet2!A6:M1645,6,0)","v":2179.15},null,null,"H"]
[11,"2019-07-11",null,"BAJAJ-AUTO","Buy",2670,2527,2527,"1920-1950","Loss of Rs.143/-",{"$f":"H20-F20","v":-143},{"$f":"K20/F20","v":{"v":-0.05355805243445693,"d":"-5.36%"}},"Unsuccessful","2019-07-22",{"$nulls":3},"R"]
{"$rows_left_out":328}
{"sheet":"Sheet2","index":6,"n_rows":1899,"n_cols":14,"rows_kept":1899,"hidden":true}
["SYMBOL","SERIES","OPEN","HIGH","LOW","CLOSE","LAST","PREVCLOSE","TOTTRDQTY","TOTTRDVAL","TIMESTAMP","TOTALTRADES","ISIN","ISIN"]
["20MICRONS","EQ",35.95,35.95,34,34.1,34.05,35.2,20819,720756.05,"2019-07-30",209,"INE144J01027"]
["21STCENMGM","EQ",15.35,15.35,15.35,15.35,15.35,15.35,1,15.35,"2019-07-30",1,"INE253B01015"]
["3IINFOTECH","EQ",2.45,2.45,2.3,2.35,2.35,2.45,2216843,5285034.8,"2019-07-30",718,"INE748C01020"]
["3MINDIA","EQ",21259.95,21378.5,20867.65,20989.85,21040,21268.8,904,19078500,"2019-07-30",406,"INE470A01017"]
["3PLAND","EQ",7.6,7.6,7.35,7.6,7.6,7.6,1010,7492.7,"2019-07-30",10,"INE105C01023"]
["5PAISA","EQ",189.95,189.95,177.6,177.6,177.6,186.9,11965,2162153.25,"2019-07-30",382,"INE618L01018"]
["63MOONS","EQ",94.5,97.95,90.15,90.95,90.6,93.3,166936,15739171.95,"2019-07-30",1797,"INE111B01023"]
["8KMILES","EQ",59.9,59.9,59.9,59.9,59.9,63.05,38267,2292193.3,"2019-07-30",386,"INE650K01021"]
["A2ZINFRA","EQ",11.05,11.45,10.7,10.85,10.75,11.05,773875,8660894,"2019-07-30",1040,"INE619I01012"]
["AARTIDRUGS","EQ",479,487.95,472,475.3,477,482.25,6393,3069758.45,"2019-07-30",650,"INE767A01016"]
["AARTIIND","EQ",1650.75,1670,1625,1630.55,1630,1650.75,17208,28355944.9,"2019-07-30",2360,"INE769A01020"]
["AARVEEDEN","EQ",16.45,16.8,16.15,16.4,16.65,16.45,369,6063.5,"2019-07-30",26,"INE273D01019"]
["AAVAS","EQ",1437.65,1470,1425.15,1430.2,1430,1437.65,53478,77134152.1,"2019-07-30",1766,"INE216P01012"]
["ABAN","EQ",30.85,31.35,29.35,29.5,29.4,30.85,89977,2734686.4,"2019-07-30",979,"INE421A01028"]
["ABB","EQ",1398,1404.7,1352.95,1358.3,1355,1394.55,291048,403465890.35,"2019-07-30",6732,"INE117A01022"]
["ABBOTINDIA","EQ",8416,8575,8416,8490.8,8500,8441.4,7001,59686129,"2019-07-30",1232,"INE358A01014"]
["ABCAPITAL","EQ",83,84.4,80.1,81,81.15,83.3,1247865,101746519.8,"2019-07-30",12834,"INE674K01013"]
["ABFRL","EQ",198.05,198.9,188.55,190,189.1,197.65,744165,144077400.6,"2019-07-30",10636,"INE647O01011"]
["ABSLNN50ET","EQ",262.67,262.67,257.48,257.9,257.48,262.67,113,29398.11,"2019-07-30",10,"INF209KB1B87"]
{"$rows_left_out":1684}
{"sheet":"Sheet1","index":7,"n_rows":0,"n_cols":0,"rows_kept":0,"hidden":true}

{"sheet":"Sheet3","index":8,"n_rows":0,"n_cols":0,"rows_kept":0,"hidden":true}

{"sheet":"Sheet4","index":9,"n_rows":0,"n_cols":0,"rows_kept":0,"hidden":true}