{"text_format":"3","workbook":"xlsx","n_sheets":11,"sheets":["Main","Future Intra","Cash Intra","MidCap Intra","Bulk Deals","Call Tracker (Equity & F&O)","Sheet2","Sheet1","Sheet3","Sheet4","Sheet5"],"not_rendered":{"images":4,"defined_names":5},"read":"whole","date_system":"1900"}

{"sheet":"Main","index":0,"n_rows":27,"n_cols":11,"rows_kept":27}
[null,"                                                                                                 "]
{"$rows_empty":8}
[null,"2020-02-27"]
[]
[null,"Sheet No.","Template Name","Summary"]
[null,1,"Future Intra","For Intraday trading in F&O segment"]
[null,2,"Cash Intra","For Intraday trading in cash market segment"]
[null,3,"Mid-cap Intra","For Intraday trading in Mid-cap stocks"]
[null,4,"Bulk Deals","Reveals Bulk Deals carried on NSE & BSE"]
[null,5,"Call Tracker"]
{"$rows_empty":9}
[{"$nulls":10},"`"]

{"sheet":"Future Intra","index":1,"n_rows":190,"n_cols":15,"rows_kept":190,"merged":[[8,0,9,0],[8,1,9,1],[8,2,9,2],[8,5,8,7],[8,8,8,10]]}
[]
[]
[]
[]
[{"$nulls":12},"Back to Main Page"]
["FOR INTRA DAY TRADING",{"$nulls":10},{"$f":"Main!B10","v":"2020-02-27"}]
[]
[]
["Sr.no","Sector","Scrip","CLOSE RATE","Pivot Point","Supports",null,null,"Resistances"]
[null,"Sector",null,"Point","Point","S1","S2","S3","R1","R2","R3","HIGH","LOW","OI","% Change in OI"]
[1,"Index","BANKNIFTY",{"v":30315.5,"d":"30315.50"},{"v":30319.36666666667,"d":"30319.37"},{"v":30121.63333333334,"d":"30121.63"},{"v":29927.76666666667,"d":"29927.77"},{"v":29730.03333333334,"d":"29730.03"},{"v":30513.233333333337,"d":"30513.23"},{"v":30710.966666666667,"d":"30710.97"},{"v":30904.833333333336,"d":"30904.83"},30517.1,30125.5,1351180,{"v":0.012453542740678576,"d":"1.25%"}]
[2,"Index","NIFTY",11695.65,{"v":11706.216666666665,"d":"11706.22"},{"v":11624.73333333333,"d":"11624.73"},{"v":11553.816666666664,"d":"11553.82"},{"v":11472.333333333328,"d":"11472.33"},{"v":11777.133333333331,"d":"11777.13"},{"v":11858.616666666665,"d":"11858.62"},{"v":11929.533333333333,"d":"11929.53"},11787.7,11635.3,17876175,{"v":0.10263551116518553,"d":"10.26%"}]
[3,"Index","NIFTYIT",{"v":16319,"d":"16319.00"},{"v":16359,"d":"16359.00"},{"v":16240,"d":"16240.00"},{"v":16161,"d":"16161.00"},{"v":16042,"d":"16042.00"},{"v":16438,"d":"16438.00"},{"v":16557,"d":"16557.00"},{"v":16636,"d":"16636.00"},16478,16280,6500,{"v":-0.16129032258064516,"d":"-16.13%"}]
[4,"Cement","ACC",1396.75,{"v":1397.5666666666666,"d":"1397.57"},{"v":1377.2333333333331,"d":"1377.23"},{"v":1357.7166666666665,"d":"1357.72"},{"v":1337.383333333333,"d":"1337.38"},{"v":1417.0833333333333,"d":"1417.08"},{"v":1437.4166666666667,"d":"1437.42"},{"v":1456.9333333333334,"d":"1456.93"},1417.9,1378.05,3972000,{"v":-0.05626306785782171,"d":"-5.63%"}]
[5,"Others","ADANIENT",{"v":242.5,"d":"242.50"},{"v":242.96666666666667,"d":"242.97"},{"v":239.63333333333333,"d":"239.63"},{"v":236.76666666666665,"d":"236.77"},{"v":233.4333333333333,"d":"233.43"},{"v":245.83333333333334,"d":"245.83"},{"v":249.16666666666666,"d":"249.17"},{"v":252.03333333333336,"d":"252.03"},246.3,240.1,35556000,{"v":-0.005259623992837959,"d":"-0.53%"}]
[6,"Others","ADANIPORTS",{"v":358.6,"d":"358.60"},{"v":358.3,"d":"358.30"},353.85,{"v":349.1,"d":"349.10"},{"v":344.65000000000003,"d":"344.65"},363.05,{"v":367.49999999999994,"d":"367.50"},372.25,362.75,353.55,34012500,{"v":0.0653876272513704,"d":"6.54%"}]
[7,"Power","ADANIPOWER",{"v":54.4,"d":"54.40"},{"v":54.76666666666667,"d":"54.77"},{"v":53.283333333333346,"d":"53.28"},{"v":52.16666666666667,"d":"52.17"},{"v":50.683333333333344,"d":"50.68"},{"v":55.88333333333335,"d":"55.88"},{"v":57.36666666666668,"d":"57.37"},{"v":58.48333333333335,"d":"58.48"},56.25,53.65,89060000,{"v":-0.013076241134751773,"d":"-1.31%"}]
[8,"Automobile","AMARAJABAT",694.25,{"v":693.2666666666668,"d":"693.27"},{"v":677.4333333333335,"d":"677.43"},{"v":660.6166666666668,"d":"660.62"},{"v":644.7833333333335,"d":"644.78"},{"v":710.0833333333335,"d":"710.08"},{"v":725.9166666666667,"d":"725.92"},{"v":742.7333333333335,"d":"742.73"},709.1,676.45,2228000,{"v":0.030336662967073623,"d":"3.03%"}]
[9,"Cement","AMBUJACEM",213.75,{"v":213.28333333333333,"d":"213.28"},{"v":210.56666666666666,"d":"210.57"},{"v":207.38333333333333,"d":"207.38"},{"v":204.66666666666666,"d":"204.67"},{"v":216.46666666666667,"d":"216.47"},{"v":219.1833333333333,"d":"219.18"},{"v":222.36666666666667,"d":"222.37"},216,210.1,21327500,{"v":-0.09848885131565042,"d":"-9.85%"}]
[10,"Others","APOLLOHOSP",1769.75,{"v":1776.2666666666664,"d":"1776.27"},{"v":1757.3333333333328,"d":"1757.33"},{"v":1744.9166666666663,"d":"1744.92"},{"v":1725.9833333333327,"d":"1725.98"},{"v":1788.683333333333,"d":"1788.68"},{"v":1807.6166666666663,"d":"1807.62"},{"v":1820.033333333333,"d":"1820.03"},1795.2,1763.85,2018500,{"v":-0.06399258057036865,"d":"-6.40%"}]
{"$rows_left_out":155}
{"sheet":"Cash Intra","index":2,"n_rows":247,"n_cols":13,"rows_kept":247,"merged":[[7,0,8,0],[7,1,8,1],[7,2,8,2],[7,3,8,3],[7,4,7,6],[7,7,7,9]]}
[]
[]
[]
[]
[{"$nulls":12},"Back to Main Page"]
["FOR INTRA DAY TRADING",{"$nulls":9},{"$f":"Main!B10","v":"2020-02-27"}]
[]
["Sr.no","Scrip","CLOSE RATE","Pivot Point","Supports",null,null,"Resistances"]
[null,null,"Point",null,"S1","S2","S3","R1","R2","R3","HIGH","LOW","Total Trade Quanity in Lakhs"]
[1,"Nifty 50",11678.5,{"v":11700.449999999999,"d":"11700.45"},{"v":11617.649999999998,"d":"11617.65"},{"v":11556.8,"d":"11556.80"},{"v":11473.999999999998,"d":"11474.00"},{"v":11761.299999999997,"d":"11761.30"},{"v":11844.099999999997,"d":"11844.10"},{"v":11904.949999999997,"d":"11904.95"},11783.25,11639.6]
[2,"Nifty Bank",30306.85,{"v":30317.983333333334,"d":"30317.98"},{"v":30120.61666666667,"d":"30120.62"},{"v":29934.383333333335,"d":"29934.38"},{"v":29737.01666666667,"d":"29737.02"},{"v":30504.216666666667,"d":"30504.22"},{"v":30701.58333333333,"d":"30701.58"},{"v":30887.816666666666,"d":"30887.82"},30515.35,30131.75]
[3,"Nifty CPSE",1598.55,{"v":1607.7333333333333,"d":"1607.73"},{"v":1584.5166666666667,"d":"1584.52"},{"v":1570.4833333333333,"d":"1570.48"},{"v":1547.2666666666667,"d":"1547.27"},{"v":1621.7666666666667,"d":"1621.77"},{"v":1644.9833333333333,"d":"1644.98"},{"v":1659.0166666666667,"d":"1659.02"},1630.95,1593.7]
[4,"Nifty Infra",3116.5,3125.15,{"v":3100.8500000000004,"d":"3100.85"},{"v":3085.2000000000003,"d":"3085.20"},{"v":3060.9000000000005,"d":"3060.90"},{"v":3140.8,"d":"3140.80"},{"v":3165.1000000000004,"d":"3165.10"},3180.75,3149.45,3109.5]
[5,"Nifty IT",16332.25,{"v":16389.583333333332,"d":"16389.58"},{"v":16239.916666666664,"d":"16239.92"},{"v":16147.583333333332,"d":"16147.58"},{"v":15997.916666666664,"d":"15997.92"},{"v":16481.916666666664,"d":"16481.92"},{"v":16631.58333333333,"d":"16631.58"},{"v":16723.916666666664,"d":"16723.92"},16539.25,16297.25]
[6,"Nifty PSE",2832.85,{"v":2847.5,"d":"2847.50"},2808.15,{"v":2783.4500000000003,"d":"2783.45"},{"v":2744.1000000000004,"d":"2744.10"},{"v":2872.2,"d":"2872.20"},2911.55,{"v":2936.2499999999995,"d":"2936.25"},2886.85,2822.8]
[7,"Nifty Midcap 50",4745.35,{"v":4759.400000000001,"d":"4759.40"},{"v":4715.200000000001,"d":"4715.20"},4685.05,4640.85,{"v":4789.550000000001,"d":"4789.55"},4833.75,{"v":4863.9000000000015,"d":"4863.90"},4803.6,4729.25]
[8,"ACC",1399.5,{"v":1401.8499999999997,"d":"1401.85"},{"v":1384.9999999999993,"d":"1385.00"},{"v":1370.4999999999995,"d":"1370.50"},{"v":1353.6499999999992,"d":"1353.65"},{"v":1416.3499999999995,"d":"1416.35"},{"v":1433.1999999999998,"d":"1433.20"},{"v":1447.6999999999996,"d":"1447.70"},1418.7,1387.35,5.14199]
[9,"AUBANK",1178.95,{"v":1133.0166666666667,"d":"1133.02"},{"v":1065.0333333333333,"d":"1065.03"},{"v":951.1166666666667,"d":"951.12"},{"v":883.1333333333333,"d":"883.13"},{"v":1246.9333333333334,"d":"1246.93"},{"v":1314.9166666666665,"d":"1314.92"},{"v":1428.8333333333333,"d":"1428.83"},1201,1019.1,4.21839]
[10,"ADANIPORTS",358.4,{"v":357.93333333333334,"d":"357.93"},{"v":353.3666666666667,"d":"353.37"},{"v":348.3333333333333,"d":"348.33"},{"v":343.76666666666665,"d":"343.77"},{"v":362.9666666666667,"d":"362.97"},{"v":367.5333333333334,"d":"367.53"},{"v":372.5666666666667,"d":"372.57"},362.5,352.9,29.12256]
[11,"ADANIPOWER",54.45,{"v":54.79999999999999,"d":"54.80"},{"v":53.44999999999998,"d":"53.45"},{"v":52.44999999999999,"d":"52.45"},{"v":51.09999999999998,"d":"51.10"},{"v":55.79999999999998,"d":"55.80"},{"v":57.14999999999999,"d":"57.15"},{"v":58.149999999999984,"d":"58.15"},56.15,53.8,57.54033]
{"$rows_left_out":228}
{"sheet":"MidCap Intra","index":3,"n_rows":545,"n_cols":13,"rows_kept":545,"merged":[[0,0,0,1],[8,0,9,0],[8,1,9,1],[8,2,9,2],[8,3,9,3],[8,4,8,6],[8,7,8,9]]}
[]
[]
[]
[]
[{"$nulls":11},"Back To Main Page"]
["FOR INTRA DAY TRADING",{"$nulls":9},{"$f":"Main!B10","v":"2020-02-27"}]
[null,null," "]
[]
["Sr.no","Scrip","CLOSE RATE","Pivot Point","Supports",null,null,"Resistances"]
[null,null,"Point",null,"S1","S2","S3","R1","R2","R3","HIGH","LOW","Total Trade Quanity in Lakhs"]
[1,"3MINDIA",20771.6,{"v":20857.2,"d":"20857.20"},{"v":20614.4,"d":"20614.40"},{"v":20457.2,"d":"20457.20"},{"v":20214.4,"d":"20214.40"},{"v":21014.4,"d":"21014.40"},{"v":21257.199999999997,"d":"21257.20"},{"v":21414.4,"d":"21414.40"},21100,20700,0.03205]
[2,"AARTIIND",999.7,{"v":1007.5500000000001,"d":"1007.55"},{"v":988.1000000000001,"d":"988.10"},{"v":976.5000000000001,"d":"976.50"},{"v":957.0500000000002,"d":"957.05"},{"v":1019.1500000000001,"d":"1019.15"},{"v":1038.6000000000001,"d":"1038.60"},{"v":1050.2,"d":"1050.20"},1027,995.95,3.42707]
[3,"AAVAS",1903.75,{"v":1907.8666666666668,"d":"1907.87"},{"v":1870.8833333333337,"d":"1870.88"},{"v":1838.0166666666669,"d":"1838.02"},{"v":1801.0333333333338,"d":"1801.03"},{"v":1940.7333333333336,"d":"1940.73"},{"v":1977.7166666666667,"d":"1977.72"},{"v":2010.5833333333335,"d":"2010.58"},1944.85,1875,0.32924]
[4,"ABBOTINDIA",16237.1,{"v":16228.699999999999,"d":"16228.70"},{"v":15958.399999999998,"d":"15958.40"},{"v":15679.699999999999,"d":"15679.70"},{"v":15409.399999999998,"d":"15409.40"},{"v":16507.399999999998,"d":"16507.40"},{"v":16777.699999999997,"d":"16777.70"},{"v":17056.399999999998,"d":"17056.40"},16499,15950,0.14286]
[5,"ABCAPITAL",83.2,{"v":83.85000000000001,"d":"83.85"},{"v":82.30000000000001,"d":"82.30"},{"v":81.4,"d":"81.40"},{"v":79.85000000000001,"d":"79.85"},{"v":84.75000000000001,"d":"84.75"},{"v":86.3,"d":"86.30"},{"v":87.20000000000002,"d":"87.20"},85.4,82.95,12.74174]
[6,"ABFRL",262.4,{"v":262.96666666666664,"d":"262.97"},{"v":259.4333333333333,"d":"259.43"},{"v":256.46666666666664,"d":"256.47"},{"v":252.93333333333328,"d":"252.93"},{"v":265.9333333333333,"d":"265.93"},{"v":269.4666666666667,"d":"269.47"},{"v":272.4333333333333,"d":"272.43"},266.5,260,6.05177]
[7,"ACC",1399.5,{"v":1401.8499999999997,"d":"1401.85"},{"v":1384.9999999999993,"d":"1385.00"},{"v":1370.4999999999995,"d":"1370.50"},{"v":1353.6499999999992,"d":"1353.65"},{"v":1416.3499999999995,"d":"1416.35"},{"v":1433.1999999999998,"d":"1433.20"},{"v":1447.6999999999996,"d":"1447.70"},1418.7,1387.35,8.8657]
[8,"ADANIGAS",149,{"v":152.26666666666665,"d":"152.27"},{"v":144.83333333333331,"d":"144.83"},{"v":140.66666666666666,"d":"140.67"},{"v":133.23333333333332,"d":"133.23"},{"v":156.4333333333333,"d":"156.43"},{"v":163.86666666666665,"d":"163.87"},{"v":168.0333333333333,"d":"168.03"},159.7,148.1,43.22437]
[9,"ADANIGREEN",171.55,173.65,{"v":169.45000000000002,"d":"169.45"},{"v":167.35000000000002,"d":"167.35"},{"v":163.15000000000003,"d":"163.15"},175.75,179.95,{"v":182.04999999999998,"d":"182.05"},177.85,171.55,9.96786]
[10,"ADANIPORTS",358.4,{"v":357.93333333333334,"d":"357.93"},{"v":353.3666666666667,"d":"353.37"},{"v":348.3333333333333,"d":"348.33"},{"v":343.76666666666665,"d":"343.77"},{"v":362.9666666666667,"d":"362.97"},{"v":367.5333333333334,"d":"367.53"},{"v":372.5666666666667,"d":"372.57"},362.5,352.9,41.64401]
{"$rows_left_out":514}
{"sheet":"Bulk Deals","index":4,"n_rows":44,"n_cols":8,"rows_kept":44,"merged":[[4,0,4,1],[4,2,4,3],[6,1,6,2]]}
[" "]
[]
[]
[]
[]
[{"$nulls":4},"Back To Main Page"]
["Subject :","BULK DEAL",null,{"$f":"Main!B10","v":"2020-02-27"}]
[]
["Date","Scrip code","Scrip Name","Client Name","Buy / Sell","Quantity Traded","Trade Price / Wt.Avg.trade price","Exchange  "]
["2020-02-26",500463,"AGCNET","SILVERLEAF OAK ADVISORS LLP","SELL",{"v":500000,"d":"500,000"},416.16,"BSE"]
["2020-02-26",500463,"AGCNET","SILVERLEAF OAK ADVISORS LLP","SELL",{"v":250000,"d":"250,000"},414.06,"BSE"]
["2020-02-26",500463,"AGCNET","RAJASTHAN GUM PRIVATE LIMITED","BUY",{"v":250000,"d":"250,000"},416.1,"BSE"]
["2020-02-26",500463,"AGCNET","ALPHA LEON ENTERPRISES LLP","BUY",{"v":161559,"d":"161,559"},415.92,"BSE"]
["2020-02-26",500463,"AGCNET","ALPHA LEON ENTERPRISES LLP","SELL",{"v":132117,"d":"132,117"},414.94,"BSE"]
["2020-02-26",500463,"AGCNET","CITOC INVESTMENT SERVICES LLP","BUY",{"v":296661,"d":"296,661"},413.68,"BSE"]
["2020-02-26",542934,"CBPL","SUFAL INVESTMENT","SELL",{"v":74000,"d":"74,000"},40.74,"BSE"]
["2020-02-26",542934,"CBPL","JIYA PRASHANTBHAI UKANI","BUY",{"v":40000,"d":"40,000"},40.76,"BSE"]
["2020-02-26",538787,"GBFL","NISHIL SURENDRABHAI MARFATIA","BUY",{"v":100000,"d":"100,000"},1.76,"BSE"]
["2020-02-26",538787,"GBFL","MUKESH KUMAR","SELL",{"v":137450,"d":"137,450"},1.76,"BSE"]
["2020-02-26",540134,"IISL","SHRI SANJAY J SHAH HUF","SELL",{"v":70000,"d":"70,000"},17.34,"BSE"]
{"$rows_left_out":25}
{"sheet":"Call Tracker (Equity & F&O)","index":5,"n_rows":333,"n_cols":18,"rows_kept":333,"merged":[[126,0,127,0],[126,1,127,1],[126,9,127,9],[126,11,127,11],[126,12,127,12],[126,13,127,13],[126,14,127,14],[137,0,138,0],[137,1,138,1],[137,9,138,9],[137,11,138,11],[137,12,138,12],[137,13,138,13],[137,14,138,14],[140,0,141,0],[140,1,141,1],[140,9,141,9],[140,11,141,11],[140,12,141,12],[140,13,141,13],[140,14,141,14],[142,0,143,0],[142,1,143,1],[142,9,143,9],[142,11,143,11],[142,12,143,12],[142,13,143,13],[142,14,143,14]]}
[]
[]
[]
[]
[{"$nulls":12},"Back To Main Page"]
["Retail Research Technical Calls & Fundamental Performance Report for the month of February-2020 "]
[{"$nulls":12},{"$f":"Main!B10","v":"2020-02-27"}]
[null,"Positional  Call"]
["Sr.no","Date",null,"Company","Rec","Rec Price","Stop Loss***","Call Closed At","Target","Remark","Profit / Loss per Share","Gain / Loss  %","Status","Closed Date","NSE Closed Price"]
[1,"2020-01-07",null,"ITC","Buy",237,222.2,220,"255-260","Loss of Rs.17/-",{"$f":"H10-F10","v":-17},{"$f":"K10/F10","v":{"v":-0.07172995780590717,"d":"-7.17%"}},"Unsuccessful","2020-02-01",{"$nulls":3},"R"]
[2,"2020-01-20",null,"IOC","Buy{}",117.5,114,117.25,130,"Loss of Rs.0.25/-",{"$f":"H11-F11","v":-0.25},{"$f":"K11/F11","v":{"v":-0.002127659574468085,"d":"-0.21%"}},"Neutral","2020-02-01",{"$nulls":3},"H"]
[3,"2020-02-03",null,"FINPIPE","Buy",552.5,518,567.5,"600-630","Profit of Rs.15/-",{"$f":"H12-F12","v":15},{"$f":"K12/F12","v":{"v":0.027149321266968326,"d":"2.71%"}},"Successful","2020-02-03",{"$nulls":3},"H"]
[4,"2020-02-03",null,"POWERGRID","Buy",183,169,190,"200-210","Profit of Rs.7/-",{"$f":"H13-F13","v":7},{"$f":"K13/F13","v":{"v":0.03825136612021858,"d":"3.83%"}},"Successful","2020-02-03",{"$nulls":3},"H"]
[5,"2020-02-04",null,"MARICO","Buy","306-308",287.8,null,"335-345","Open",{"$nulls":4},{"$f":"VLOOKUP(D14,Sheet2!A2:H1667,6,0)","v":306.15},null,null,"R"]
[6,"2020-02-04",null,"BAJAJFINSV","Sell","9500-9550",10100,null,"8500-8300","Open",{"$nulls":4},{"$f":"VLOOKUP(D15,Sheet2!A3:H1668,6,0)","v":9387},null,null,"H"]
[7,"2020-02-05",null,"INDHOTEL","Buy",140.5,132,130,"152-158","Loss of Rs.10.5/-",{"$f":"H16-F16","v":-10.5},{"$f":"K16/F16","v":{"v":-0.07473309608540925,"d":"-7.47%"}},"Unsuccessful","2020-02-18",{"$nulls":3},"H"]
[8,"2020-02-05",null,"FINPIPE","Buy",552,518,568.5,"600-630","Part Profit of Rs.16.5/-",16.5,{"v":0.029891304347826088,"d":"2.99%"},"Successful","2020-02-24",{"$f":"VLOOKUP(D17,Sheet2!A5:H1670,6,0)","v":553.4},null,null,"H"]
[9,"2020-02-05",null,"IOC","Buy",114,107,118,"124-128","Part Profit of Rs.4/-",{"$f":"H18-F18","v":4},{"$f":"K18/F18","v":{"v":0.03508771929824561,"d":"3.51%"}},"Successful","2020-02-10",{"$f":"VLOOKUP(D18,Sheet2!A6:H1671,6,0)","v":108.35},null,null,"H"]
[10,"2020-02-07",null,"LUPIN","Buy{}",700,668,701.25,"770-800","Profit of Rs.1.25/-",{"$f":"H19-F19","v":1.25},{"$f":"K19/F19","v":{"v":1.7857142857142857E-3,"d":"0.18%"}},"Neutral","2020-02-24",{"$f":"VLOOKUP(D19,Sheet2!A7:H1672,6,0)","v":669.8},null,null,"H"]
[11,"2020-02-10",null,"PRAJIND","Buy",105,98.7,108.5,"115-118","Part Profit of Rs.3.50/-",{"$f":"H20-F20","v":3.5},{"$f":"K20/F20","v":{"v":0.03333333333333333,"d":"3.33%"}},"Successful","2020-02-12",{"$f":"VLOOKUP(D20,Sheet2!A8:H1673,6,0)","v":99.95},null,null,"R"]
{"$rows_left_out":314}
{"sheet":"Sheet2","index":6,"n_rows":1899,"n_cols":14,"rows_kept":1899,"hidden":true}
["SYMBOL","SERIES","OPEN","HIGH","LOW","CLOSE","LAST","PREVCLOSE","TOTTRDQTY","TOTTRDVAL","TIMESTAMP","TOTALTRADES","ISIN","ISIN"]
["20MICRONS","EQ",33.9,33.9,33,33.5,33.65,33.5,11548,386386.3,"2020-02-26",266,"INE144J01027"]
["21STCENMGM","EQ",12.6,12.6,12.35,12.35,12.35,12.6,780,9633.6,"2020-02-26",17,"INE253B01015"]
["3IINFOTECH","EQ",2.1,2.15,2,2.05,2.05,2.15,1565461,3246949.25,"2020-02-26",582,"INE748C01020"]
["3MINDIA","EQ",20815,21100,20700,20771.6,20868,20881.25,3205,67065886.3,"2020-02-26",1112,"INE470A01017"]
["3PLAND","EQ",4.95,4.95,4.6,4.65,4.6,4.75,3502,16645.7,"2020-02-26",18,"INE105C01023"]
["5PAISA","EQ",165.05,177.9,161,165.75,166.7,173.45,14956,2490531.25,"2020-02-26",439,"INE618L01018"]
["63MOONS","EQ",93.5,98.1,93.15,94.25,94.1,94.85,95532,9097608.4,"2020-02-26",1839,"INE111B01023"]
["A2ZINFRA","EQ",4.45,4.85,4.4,4.6,4.5,4.7,370494,1751573.15,"2020-02-26",446,"INE619I01012"]
["AARTIDRUGS","EQ",679.95,764.8,665.55,747,749,677.75,328446,240346129.2,"2020-02-26",17916,"INE767A01016"]
["AARTIIND","EQ",1019.95,1027,995.95,999.7,998,1019.95,342707,347885653.2,"2020-02-26",12168,"INE769A01020"]
["AARVEEDEN","EQ",13.05,13.05,12.5,12.65,12.6,13.25,4729,60377.2,"2020-02-26",56,"INE273D01019"]
["AAVAS","EQ",1903,1944.85,1875,1903.75,1900,1913.8,32924,62830994.3,"2020-02-26",3990,"INE216P01012"]
["ABAN","EQ",22.8,22.8,21.55,22.2,22,22.5,45187,1003878.35,"2020-02-26",447,"INE421A01028"]
["ABB","EQ",1195,1212.35,1190,1201.4,1200,1200.2,25367,30498588.55,"2020-02-26",2002,"INE117A01022"]
["ABBOTINDIA","EQ",16201,16499,15950,16237.1,16336,16202.65,14286,231418845.3,"2020-02-26",4981,"INE358A01014"]
["ABCAPITAL","EQ",84,85.4,82.95,83.2,83.05,84.4,1274174,106917089.65,"2020-02-26",14034,"INE674K01013"]
["ABFRL","EQ",266.5,266.5,260,262.4,263,267.3,605177,158973096.75,"2020-02-26",25776,"INE647O01011"]
["ABSLBANETF","EQ",302.85,302.85,302.85,302.85,302.85,305.57,1,302.85,"2020-02-26",1,"INF209KB1O58"]
["ABSLNN50ET","EQ",281.07,281.07,276.34,277.37,276.34,283.85,45,12591.58,"2020-02-26",7,"INF209KB1B87"]
{"$rows_left_out":1698}
{"sheet":"Sheet1","index":7,"n_rows":0,"n_cols":0,"rows_kept":0,"hidden":true}

{"sheet":"Sheet3","index":8,"n_rows":0,"n_cols":0,"rows_kept":0,"hidden":true}

{"sheet":"Sheet4","index":9,"n_rows":0,"n_cols":0,"rows_kept":0,"hidden":true}

{"sheet":"Sheet5","index":10,"n_rows":0,"n_cols":0,"rows_kept":0,"hidden":true}