{"text_format":"3","workbook":"xlsx","n_sheets":11,"sheets":["Main","Future Intra","Cash Intra","MidCap Intra","Bulk Deals","Call Tracker (Equity & F&O)","Sheet2","Sheet1","Sheet3","Sheet4","Sheet5"],"not_rendered":{"images":4,"defined_names":5},"read":"whole","date_system":"1900"}

{"sheet":"Main","index":0,"n_rows":27,"n_cols":11,"rows_kept":27}
[null,"                                                                                                 "]
{"$rows_empty":8}
[null,"2020-01-01"]
[]
[null,"Sheet No.","Template Name","Summary"]
[null,1,"Future Intra","For Intraday trading in F&O segment"]
[null,2,"Cash Intra","For Intraday trading in cash market segment"]
[null,3,"Mid-cap Intra","For Intraday trading in Mid-cap stocks"]
[null,4,"Bulk Deals","Reveals Bulk Deals carried on NSE & BSE"]
[null,5,"Call Tracker"]
{"$rows_empty":9}
[{"$nulls":10},"`"]

{"sheet":"Future Intra","index":1,"n_rows":190,"n_cols":15,"rows_kept":190,"merged":[[8,0,9,0],[8,1,9,1],[8,2,9,2],[8,5,8,7],[8,8,8,10]]}
[]
[]
[]
[]
[{"$nulls":12},"Back to Main Page"]
["FOR INTRA DAY TRADING",{"$nulls":10},{"$f":"Main!B10","v":"2020-01-01"}]
[]
[]
["Sr.no","Sector","Scrip","CLOSE RATE","Pivot Point","Supports",null,null,"Resistances"]
[null,"Sector",null,"Point","Point","S1","S2","S3","R1","R2","R3","HIGH","LOW","OI","% Change in OI"]
[1,"Index","BANKNIFTY",32366.05,{"v":32402.649999999998,"d":"32402.65"},{"v":32283.399999999994,"d":"32283.40"},{"v":32200.749999999996,"d":"32200.75"},{"v":32081.499999999993,"d":"32081.50"},{"v":32485.299999999996,"d":"32485.30"},{"v":32604.550000000003,"d":"32604.55"},{"v":32687.199999999997,"d":"32687.20"},32521.9,32320,1343440,{"v":-0.057671534587489304,"d":"-5.77%"}]
[2,"Index","NIFTY",12246.25,{"v":12263,"d":"12263.00"},{"v":12213.4,"d":"12213.40"},12180.55,{"v":12130.949999999999,"d":"12130.95"},12295.85,{"v":12345.449999999999,"d":"12345.45"},{"v":12378.300000000001,"d":"12378.30"},12312.6,12230.15,13295625,{"v":0.0130231548149672,"d":"1.30%"}]
[3,"Index","NIFTYIT",{"v":15690,"d":"15690.00"},{"v":15694.333333333334,"d":"15694.33"},{"v":15650.666666666668,"d":"15650.67"},{"v":15611.333333333334,"d":"15611.33"},{"v":15567.666666666668,"d":"15567.67"},{"v":15733.666666666668,"d":"15733.67"},{"v":15777.333333333336,"d":"15777.33"},{"v":15816.666666666668,"d":"15816.67"},15738,15655,5050,{"v":0.01,"d":"1.00%"}]
[4,"Cement","ACC",1456.55,{"v":1458.5166666666664,"d":"1458.52"},{"v":1448.6333333333328,"d":"1448.63"},{"v":1440.7166666666662,"d":"1440.72"},{"v":1430.8333333333326,"d":"1430.83"},{"v":1466.433333333333,"d":"1466.43"},{"v":1476.3166666666666,"d":"1476.32"},{"v":1484.2333333333331,"d":"1484.23"},1468.4,1450.6,3290400,{"v":0.044836783945128925,"d":"4.48%"}]
[5,"Others","ADANIENT",{"v":209.4,"d":"209.40"},{"v":209.95000000000002,"d":"209.95"},{"v":208.00000000000003,"d":"208.00"},{"v":206.60000000000002,"d":"206.60"},{"v":204.65000000000003,"d":"204.65"},{"v":211.35000000000002,"d":"211.35"},{"v":213.3,"d":"213.30"},{"v":214.70000000000002,"d":"214.70"},211.9,208.55,28372000,{"v":-0.000140964195094446,"d":"-0.01%"}]
[6,"Others","ADANIPORTS",367.95,{"v":368.46666666666664,"d":"368.47"},{"v":366.5333333333333,"d":"366.53"},{"v":365.1166666666667,"d":"365.12"},{"v":363.18333333333334,"d":"363.18"},{"v":369.88333333333327,"d":"369.88"},{"v":371.81666666666655,"d":"371.82"},{"v":373.23333333333323,"d":"373.23"},370.4,367.05,36925000,{"v":-0.006457688685591282,"d":"-0.65%"}]
[7,"Power","ADANIPOWER",62.05,61.85,{"v":61.400000000000006,"d":"61.40"},{"v":60.75000000000001,"d":"60.75"},{"v":60.30000000000001,"d":"60.30"},{"v":62.5,"d":"62.50"},62.95,{"v":63.599999999999994,"d":"63.60"},62.3,61.2,72920000,{"v":0.018435754189944135,"d":"1.84%"}]
[8,"Automobile","AMARAJABAT",{"v":728.9,"d":"728.90"},{"v":729.7666666666668,"d":"729.77"},{"v":723.5833333333335,"d":"723.58"},{"v":718.2666666666668,"d":"718.27"},{"v":712.0833333333335,"d":"712.08"},{"v":735.0833333333335,"d":"735.08"},{"v":741.2666666666667,"d":"741.27"},{"v":746.5833333333335,"d":"746.58"},735.95,724.45,1425600,{"v":-5.6085249579360629E-4,"d":"-0.06%"}]
[9,"Cement","AMBUJACEM",{"v":197.8,"d":"197.80"},{"v":197.86666666666667,"d":"197.87"},{"v":196.03333333333336,"d":"196.03"},{"v":194.26666666666668,"d":"194.27"},{"v":192.43333333333337,"d":"192.43"},{"v":199.63333333333335,"d":"199.63"},{"v":201.46666666666667,"d":"201.47"},{"v":203.23333333333335,"d":"203.23"},199.7,196.1,18995000,{"v":0.03331973344213246,"d":"3.33%"}]
[10,"Others","APOLLOHOSP",{"v":1445.3,"d":"1445.30"},{"v":1440.1166666666668,"d":"1440.12"},{"v":1423.9833333333336,"d":"1423.98"},{"v":1402.6666666666667,"d":"1402.67"},{"v":1386.5333333333335,"d":"1386.53"},{"v":1461.4333333333336,"d":"1461.43"},{"v":1477.5666666666668,"d":"1477.57"},{"v":1498.8833333333337,"d":"1498.88"},1456.25,1418.8,1649000,{"v":-0.023682652457075192,"d":"-2.37%"}]
{"$rows_left_out":156}
{"sheet":"Cash Intra","index":2,"n_rows":247,"n_cols":13,"rows_kept":247,"merged":[[7,0,8,0],[7,1,8,1],[7,2,8,2],[7,3,8,3],[7,4,7,6],[7,7,7,9]]}
[]
[]
[]
[]
[{"$nulls":12},"Back to Main Page"]
["FOR INTRA DAY TRADING",{"$nulls":9},{"$f":"Main!B10","v":"2020-01-01"}]
[]
["Sr.no","Scrip","CLOSE RATE","Pivot Point","Supports",null,null,"Resistances"]
[null,null,"Point",null,"S1","S2","S3","R1","R2","R3","HIGH","LOW","Total Trade Quanity in Lakhs"]
[1,"Nifty 50",12168.45,{"v":12189.116666666669,"d":"12189.12"},{"v":12131.133333333337,"d":"12131.13"},{"v":12093.816666666668,"d":"12093.82"},{"v":12035.833333333336,"d":"12035.83"},{"v":12226.433333333338,"d":"12226.43"},{"v":12284.416666666668,"d":"12284.42"},{"v":12321.733333333339,"d":"12321.73"},12247.1,12151.8]
[2,"Nifty Bank",32161.65,32205.45,32064.95,31968.25,31827.75,32302.15,32442.65,{"v":32539.350000000002,"d":"32539.35"},32345.95,32108.75]
[3,"Nifty CPSE",1935.9,{"v":1928.6000000000001,"d":"1928.60"},{"v":1914.8000000000002,"d":"1914.80"},{"v":1893.7,"d":"1893.70"},{"v":1879.9,"d":"1879.90"},{"v":1949.7000000000003,"d":"1949.70"},{"v":1963.5,"d":"1963.50"},{"v":1984.6000000000004,"d":"1984.60"},1942.4,1907.5]
[4,"Nifty Infra",3255.3,{"v":3260.8333333333335,"d":"3260.83"},{"v":3244.166666666667,"d":"3244.17"},{"v":3233.0333333333333,"d":"3233.03"},{"v":3216.366666666667,"d":"3216.37"},{"v":3271.966666666667,"d":"3271.97"},{"v":3288.633333333334,"d":"3288.63"},{"v":3299.7666666666673,"d":"3299.77"},3277.5,3249.7]
[5,"Nifty IT",15652.4,{"v":15687.383333333333,"d":"15687.38"},{"v":15599.516666666666,"d":"15599.52"},{"v":15546.633333333333,"d":"15546.63"},{"v":15458.766666666666,"d":"15458.77"},{"v":15740.266666666666,"d":"15740.27"},{"v":15828.133333333331,"d":"15828.13"},{"v":15881.016666666666,"d":"15881.02"},15775.25,15634.5]
[6,"Nifty PSE",3226.6,{"v":3221.183333333333,"d":"3221.18"},{"v":3200.0666666666657,"d":"3200.07"},{"v":3173.533333333333,"d":"3173.53"},{"v":3152.4166666666656,"d":"3152.42"},{"v":3247.716666666666,"d":"3247.72"},{"v":3268.8333333333335,"d":"3268.83"},{"v":3295.366666666666,"d":"3295.37"},3242.3,3194.65]
[7,"Nifty Midcap 50",4701.1,{"v":4707.650000000001,"d":"4707.65"},{"v":4689.500000000001,"d":"4689.50"},{"v":4677.900000000001,"d":"4677.90"},{"v":4659.750000000001,"d":"4659.75"},{"v":4719.250000000001,"d":"4719.25"},{"v":4737.400000000001,"d":"4737.40"},{"v":4749.000000000001,"d":"4749.00"},4725.8,4696.05]
[8,"ACC",1445.65,{"v":1449.0666666666666,"d":"1449.07"},{"v":1438.1333333333332,"d":"1438.13"},{"v":1430.6166666666666,"d":"1430.62"},{"v":1419.6833333333332,"d":"1419.68"},{"v":1456.5833333333333,"d":"1456.58"},{"v":1467.5166666666667,"d":"1467.52"},{"v":1475.0333333333333,"d":"1475.03"},1460,1441.55,5.81119]
[9,"AUBANK",803.1,{"v":802.5666666666666,"d":"802.57"},{"v":783.2333333333332,"d":"783.23"},{"v":763.3666666666667,"d":"763.37"},{"v":744.0333333333333,"d":"744.03"},{"v":822.4333333333332,"d":"822.43"},{"v":841.7666666666667,"d":"841.77"},{"v":861.6333333333331,"d":"861.63"},821.9,782.7,5.64939]
[10,"ADANIPORTS",366,{"v":366.51666666666665,"d":"366.52"},{"v":364.3833333333333,"d":"364.38"},{"v":362.76666666666665,"d":"362.77"},{"v":360.6333333333333,"d":"360.63"},{"v":368.1333333333333,"d":"368.13"},{"v":370.26666666666665,"d":"370.27"},{"v":371.8833333333333,"d":"371.88"},368.65,364.9,20.43206]
[11,"ADANIPOWER",61.8,{"v":61.666666666666664,"d":"61.67"},{"v":61.18333333333333,"d":"61.18"},{"v":60.56666666666666,"d":"60.57"},{"v":60.08333333333333,"d":"60.08"},{"v":62.28333333333333,"d":"62.28"},{"v":62.766666666666666,"d":"62.77"},{"v":63.38333333333333,"d":"63.38"},62.15,61.05,75.55401]
{"$rows_left_out":228}
{"sheet":"MidCap Intra","index":3,"n_rows":545,"n_cols":13,"rows_kept":545,"merged":[[0,0,0,1],[8,0,9,0],[8,1,9,1],[8,2,9,2],[8,3,9,3],[8,4,8,6],[8,7,8,9]]}
[]
[]
[]
[]
[{"$nulls":11},"Back To Main Page"]
["FOR INTRA DAY TRADING",{"$nulls":9},{"$f":"Main!B10","v":"2020-01-01"}]
[null,null," "]
[]
["Sr.no","Scrip","CLOSE RATE","Pivot Point","Supports",null,null,"Resistances"]
[null,null,"Point",null,"S1","S2","S3","R1","R2","R3","HIGH","LOW","Total Trade Quanity in Lakhs"]
[1,"3MINDIA",21304.7,{"v":21384.566666666666,"d":"21384.57"},{"v":21130.13333333333,"d":"21130.13"},{"v":20955.566666666666,"d":"20955.57"},{"v":20701.13333333333,"d":"20701.13"},{"v":21559.13333333333,"d":"21559.13"},{"v":21813.566666666666,"d":"21813.57"},{"v":21988.13333333333,"d":"21988.13"},21639,21210,0.01333]
[2,"ACC",1445.65,{"v":1449.0666666666666,"d":"1449.07"},{"v":1438.1333333333332,"d":"1438.13"},{"v":1430.6166666666666,"d":"1430.62"},{"v":1419.6833333333332,"d":"1419.68"},{"v":1456.5833333333333,"d":"1456.58"},{"v":1467.5166666666667,"d":"1467.52"},{"v":1475.0333333333333,"d":"1475.03"},1460,1441.55,5.81119]
[3,"AIAENG",1649.5,{"v":1642.8333333333333,"d":"1642.83"},{"v":1635.6666666666665,"d":"1635.67"},{"v":1621.8333333333333,"d":"1621.83"},{"v":1614.6666666666665,"d":"1614.67"},{"v":1656.6666666666665,"d":"1656.67"},{"v":1663.833333333333,"d":"1663.83"},{"v":1677.6666666666665,"d":"1677.67"},1650,1629,0.12529]
[4,"APLAPOLLO",1877.7,{"v":1868.5333333333335,"d":"1868.53"},{"v":1844.166666666667,"d":"1844.17"},{"v":1810.6333333333334,"d":"1810.63"},{"v":1786.2666666666669,"d":"1786.27"},{"v":1902.066666666667,"d":"1902.07"},{"v":1926.4333333333334,"d":"1926.43"},{"v":1959.9666666666672,"d":"1959.97"},1892.9,1835,0.5796]
[5,"AUBANK",803.1,{"v":802.5666666666666,"d":"802.57"},{"v":783.2333333333332,"d":"783.23"},{"v":763.3666666666667,"d":"763.37"},{"v":744.0333333333333,"d":"744.03"},{"v":822.4333333333332,"d":"822.43"},{"v":841.7666666666667,"d":"841.77"},{"v":861.6333333333331,"d":"861.63"},821.9,782.7,5.64939]
[6,"AAVAS",1981.1,{"v":1960.8500000000001,"d":"1960.85"},{"v":1922.7000000000003,"d":"1922.70"},{"v":1864.3000000000002,"d":"1864.30"},{"v":1826.1500000000003,"d":"1826.15"},{"v":2019.2500000000002,"d":"2019.25"},{"v":2057.4000000000005,"d":"2057.40"},{"v":2115.8,"d":"2115.80"},1999,1902.45,1.01783]
[7,"ABBOTINDIA",13075.5,{"v":13108.9,"d":"13108.90"},{"v":13015.8,"d":"13015.80"},{"v":12956.1,"d":"12956.10"},{"v":12863,"d":"12863.00"},{"v":13168.599999999999,"d":"13168.60"},{"v":13261.7,"d":"13261.70"},{"v":13321.399999999998,"d":"13321.40"},13202,13049.2,0.03735]
[8,"ADANIGAS",162.7,160.75,{"v":157.1,"d":"157.10"},{"v":151.5,"d":"151.50"},147.85,166.35,{"v":169.99999999999997,"d":"170.00"},{"v":175.6,"d":"175.60"},164.4,155.15,38.97522]
[9,"ADANIGREEN",166.45,{"v":164.66666666666666,"d":"164.67"},{"v":162.88333333333333,"d":"162.88"},{"v":159.31666666666666,"d":"159.32"},{"v":157.53333333333333,"d":"157.53"},{"v":168.23333333333332,"d":"168.23"},{"v":170.01666666666668,"d":"170.02"},{"v":173.58333333333331,"d":"173.58"},166.45,161.1,20.50662]
[10,"ADANIPORTS",366,{"v":366.51666666666665,"d":"366.52"},{"v":364.3833333333333,"d":"364.38"},{"v":362.76666666666665,"d":"362.77"},{"v":360.6333333333333,"d":"360.63"},{"v":368.1333333333333,"d":"368.13"},{"v":370.26666666666665,"d":"370.27"},{"v":371.8833333333333,"d":"371.88"},368.65,364.9,20.43206]
{"$rows_left_out":513}
{"sheet":"Bulk Deals","index":4,"n_rows":106,"n_cols":8,"rows_kept":106,"merged":[[4,0,4,1],[4,2,4,3],[6,1,6,2]]}
[" "]
[]
[]
[]
[]
[{"$nulls":4},"Back To Main Page"]
["Subject :","BULK DEAL",null,{"$f":"Main!B10","v":"2020-01-01"}]
[]
["Date","Scrip code","Scrip Name","Client Name","Buy / Sell","Quantity Traded","Trade Price / Wt.Avg.trade price","Exchange  "]
["2019-12-31",542057,"BCPL","ALIPTA PARAG MALDE .","BUY",{"v":100000,"d":"100,000"},{"v":40.7,"d":"40.70"},"BSE"]
["2019-12-31",542057,"BCPL","AMBE SECURITIES PRIVATE LIMITED","SELL",{"v":100000,"d":"100,000"},{"v":40.5,"d":"40.50"},"BSE"]
["2019-12-31",542057,"BCPL","MEHUL HASMUKH SHAH","BUY",{"v":100000,"d":"100,000"},40.5,"BSE"]
["2019-12-31",542057,"BCPL","MEHUL HASMUKH SHAH","SELL",{"v":100000,"d":"100,000"},40.7,"BSE"]
["2019-12-31",539097,"HKG","SAMRUDDHI COMMODITIES TRADING LIMITED","SELL",{"v":20000,"d":"20,000"},43.44,"BSE"]
["2019-12-31",539679,"KAPILRAJ","B B COMMERCIAL LTD","BUY",{"v":120000,"d":"120,000"},4.51,"BSE"]
["2019-12-31",539679,"KAPILRAJ","B B COMMERCIAL LTD","SELL",{"v":120000,"d":"120,000"},4.52,"BSE"]
["2019-12-31",539679,"KAPILRAJ","MANJULABEN BHAVESHKUMAR RANGEE","BUY",{"v":340000,"d":"340,000"},4.53,"BSE"]
["2019-12-31",539679,"KAPILRAJ","MANJULABEN BHAVESHKUMAR RANGEE","SELL",{"v":340000,"d":"340,000"},4.52,"BSE"]
["2019-12-31",539679,"KAPILRAJ","NIRU DANAJIBHAI SUMERA","BUY",{"v":100000,"d":"100,000"},4.53,"BSE"]
["2019-12-31",539679,"KAPILRAJ","NIRU DANAJIBHAI SUMERA","SELL",{"v":100000,"d":"100,000"},4.52,"BSE"]
{"$rows_left_out":87}
{"sheet":"Call Tracker (Equity & F&O)","index":5,"n_rows":361,"n_cols":18,"rows_kept":361,"merged":[[143,0,144,0],[143,1,144,1],[143,9,144,9],[143,11,144,11],[143,12,144,12],[143,13,144,13],[143,14,144,14],[145,0,146,0],[145,1,146,1],[145,9,146,9],[145,11,146,11],[145,12,146,12],[145,13,146,13],[145,14,146,14],[147,0,148,0],[147,1,148,1],[147,9,148,9],[147,11,148,11],[147,12,148,12],[147,13,148,13],[147,14,148,14],[150,0,151,0],[150,1,151,1],[150,9,151,9],[150,11,151,11],[150,12,151,12],[150,13,151,13],[150,14,151,14],[153,0,154,0],[153,1,154,1],[153,9,154,9],[153,11,154,11],[153,12,154,12],[153,13,154,13],[153,14,154,14],[155,0,156,0],[155,1,156,1],[155,9,156,9],[155,11,156,11],[155,12,156,12],[155,13,156,13],[155,14,156,14],[175,0,176,0],[175,1,176,1],[175,9,176,9],[175,11,176,11],[175,12,176,12],[175,13,176,13],[175,14,176,14],[177,0,178,0],[177,1,178,1],[177,9,178,9],[177,11,178,11],[177,12,178,12],[177,13,178,13],[177,14,178,14],[183,0,184,0],[183,1,184,1],[183,9,184,9],[183,11,184,11],[183,12,184,12],[183,13,184,13],[183,14,184,14],[186,0,187,0],[186,1,187,1],[186,9,187,9],[186,11,187,11],[186,12,187,12],[186,13,187,13],[186,14,187,14],[188,0,189,0],[188,1,189,1],[188,9,189,9],[188,11,189,11],[188,12,189,12],[188,13,189,13],[188,14,189,14]]}
[]
[]
[]
[]
[{"$nulls":12},"Back To Main Page"]
["Retail Research Technical Calls & Fundamental Performance Report for the month of December-2019 "]
[{"$nulls":12},{"$f":"Main!B10","v":"2020-01-01"}]
[null,"Positional  Call"]
["Sr.no","Date",null,"Company","Rec","Rec Price","Stop Loss***","Call Closed At","Target","Remark","Profit / Loss per Share","Gain / Loss  %","Status","Closed Date","NSE Closed Price"]
[1,"2019-10-07",null,"PIDILITIND","Buy{}",1367.5,1297,1413.5,"1500-1520","Part Profit of Rs.46/-",{"$f":"H10-F10","v":46},{"$f":"K10/F10","v":{"v":0.03363802559414991,"d":"3.36%"}},"Successful","2019-10-31",{"$f":"VLOOKUP(D10,Sheet2!A51:M1690,6,0)","v":1386.9},null,null,"R"]
[2,"2019-11-11",null,"POWERGRID","Buy{}",192,183,190,"208-212","Loss of Rs.2/-",{"$f":"H11-F11","v":-2},{"$f":"K11/F11","v":{"v":-0.010416666666666666,"d":"-1.04%"}},"Unsuccessful","2019-12-11",{"$nulls":3},"R"]
[3,"2019-11-14",null,"HEIDELBERG","Buy{}",186.5,174,194.5,"205-210","Part Profit of Rs.8/-",{"$f":"H12-F12","v":8},{"$f":"K12/F12","v":{"v":0.04289544235924933,"d":"4.29%"}},"Successful","2019-11-20",{"$f":"VLOOKUP(D12,Sheet2!A71:M1710,6,0)","v":174.95},null,null,"H"]
[4,"2019-11-18",null,"BAJAJ-AUTO","Sell","3180-3200",3356.7,null,"2900-2850","Open",{"$nulls":4},{"$f":"VLOOKUP(D13,Sheet2!A74:M1713,6,0)","v":3185},null,null,"R"]
[5,"2019-11-18",null,"THERMAX","Buy",1030,977,1080,"1120-1140","Profit of Rs.50/-",{"$f":"H14-F14","v":50},{"$f":"K14/F14","v":{"v":0.04854368932038835,"d":"4.85%"}},"Successful","2019-12-31",{"$nulls":3},"H"]
[6,"2019-11-20",null,"BRITANNIA","Buy","3075-3100",2930,null,"3380-3420","Open",{"$nulls":4},{"$f":"VLOOKUP(D15,Sheet2!A76:M1715,6,0)","v":3027.8},null,null,"H"]
[7,"2019-11-21",null,"HINDUNILVR","Buy",2020,1917,2082,"2200-2250","Part Profit of Rs.62/-",{"$f":"H16-F16","v":62},{"$f":"K16/F16","v":{"v":0.030693069306930693,"d":"3.07%"}},"Successful","2019-11-27",{"$f":"VLOOKUP(D16,Sheet2!A77:M1716,6,0)","v":1923},null,null,"H"]
[8,"2019-11-22",null,"GODREJPROP","Buy",885,837.7,932.5,"965-985","Profit of Rs.47.50/-",{"$f":"H17-F17","v":47.5},{"$f":"K17/F17","v":{"v":0.05367231638418079,"d":"5.37%"}},"Successful","2019-12-12",{"$nulls":3},"R"]
[9,"2019-11-27",null,"LT","Buy","1330-1340",1270,null,"1450-1500","Open",{"$nulls":4},{"$f":"VLOOKUP(D18,Sheet2!A80:M1719,6,0)","v":1298.2},null,null,"H"]
[10,"2019-12-02",null,"TCS","Buy",2030,1895,2110,"2200-2250","Profit of Rs.80/-",{"$f":"H19-F19","v":80},{"$f":"K19/F19","v":{"v":0.03940886699507389,"d":"3.94%"}},"Successful","2019-12-16",{"$nulls":3},"H"]
[11,"2019-12-02",null,"HAVELLS","Buy","662-667",632.7,null,"725-735","Open",{"$nulls":4},{"$f":"VLOOKUP(D20,Sheet2!A82:M1721,6,0)","v":647.15},null,null,"R"]
{"$rows_left_out":335}
{"sheet":"Sheet2","index":6,"n_rows":1899,"n_cols":14,"rows_kept":1899,"hidden":true}
["SYMBOL","SERIES","OPEN","HIGH","LOW","CLOSE","LAST","PREVCLOSE","TOTTRDQTY","TOTTRDVAL","TIMESTAMP","TOTALTRADES","ISIN","ISIN"]
["20MICRONS","EQ",33.6,37.4,33.1,35.2,35.25,33.1,242285,8636712.9,"2019-12-31",2089,"INE144J01027"]
["21STCENMGM","EQ",15.3,15.3,15.3,15.3,15.3,15,1129,17273.7,"2019-12-31",4,"INE253B01015"]
["3IINFOTECH","EQ",2,2.05,1.95,1.95,2,2,655941,1294489.05,"2019-12-31",441,"INE748C01020"]
["3MINDIA","EQ",21639,21639,21210,21304.7,21230,21479.05,1333,28560135,"2019-12-31",632,"INE470A01017"]
["3PLAND","EQ",5.75,6,5.75,6,6,5.75,2325,13943.75,"2019-12-31",15,"INE105C01023"]
["5PAISA","EQ",194,197.9,186.1,192.5,191.6,194.35,8539,1627458.6,"2019-12-31",436,"INE618L01018"]
["63MOONS","EQ",103.4,103.7,101.5,101.8,102,103,62501,6399158.2,"2019-12-31",2141,"INE111B01023"]
["A2ZINFRA","EQ",7.6,7.8,7.5,7.55,7.5,7.6,167651,1274637.5,"2019-12-31",341,"INE619I01012"]
["AARTIDRUGS","EQ",579,587.7,563,579.3,582,575.15,11722,6722285.25,"2019-12-31",832,"INE767A01016"]
["AARTIIND","EQ",838,845,810,830.75,835,837.75,134712,112748248.75,"2019-12-31",7254,"INE769A01020"]
["AARVEEDEN","EQ",14.9,14.9,13.6,14,14,13.95,9969,140283.75,"2019-12-31",76,"INE273D01019"]
["AAVAS","EQ",1917,1999,1902.45,1981.1,1998.85,1918.6,101783,200515104.15,"2019-12-31",10841,"INE216P01012"]
["ABAN","EQ",25.95,26.7,25.45,25.7,25.6,25.85,53897,1401129.4,"2019-12-31",574,"INE421A01028"]
["ABB","BE",1275,1297.1,1275,1285.25,1289,1295.45,46306,59489239.9,"2019-12-31",1268,"INE117A01022"]
["ABBOTINDIA","EQ",13199,13202,13049.2,13075.5,13050,13196.75,3735,49085192.45,"2019-12-31",1616,"INE358A01014"]
["ABCAPITAL","EQ",101.75,104.8,101.5,102.7,102.55,102.3,2669300,275239995.7,"2019-12-31",31664,"INE674K01013"]
["ABFRL","EQ",228,233.15,224.65,231.7,231.2,226.95,546866,125289025.2,"2019-12-31",10323,"INE647O01011"]
["ABMINTLTD","BE",16.25,16.25,14.75,14.75,14.75,15.5,120,1935,"2019-12-31",5,"INE251C01017"]
["ABSLBANETF","EQ",322.97,322.97,322.97,322.97,322.97,324.16,1,322.97,"2019-12-31",1,"INF209KB1O58"]
{"$rows_left_out":1699}
{"sheet":"Sheet1","index":7,"n_rows":0,"n_cols":0,"rows_kept":0,"hidden":true}

{"sheet":"Sheet3","index":8,"n_rows":0,"n_cols":0,"rows_kept":0,"hidden":true}

{"sheet":"Sheet4","index":9,"n_rows":0,"n_cols":0,"rows_kept":0,"hidden":true}

{"sheet":"Sheet5","index":10,"n_rows":0,"n_cols":0,"rows_kept":0,"hidden":true}