{"text_format":"3","workbook":"xlsx","n_sheets":6,"sheets":["Main","Future Intra","Cash Intra","MidCap Intra","Bulk Deals","Call Tracker (Equity & F&O)"],"not_rendered":{"images":4,"defined_names":1},"read":"whole","date_system":"1900"}

{"sheet":"Main","index":0,"n_rows":27,"n_cols":11,"rows_kept":27}
[null,"                                                                                                 "]
[]
[]
[]
[]
[{"$nulls":6}," "]
[]
[]
[]
[null,"2024-01-30"]
[]
[null,"Sheet No.","Template Name","Summary"]
[null,1,"Future Intra","For Intraday trading in F&O segment"]
[null,2,"Cash Intra","For Intraday trading in cash market segment"]
[null,3,"Mid-cap Intra","For Intraday trading in Mid-cap stocks"]
[null,4,"Bulk Deals","Reveals Bulk Deals carried on NSE & BSE"]
[null,5,"Call Tracker"]
{"$rows_empty":9}
[{"$nulls":10},"`"]

{"sheet":"Future Intra","index":1,"n_rows":236,"n_cols":16,"rows_kept":236,"merged":[[8,0,9,0],[8,1,9,1],[8,2,9,2],[8,3,9,3],[8,6,8,8],[8,9,8,11]]}
[]
[]
[]
[]
[{"$nulls":12},"Back to Main Page"]
["FOR INTRA DAY TRADING",{"$nulls":10},{"$f":"Main!B10","v":"2024-01-30"}]
[]
[]
["Sr.no","Sector","Scrip","Expiry Date","CLOSE RATE","Pivot Point","Supports",null,null,"Resistances"]
[{"$nulls":4},"Point","Point","S1","S2","S3","R1","R2","R3","HIGH","LOW","OI","% Change in OI"]
[1,"Index","NIFTY","2024-02-29",21855.25,21771.75,{"v":21658.5,"d":"21658.50"},21461.75,{"v":21348.5,"d":"21348.50"},{"v":21968.5,"d":"21968.50"},22081.75,{"v":22278.5,"d":"22278.50"},21885,21575,13279800,{"v":0.031576984922281,"d":"3.16%"}]
[2,"Index","BANKNIFTY","2024-02-29",45735.05,{"v":45742.666666666664,"d":"45742.67"},{"v":45446.33333333333,"d":"45446.33"},{"v":45157.61666666666,"d":"45157.62"},{"v":44861.283333333326,"d":"44861.28"},{"v":46031.38333333333,"d":"46031.38"},{"v":46327.71666666666,"d":"46327.72"},{"v":46616.433333333334,"d":"46616.43"},46039,45453.95,3482220,{"v":-0.055329711693015114,"d":"-5.53%"}]
[3,"Index","FINNIFTY","2024-01-30",20450.75,20405.25,{"v":20310.5,"d":"20310.50"},20170.25,{"v":20075.5,"d":"20075.50"},{"v":20545.5,"d":"20545.50"},20640.25,{"v":20780.5,"d":"20780.50"},20500,20265,97240,{"v":-0.1803776129467296,"d":"-18.04%"}]
[4,"Index","MIDCPNIFTY","2024-02-26",10669.25,{"v":10595.316666666668,"d":"10595.32"},{"v":10505.683333333334,"d":"10505.68"},{"v":10342.116666666667,"d":"10342.12"},{"v":10252.483333333334,"d":"10252.48"},{"v":10758.883333333335,"d":"10758.88"},{"v":10848.51666666667,"d":"10848.52"},{"v":11012.083333333336,"d":"11012.08"},10684.95,10431.75,664500,{"v":-0.25023271557925025,"d":"-25.02%"}]
[5,"Chemical","AARTIIND","2024-02-29",{"v":645.4,"d":"645.40"},{"v":644.0999999999999,"d":"644.10"},{"v":639.1499999999999,"d":"639.15"},{"v":632.9,"d":"632.90"},{"v":627.9499999999999,"d":"627.95"},{"v":650.3499999999998,"d":"650.35"},{"v":655.2999999999998,"d":"655.30"},{"v":661.5499999999997,"d":"661.55"},649.05,637.85,11848000,{"v":0.019533602960158335,"d":"1.95%"}]
[6,"Capital_Goods","ABB","2024-02-29",4817.25,{"v":4796.233333333334,"d":"4796.23"},{"v":4758.366666666667,"d":"4758.37"},{"v":4699.483333333334,"d":"4699.48"},{"v":4661.616666666667,"d":"4661.62"},{"v":4855.116666666667,"d":"4855.12"},{"v":4892.983333333334,"d":"4892.98"},{"v":4951.866666666667,"d":"4951.87"},4834.1,4737.35,1005375,{"v":0.0664280031821798,"d":"6.64%"}]
[7,"Pharma","ABBOTINDIA","2024-02-29",25654.65,25558.25,{"v":25371.5,"d":"25371.50"},25088.35,{"v":24901.6,"d":"24901.60"},{"v":25841.4,"d":"25841.40"},26028.15,{"v":26311.300000000003,"d":"26311.30"},25745,25275.1,171480,{"v":0.02658045977011494,"d":"2.66%"}]
[8,"Others","ABCAPITAL","2024-02-29",{"v":169.6,"d":"169.60"},{"v":168.9,"d":"168.90"},{"v":167.3,"d":"167.30"},{"v":165,"d":"165.00"},{"v":163.4,"d":"163.40"},{"v":171.20000000000002,"d":"171.20"},{"v":172.79999999999998,"d":"172.80"},{"v":175.10000000000002,"d":"175.10"},170.5,166.6,58492800,{"v":-0.0042287185144328,"d":"-0.42%"}]
[9,"Textile","ABFRL","2024-02-29",{"v":244.6,"d":"244.60"},{"v":246.0666666666667,"d":"246.07"},{"v":241.08333333333337,"d":"241.08"},{"v":237.5666666666667,"d":"237.57"},{"v":232.58333333333337,"d":"232.58"},{"v":249.58333333333337,"d":"249.58"},{"v":254.56666666666666,"d":"254.57"},{"v":258.08333333333337,"d":"258.08"},251.05,242.55,35050600,{"v":0.06392549917133612,"d":"6.39%"}]
[10,"Cement","ACC","2024-02-29",{"v":2511.4,"d":"2511.40"},{"v":2517.6666666666665,"d":"2517.67"},{"v":2456.333333333333,"d":"2456.33"},{"v":2401.2666666666664,"d":"2401.27"},{"v":2339.933333333333,"d":"2339.93"},{"v":2572.733333333333,"d":"2572.73"},{"v":2634.066666666666,"d":"2634.07"},{"v":2689.133333333333,"d":"2689.13"},2579,2462.6,4102500,{"v":-0.041427169493901586,"d":"-4.14%"}]
{"$rows_left_out":195}
{"sheet":"Cash Intra","index":2,"n_rows":245,"n_cols":13,"rows_kept":245,"merged":[[7,0,8,0],[7,1,8,1],[7,2,8,2],[7,3,8,3],[7,4,7,6],[7,7,7,9]]}
[]
[]
[]
[]
[{"$nulls":12},"Back to Main Page"]
["FOR INTRA DAY TRADING",{"$nulls":9},{"$f":"Main!B10","v":"2024-01-30"}]
[]
["Sr.no",null,"CLOSE RATE","Pivot Point","Supports",null,null,"Resistances"]
[{"$nulls":4},"S1","S2","S3","R1","R2","R3","HIGH","LOW","Total Trade Quanity in Lakhs"]
[1,"Nifty 50",{"v":21737.6,"d":"21737.60"},{"v":21643.483333333334,"d":"21643.48"},{"v":21523.716666666667,"d":"21523.72"},{"v":21309.833333333332,"d":"21309.83"},{"v":21190.066666666666,"d":"21190.07"},{"v":21857.36666666667,"d":"21857.37"},{"v":21977.13333333334,"d":"21977.13"},{"v":22191.01666666667,"d":"22191.02"},21763.25,{"v":21429.6,"d":"21429.60"}]
[2,"Nifty Bank",45442.35,{"v":45404.53333333333,"d":"45404.53"},{"v":45148.71666666667,"d":"45148.72"},{"v":44855.083333333336,"d":"44855.08"},{"v":44599.26666666667,"d":"44599.27"},{"v":45698.166666666664,"d":"45698.17"},{"v":45953.98333333333,"d":"45953.98"},{"v":46247.61666666666,"d":"46247.62"},45660.35,{"v":45110.9,"d":"45110.90"}]
[3,"Nifty CPSE",{"v":5420,"d":"5420.00"},{"v":5367.3,"d":"5367.30"},{"v":5291.650000000001,"d":"5291.65"},{"v":5163.3,"d":"5163.30"},{"v":5087.650000000001,"d":"5087.65"},{"v":5495.650000000001,"d":"5495.65"},{"v":5571.3,"d":"5571.30"},{"v":5699.650000000001,"d":"5699.65"},5442.95,5238.95]
[4,"Nifty Infra",{"v":7937.8,"d":"7937.80"},{"v":7860.3,"d":"7860.30"},{"v":7770.700000000001,"d":"7770.70"},{"v":7603.6,"d":"7603.60"},{"v":7514.000000000001,"d":"7514.00"},{"v":8027.400000000001,"d":"8027.40"},{"v":8117.000000000001,"d":"8117.00"},{"v":8284.1,"d":"8284.10"},{"v":7949.9,"d":"7949.90"},{"v":7693.2,"d":"7693.20"}]
[5,"Nifty IT",{"v":36531.9,"d":"36531.90"},{"v":36512.21666666667,"d":"36512.22"},{"v":36371.183333333334,"d":"36371.18"},{"v":36210.46666666667,"d":"36210.47"},{"v":36069.433333333334,"d":"36069.43"},{"v":36672.933333333334,"d":"36672.93"},{"v":36813.966666666674,"d":"36813.97"},{"v":36974.683333333334,"d":"36974.68"},36653.25,{"v":36351.5,"d":"36351.50"}]
[6,"Nifty PSE",{"v":8657.8,"d":"8657.80"},{"v":8575.016666666665,"d":"8575.02"},{"v":8467.63333333333,"d":"8467.63"},{"v":8277.466666666665,"d":"8277.47"},{"v":8170.08333333333,"d":"8170.08"},{"v":8765.183333333329,"d":"8765.18"},{"v":8872.566666666664,"d":"8872.57"},{"v":9062.733333333328,"d":"9062.73"},{"v":8682.4,"d":"8682.40"},8384.85]
[7,"Nifty Midcap 50",{"v":13543.8,"d":"13543.80"},{"v":13456.383333333331,"d":"13456.38"},{"v":13355.966666666664,"d":"13355.97"},{"v":13168.133333333331,"d":"13168.13"},{"v":13067.716666666664,"d":"13067.72"},{"v":13644.216666666664,"d":"13644.22"},{"v":13744.633333333331,"d":"13744.63"},{"v":13932.466666666664,"d":"13932.47"},{"v":13556.8,"d":"13556.80"},13268.55]
[8,"ABB",4791.55,{"v":4771.366666666667,"d":"4771.37"},{"v":4735.583333333334,"d":"4735.58"},{"v":4679.616666666667,"d":"4679.62"},{"v":4643.833333333334,"d":"4643.83"},{"v":4827.333333333334,"d":"4827.33"},{"v":4863.116666666667,"d":"4863.12"},{"v":4919.083333333334,"d":"4919.08"},4807.15,4715.4,0.87854]
[9,"ABBOTINDIA",25568.05,{"v":25465.88333333333,"d":"25465.88"},{"v":25122.516666666663,"d":"25122.52"},{"v":24676.98333333333,"d":"24676.98"},{"v":24333.61666666666,"d":"24333.62"},{"v":25911.416666666664,"d":"25911.42"},{"v":26254.783333333333,"d":"26254.78"},{"v":26700.316666666666,"d":"26700.32"},25809.25,25020.35,0.32932]
[10,"ABCAPITAL",168.3,{"v":167.75000000000003,"d":"167.75"},{"v":166.35000000000005,"d":"166.35"},{"v":164.40000000000003,"d":"164.40"},{"v":163.00000000000006,"d":"163.00"},{"v":169.70000000000005,"d":"169.70"},{"v":171.10000000000002,"d":"171.10"},{"v":173.05000000000004,"d":"173.05"},169.15,165.8,29.97788]
[11,"ABFRL",243.05,{"v":244.38333333333333,"d":"244.38"},{"v":239.76666666666665,"d":"239.77"},{"v":236.48333333333332,"d":"236.48"},{"v":231.86666666666665,"d":"231.87"},{"v":247.66666666666666,"d":"247.67"},{"v":252.28333333333333,"d":"252.28"},{"v":255.56666666666666,"d":"255.57"},249,241.1,58.47555]
{"$rows_left_out":226}
{"sheet":"MidCap Intra","index":3,"n_rows":530,"n_cols":13,"rows_kept":530,"merged":[[0,0,0,1],[8,0,9,0],[8,1,9,1],[8,2,9,2],[8,3,9,3],[8,4,8,6],[8,7,8,9]]}
[]
[]
[]
[]
[{"$nulls":11},"Back To Main Page"]
["FOR INTRA DAY TRADING",{"$nulls":9},{"$f":"Main!B10","v":"2024-01-30"}]
[null,null," "]
[]
["Sr.no","Scrip","CLOSE RATE","Pivot Point","Supports",null,null,"Resistances"]
[{"$nulls":4},"S1","S2","S3","R1","R2","R3","HIGH","LOW","Total Trade Quanity in Lakhs"]
[1,"360ONE",634,{"v":634.5166666666667,"d":"634.52"},{"v":625.4833333333333,"d":"625.48"},{"v":616.9666666666667,"d":"616.97"},{"v":607.9333333333334,"d":"607.93"},{"v":643.0333333333333,"d":"643.03"},{"v":652.0666666666666,"d":"652.07"},{"v":660.5833333333333,"d":"660.58"},643.55,626,8.99275]
[2,"3MINDIA",33724.15,{"v":33813.36666666667,"d":"33813.37"},{"v":33366.78333333334,"d":"33366.78"},{"v":33009.41666666667,"d":"33009.42"},{"v":32562.833333333343,"d":"32562.83"},{"v":34170.73333333334,"d":"34170.73"},{"v":34617.316666666666,"d":"34617.32"},{"v":34974.683333333334,"d":"34974.68"},34259.95,33456,0.02703]
[3,"AARTIDRUGS",506.1,{"v":501.3666666666666,"d":"501.37"},{"v":492.73333333333323,"d":"492.73"},{"v":479.3666666666666,"d":"479.37"},{"v":470.73333333333323,"d":"470.73"},{"v":514.7333333333332,"d":"514.73"},{"v":523.3666666666666,"d":"523.37"},{"v":536.7333333333332,"d":"536.73"},510,488,5.53238]
[4,"AARTIIND",642.35,{"v":640.7833333333333,"d":"640.78"},{"v":635.5666666666666,"d":"635.57"},{"v":628.7833333333333,"d":"628.78"},{"v":623.5666666666666,"d":"623.57"},{"v":647.5666666666666,"d":"647.57"},{"v":652.7833333333333,"d":"652.78"},{"v":659.5666666666666,"d":"659.57"},646,634,9.95446]
[5,"AAVAS",1516.25,{"v":1514.3999999999999,"d":"1514.40"},{"v":1498.8999999999996,"d":"1498.90"},{"v":1481.5499999999997,"d":"1481.55"},{"v":1466.0499999999995,"d":"1466.05"},{"v":1531.7499999999998,"d":"1531.75"},{"v":1547.2500000000002,"d":"1547.25"},{"v":1564.6,"d":"1564.60"},1529.9,1497.05,0.83606]
[6,"ABB",4791.55,{"v":4771.366666666667,"d":"4771.37"},{"v":4735.583333333334,"d":"4735.58"},{"v":4679.616666666667,"d":"4679.62"},{"v":4643.833333333334,"d":"4643.83"},{"v":4827.333333333334,"d":"4827.33"},{"v":4863.116666666667,"d":"4863.12"},{"v":4919.083333333334,"d":"4919.08"},4807.15,4715.4,0.87854]
[7,"ABBOTINDIA",25568.05,{"v":25465.88333333333,"d":"25465.88"},{"v":25122.516666666663,"d":"25122.52"},{"v":24676.98333333333,"d":"24676.98"},{"v":24333.61666666666,"d":"24333.62"},{"v":25911.416666666664,"d":"25911.42"},{"v":26254.783333333333,"d":"26254.78"},{"v":26700.316666666666,"d":"26700.32"},25809.25,25020.35,0.32932]
[8,"ACC",2492.9,{"v":2504.2999999999997,"d":"2504.30"},{"v":2443.5999999999995,"d":"2443.60"},{"v":2394.2999999999997,"d":"2394.30"},{"v":2333.5999999999995,"d":"2333.60"},{"v":2553.5999999999995,"d":"2553.60"},{"v":2614.2999999999993,"d":"2614.30"},{"v":2663.5999999999995,"d":"2663.60"},2565,2455,16.63558]
[9,"ADANIENT",3064.65,{"v":3026.8000000000006,"d":"3026.80"},{"v":2960.9000000000015,"d":"2960.90"},{"v":2857.150000000001,"d":"2857.15"},{"v":2791.250000000002,"d":"2791.25"},{"v":3130.550000000001,"d":"3130.55"},3196.45,{"v":3300.2000000000007,"d":"3300.20"},3092.7,2923.05,44.02976]
[10,"ADANIGREEN",1715.5,{"v":1712.9833333333333,"d":"1712.98"},{"v":1675.9666666666667,"d":"1675.97"},{"v":1636.4333333333334,"d":"1636.43"},{"v":1599.4166666666667,"d":"1599.42"},{"v":1752.5166666666667,"d":"1752.52"},{"v":1789.5333333333335,"d":"1789.53"},{"v":1829.0666666666666,"d":"1829.07"},1750,1673.45,34.35566]
{"$rows_left_out":511}
{"sheet":"Bulk Deals","index":4,"n_rows":264,"n_cols":8,"rows_kept":264,"merged":[[4,0,4,1],[4,2,4,3],[6,1,6,2]]}
[" "]
[]
[]
[]
[]
[{"$nulls":4},"Back To Main Page"]
["Subject :","BULK DEAL",null,{"$f":"Main!B10","v":"2024-01-30"}]
[]
["Date","Scrip code","Scrip Name","Client Name","Buy / Sell","Quantity Traded","Trade Price / Wt.Avg.trade price","Exchange  "]
["2024-01-29",540615,"7NR","MULTIPLIER SHARE & STOCK ADVISORS PRIVATE LIMITED","SELL",{"v":200000,"d":"200,000"},7.14,"BSE"]
["2024-01-29",538812,"AANCHALISP","PRAVINKUMAR WASHA","BUY",{"v":104716,"d":"104,716"},8.1,"BSE"]
["2024-01-29",542579,"AGOL","INTERACTIVE FINANCIAL SERVICES LTD","SELL",{"v":2000000,"d":"2,000,000"},13.5,"BSE"]
["2024-01-29",506074,"ARSHIYA","ANKITA VISHAL SHAH","BUY",{"v":3000000,"d":"3,000,000"},6.39,"BSE"]
["2024-01-29",506074,"ARSHIYA","AXIS TRUSTEE SERVICES LIMITED","SELL",{"v":2500000,"d":"2,500,000"},6.32,"BSE"]
["2024-01-29",506074,"ARSHIYA","MANSI SHARE & STOCK ADVISORS PRIVATE LIMITED","SELL",{"v":1800000,"d":"1,800,000"},6.45,"BSE"]
["2024-01-29",544052,"BENCHMARK","MULTIPLIER SHARE & STOCK ADVISORS PRIVATE LIMITED","SELL",{"v":72000,"d":"72,000"},65.92,"BSE"]
["2024-01-29",544052,"BENCHMARK","SUNFLOWER BROKING PRIVATE LIMITED","SELL",{"v":2000,"d":"2,000"},66.9,"BSE"]
["2024-01-29",544052,"BENCHMARK","SUNFLOWER BROKING PRIVATE LIMITED","BUY",{"v":114000,"d":"114,000"},65.95,"BSE"]
["2024-01-29",524606,"BERLDRG","SAMIR NARENDRA GUPTA","SELL",{"v":85914,"d":"85,914"},29.1,"BSE"]
["2024-01-29",542669,"BMW","ARUNA R JAIN","SELL",{"v":1141628,"d":"1,141,628"},74.52,"BSE"]
{"$rows_left_out":245}
{"sheet":"Call Tracker (Equity & F&O)","index":5,"n_rows":333,"n_cols":19,"rows_kept":333,"merged":[[70,0,71,0],[70,1,71,1],[70,9,71,9],[70,12,71,12],[70,14,71,14],[70,15,71,15],[77,0,78,0],[77,1,78,1],[77,9,78,9],[77,12,78,12],[77,14,78,14],[77,15,78,15],[80,0,81,0],[80,1,81,1],[80,9,81,9],[80,12,81,12],[80,14,81,14],[80,15,81,15],[83,0,84,0],[83,1,84,1],[83,9,84,9],[83,14,84,14],[83,15,84,15],[87,0,88,0],[87,1,88,1],[87,9,88,9],[87,12,88,12],[87,14,88,14],[87,15,88,15],[90,0,91,0],[90,1,91,1],[90,9,91,9],[90,12,91,12],[90,14,91,14],[90,15,91,15],[92,0,93,0],[92,1,93,1],[92,9,93,9],[92,12,93,12],[92,14,93,14],[92,15,93,15],[94,0,95,0],[94,1,95,1],[94,9,95,9],[97,0,98,0],[97,1,98,1],[97,9,98,9],[97,12,98,12],[97,14,98,14],[97,15,98,15],[101,0,102,0],[101,1,102,1],[101,9,102,9],[101,12,102,12],[101,14,102,14],[101,15,102,15]]}
[]
[]
[]
[]
[{"$nulls":12},"Back To Main Page"]
["Retail Research Technical Calls & Fundamental Performance Report for the month of January-2024"]
[{"$nulls":12},{"$f":"Main!B10","v":"2024-01-30"}]
[null,"Positional  Call"]
["Sr.no","Date",null,"Company","Rec","Rec Price","Stop Loss***","Call Closed At","Target","Remark","Profit / Loss per Share","All charges","Net Gain / Loss  %","Status","Closed Date","Market Closing Price","Second Buying Date"]
[1,"2023-11-08",null,"JAMNAAUTO","Accu<>",108.9,102.9,115.25,"119-125","Profit of Rs.6.35/-",{"$f":"H10-F10","v":6.349999999999994},{"$f":"(F10*-0.3)/100","v":{"v":-0.3267,"d":"-0.33"}},{"$f":"(K10+L10)/F10","v":{"v":0.05531037649219462,"d":"5.53%"}},"Successful","2024-01-12",null,"2023-12-20",null,"H"]
[2,"2023-11-20",null,"TRIDENT","Accu",36.45,34.35,38.6,"40-42","Profit of Rs.2.15/-",{"$f":"H11-F11","v":2.1499999999999986},{"$f":"(F11*-0.3)/100","v":{"v":-0.10935,"d":"-0.11"}},{"$f":"(K11+L11)/F11","v":{"v":0.055984910836762644,"d":"5.60%"}},"Successful","2024-01-03",null,"2023-12-20",null,"H"]
[3,"2023-12-05",null,"KNRCON","Accu",266.5,254,268.75,"290-310","Profit of Rs.2.25/-",{"$f":"H12-F12","v":2.25},{"$f":"(F12*-0.3)/100","v":{"v":-0.7995,"d":"-0.80"}},{"$f":"(K12+L12)/F12","v":{"v":0.005442776735459662,"d":"0.54%"}},"Neutral","2024-01-29",null,"2023-12-20",null,"H"]
[4,"2023-12-08",null,"DATAPATTNS","Accu",1975,1870,1860,"2140-2250","Loss of Rs.115/-",{"$f":"H13-F13","v":-115},{"$f":"(F13*-0.3)/100","v":{"v":-5.925,"d":"-5.93"}},{"$f":"(K13+L13)/F13","v":{"v":-0.061227848101265823,"d":"-6.12%"}},"Unsuccessful","2024-01-01",null,"2023-12-20",null,"H"]
[5,"2023-12-18",null,"SBIN","Accu","622-642",593,null,"680-720","Open",{"$nulls":5},{"$f":"VLOOKUP(D14,'MidCap Intra'!$B$11:$C$568,2,0)","v":622.95},"2024-01-10",null,"H"]
[6,"2023-12-20",null,"CARBORUNIV","Accu",1120,1035,1190,"1200-1270","Profit of Rs.70/-",{"$f":"H15-F15","v":70},{"$f":"(F15*-0.3)/100","v":-3.36},{"$f":"(K15+L15)/F15","v":{"v":0.0595,"d":"5.95%"}},"Successful","2024-01-15",{"$nulls":3},"H"]
[7,"2023-12-28",null,"VINATIORGA","Accu","1700-1750",1645,null,"1860-1960","Open",{"$nulls":5},{"$f":"VLOOKUP(D16,'MidCap Intra'!$B$11:$C$568,2,0)","v":{"v":1709.7,"d":"1709.70"}},"2024-01-10",null,"H"]
[8,"2023-12-29",null,"CAPACITE ","Accu",251.5,229,279.5,"280-310","Profit of Rs.28/-",{"$f":"H17-F17","v":28},{"$f":"(F17*-0.3)/100","v":{"v":-0.7545000000000001,"d":"-0.75"}},{"$f":"(K17+L17)/F17","v":{"v":0.10833200795228629,"d":"10.83%"}},"Successful","2024-01-04",{"$nulls":3},"H"]
[9,"2024-01-01",null,"ONGC","Accu",206.5,192,219,"219-230","Profit of Rs.12.5/-",{"$f":"H18-F18","v":12.5},{"$f":"(F18*-0.3)/100","v":{"v":-0.6194999999999999,"d":"-0.62"}},{"$f":"(K18+L18)/F18","v":{"v":0.05753268765133172,"d":"5.75%"}},"Successful","2024-01-08",{"$nulls":3},"K"]
[10,"2024-01-03",null,"TCS<>","Accu",{"$f":"3715-27","v":3688},3540,3945,"4000-4100","Profit of Rs.257/-",{"$f":"H19-F19","v":257},{"$f":"(F19*-0.3)/100","v":{"v":-11.063999999999998,"d":"-11.06"}},{"$f":"(K19+L19)/F19","v":{"v":0.06668546637744036,"d":"6.67%"}},"Successful","2024-01-19",null,"2024-01-04",null,"H"]
[11,"2024-01-03",null,"MARUTI","Accu","9750-10125",9340,null,"10700-11200","Open",{"$nulls":5},{"$f":"VLOOKUP(D20,'MidCap Intra'!$B$11:$C$568,2,0)","v":{"v":9991.4,"d":"9991.40"}},null,null,"H"]
{"$rows_left_out":306}