{"text_format":"3","workbook":"xlsx","n_sheets":6,"sheets":["Main","Future Intra","Cash Intra","MidCap Intra","Bulk Deals","Call Tracker (Equity & F&O)"],"not_rendered":{"images":4,"defined_names":2},"read":"whole","date_system":"1900"}

{"sheet":"Main","index":0,"n_rows":27,"n_cols":11,"rows_kept":27}
[null,"                                                                                                 "]
{"$rows_empty":8}
[null,"2021-10-27"]
[]
[null,"Sheet No.","Template Name","Summary"]
[null,1,"Future Intra","For Intraday trading in F&O segment"]
[null,2,"Cash Intra","For Intraday trading in cash market segment"]
[null,3,"Mid-cap Intra","For Intraday trading in Mid-cap stocks"]
[null,4,"Bulk Deals","Reveals Bulk Deals carried on NSE & BSE"]
[null,5,"Call Tracker"]
{"$rows_empty":9}
[{"$nulls":10},"`"]

{"sheet":"Future Intra","index":1,"n_rows":218,"n_cols":16,"rows_kept":218,"merged":[[8,0,9,0],[8,1,9,1],[8,2,9,2],[8,3,9,3],[8,6,8,8],[8,9,8,11]]}
[]
[]
[]
[]
[{"$nulls":12},"Back to Main Page"]
["FOR INTRA DAY TRADING",{"$nulls":10},{"$f":"Main!B10","v":"2021-10-27"}]
[]
[]
["Sr.no","Sector","Scrip","Expiry Date","CLOSE RATE","Pivot Point","Supports",null,null,"Resistances"]
[{"$nulls":4},"Point","Point","S1","S2","S3","R1","R2","R3","HIGH","LOW","OI","% Change in OI"]
[1,"Index","BANKNIFTY","2021-10-28",41360.45,{"v":41220.166666666664,"d":"41220.17"},{"v":41016.33333333333,"d":"41016.33"},{"v":40672.21666666667,"d":"40672.22"},{"v":40468.38333333333,"d":"40468.38"},{"v":41564.283333333326,"d":"41564.28"},{"v":41768.116666666654,"d":"41768.12"},{"v":42112.23333333332,"d":"42112.23"},41424,40876.05,2197350,{"v":0.06261258538354592,"d":"6.26%"}]
[2,"Index","NIFTY","2021-10-28",18314.15,{"v":18257.416666666668,"d":"18257.42"},{"v":18164.833333333336,"d":"18164.83"},{"v":18015.516666666666,"d":"18015.52"},{"v":17922.933333333334,"d":"17922.93"},{"v":18406.733333333337,"d":"18406.73"},{"v":18499.316666666673,"d":"18499.32"},{"v":18648.63333333334,"d":"18648.63"},18350,18108.1,12599250,{"v":-0.021151380957930312,"d":"-2.12%"}]
[3,"Index","FINNIFTY","2021-10-26",19643.75,{"v":19595.88333333333,"d":"19595.88"},{"v":19507.916666666664,"d":"19507.92"},{"v":19372.083333333332,"d":"19372.08"},{"v":19284.116666666665,"d":"19284.12"},{"v":19731.716666666664,"d":"19731.72"},{"v":19819.68333333333,"d":"19819.68"},{"v":19955.516666666663,"d":"19955.52"},19683.85,19460.05,3560,{"v":-0.03260869565217391,"d":"-3.26%"}]
[4,"Chemical","AARTIIND","2021-10-28",{"v":1016.3,"d":"1016.30"},{"v":1014.4833333333332,"d":"1014.48"},{"v":1007.8166666666665,"d":"1007.82"},{"v":999.3333333333333,"d":"999.33"},{"v":992.6666666666665,"d":"992.67"},{"v":1022.9666666666665,"d":"1022.97"},{"v":1029.6333333333332,"d":"1029.63"},{"v":1038.1166666666663,"d":"1038.12"},1021.15,1006,4382600,{"v":0.018770993874728314,"d":"1.88%"}]
[5,"Pharma","ABBOTINDIA","2021-10-28",20189.65,{"v":20158.649999999998,"d":"20158.65"},{"v":20065.299999999996,"d":"20065.30"},{"v":19940.949999999997,"d":"19940.95"},{"v":19847.599999999995,"d":"19847.60"},{"v":20282.999999999996,"d":"20283.00"},{"v":20376.349999999995,"d":"20376.35"},{"v":20500.699999999997,"d":"20500.70"},20252,20034.3,38025,{"v":-9.120521172638436E-3,"d":"-0.91%"}]
[6,"Textile","ABFRL","2021-10-28",261.05,{"v":258.2166666666667,"d":"258.22"},{"v":253.33333333333337,"d":"253.33"},{"v":245.61666666666667,"d":"245.62"},{"v":240.73333333333335,"d":"240.73"},{"v":265.9333333333334,"d":"265.93"},{"v":270.8166666666667,"d":"270.82"},{"v":278.5333333333334,"d":"278.53"},263.1,250.5,11572600,{"v":0.08879647749510763,"d":"8.88%"}]
[7,"Cement","ACC","2021-10-28",2242.35,{"v":2233.7166666666667,"d":"2233.72"},{"v":2219.0333333333333,"d":"2219.03"},{"v":2195.7166666666667,"d":"2195.72"},{"v":2181.0333333333333,"d":"2181.03"},{"v":2257.0333333333333,"d":"2257.03"},{"v":2271.7166666666667,"d":"2271.72"},{"v":2295.0333333333333,"d":"2295.03"},2248.4,2210.4,2830000,{"v":-0.04084053550245721,"d":"-4.08%"}]
[8,"Others","ADANIENT","2021-10-28",{"v":1547.7,"d":"1547.70"},{"v":1541.6833333333334,"d":"1541.68"},{"v":1526.1666666666667,"d":"1526.17"},{"v":1504.6333333333334,"d":"1504.63"},{"v":1489.1166666666668,"d":"1489.12"},{"v":1563.2166666666667,"d":"1563.22"},{"v":1578.7333333333331,"d":"1578.73"},{"v":1600.2666666666667,"d":"1600.27"},1557.2,1520.15,24904000,{"v":-0.015729981819619,"d":"-1.57%"}]
[9,"Others","ADANIPORTS","2021-10-28",750.25,{"v":749.6333333333333,"d":"749.63"},{"v":740.3166666666666,"d":"740.32"},{"v":730.3833333333333,"d":"730.38"},{"v":721.0666666666666,"d":"721.07"},{"v":759.5666666666666,"d":"759.57"},{"v":768.8833333333334,"d":"768.88"},{"v":778.8166666666666,"d":"778.82"},758.95,739.7,92156250,{"v":-3.1187286434886368E-4,"d":"-0.03%"}]
[10,"Pharma","ALKEM","2021-10-28",3709.15,{"v":3704.7666666666664,"d":"3704.77"},{"v":3684.6333333333328,"d":"3684.63"},{"v":3660.1166666666663,"d":"3660.12"},{"v":3639.9833333333327,"d":"3639.98"},{"v":3729.283333333333,"d":"3729.28"},{"v":3749.416666666666,"d":"3749.42"},{"v":3773.933333333333,"d":"3773.93"},3724.9,3680.25,503800,{"v":0.021492295214922953,"d":"2.15%"}]
{"$rows_left_out":191}
{"sheet":"Cash Intra","index":2,"n_rows":246,"n_cols":13,"rows_kept":246,"merged":[[7,0,8,0],[7,1,8,1],[7,2,8,2],[7,3,8,3],[7,4,7,6],[7,7,7,9]]}
[]
[]
[]
[]
[{"$nulls":12},"Back to Main Page"]
["FOR INTRA DAY TRADING",{"$nulls":9},{"$f":"Main!B10","v":"2021-10-27"}]
[]
["Sr.no",null,"CLOSE RATE","Pivot Point","Supports",null,null,"Resistances"]
[{"$nulls":4},"S1","S2","S3","R1","R2","R3","HIGH","LOW","Total Trade Quanity in Lakhs"]
[1,"Nifty 50",18268.4,{"v":18226.050000000003,"d":"18226.05"},{"v":18141.650000000005,"d":"18141.65"},{"v":18014.9,"d":"18014.90"},{"v":17930.500000000004,"d":"17930.50"},{"v":18352.800000000007,"d":"18352.80"},{"v":18437.2,"d":"18437.20"},{"v":18563.950000000008,"d":"18563.95"},18310.45,18099.3]
[2,"Nifty Bank",41238.3,{"v":41144.9,"d":"41144.90"},40922.55,{"v":40606.8,"d":"40606.80"},{"v":40384.450000000004,"d":"40384.45"},41460.65,{"v":41682.99999999999,"d":"41683.00"},41998.75,41367.25,40829.15]
[3,"Nifty CPSE",2401.7,{"v":2398.883333333333,"d":"2398.88"},{"v":2389.3166666666666,"d":"2389.32"},{"v":2376.9333333333334,"d":"2376.93"},{"v":2367.366666666667,"d":"2367.37"},{"v":2411.2666666666664,"d":"2411.27"},{"v":2420.833333333333,"d":"2420.83"},{"v":2433.2166666666662,"d":"2433.22"},2408.45,2386.5]
[4,"Nifty Infra",5169.3,{"v":5154.566666666667,"d":"5154.57"},{"v":5131.383333333333,"d":"5131.38"},{"v":5093.466666666666,"d":"5093.47"},{"v":5070.283333333333,"d":"5070.28"},{"v":5192.483333333334,"d":"5192.48"},{"v":5215.666666666666,"d":"5215.67"},{"v":5253.583333333334,"d":"5253.58"},5177.75,5116.65]
[5,"Nifty IT",35162.35,{"v":35273.316666666666,"d":"35273.32"},{"v":34846.78333333333,"d":"34846.78"},{"v":34531.21666666667,"d":"34531.22"},{"v":34104.683333333334,"d":"34104.68"},{"v":35588.88333333333,"d":"35588.88"},{"v":36015.41666666666,"d":"36015.42"},{"v":36330.98333333333,"d":"36330.98"},35699.85,34957.75]
[6,"Nifty PSE",4176.3,{"v":4171.066666666667,"d":"4171.07"},{"v":4153.433333333333,"d":"4153.43"},{"v":4130.566666666667,"d":"4130.57"},{"v":4112.933333333333,"d":"4112.93"},{"v":4193.933333333333,"d":"4193.93"},{"v":4211.566666666667,"d":"4211.57"},{"v":4234.433333333333,"d":"4234.43"},4188.7,4148.2]
[7,"Nifty Midcap 50",8641.65,{"v":8590.699999999999,"d":"8590.70"},{"v":8524.799999999997,"d":"8524.80"},{"v":8407.949999999999,"d":"8407.95"},{"v":8342.049999999997,"d":"8342.05"},{"v":8707.549999999997,"d":"8707.55"},{"v":8773.449999999999,"d":"8773.45"},{"v":8890.299999999997,"d":"8890.30"},8656.6,8473.85]
[8,"ACC",2236.3,{"v":2230.4166666666665,"d":"2230.42"},{"v":2215.883333333333,"d":"2215.88"},{"v":2195.4666666666667,"d":"2195.47"},{"v":2180.9333333333334,"d":"2180.93"},{"v":2250.833333333333,"d":"2250.83"},{"v":2265.366666666667,"d":"2265.37"},{"v":2285.783333333333,"d":"2285.78"},2244.95,2210,4.84377]
[9,"AUBANK",1260.95,1245.75,1223.05,{"v":1185.1499999999999,"d":"1185.15"},{"v":1162.4499999999998,"d":"1162.45"},1283.65,1306.35,{"v":1344.2500000000002,"d":"1344.25"},1268.45,1207.85,22.64912]
[10,"AARTIIND",1014.45,{"v":1012.1333333333333,"d":"1012.13"},{"v":1005.3166666666666,"d":"1005.32"},{"v":996.1833333333333,"d":"996.18"},{"v":989.3666666666666,"d":"989.37"},{"v":1021.2666666666667,"d":"1021.27"},{"v":1028.0833333333335,"d":"1028.08"},{"v":1037.2166666666667,"d":"1037.22"},1018.95,1003,4.56876]
[11,"ABBOTINDIA",20205.2,{"v":20163.783333333336,"d":"20163.78"},{"v":20041.41666666667,"d":"20041.42"},{"v":19877.633333333335,"d":"19877.63"},{"v":19755.26666666667,"d":"19755.27"},{"v":20327.566666666673,"d":"20327.57"},{"v":20449.933333333334,"d":"20449.93"},{"v":20613.716666666674,"d":"20613.72"},20286.15,20000,0.29284]
{"$rows_left_out":227}
{"sheet":"MidCap Intra","index":3,"n_rows":530,"n_cols":13,"rows_kept":530,"merged":[[0,0,0,1],[8,0,9,0],[8,1,9,1],[8,2,9,2],[8,3,9,3],[8,4,8,6],[8,7,8,9]]}
[]
[]
[]
[]
[{"$nulls":11},"Back To Main Page"]
["FOR INTRA DAY TRADING",{"$nulls":9},{"$f":"Main!B10","v":"2021-10-27"}]
[null,null," "]
[]
["Sr.no","Scrip","CLOSE RATE","Pivot Point","Supports",null,null,"Resistances"]
[{"$nulls":4},"S1","S2","S3","R1","R2","R3","HIGH","LOW","Total Trade Quanity in Lakhs"]
[1,"3MINDIA",26146.75,{"v":26099.316666666666,"d":"26099.32"},{"v":25848.63333333333,"d":"25848.63"},{"v":25550.516666666666,"d":"25550.52"},{"v":25299.833333333332,"d":"25299.83"},{"v":26397.43333333333,"d":"26397.43"},{"v":26648.116666666665,"d":"26648.12"},{"v":26946.23333333333,"d":"26946.23"},26350,25801.2,0.02876]
[2,"ABB",1845.6,{"v":1844.1833333333332,"d":"1844.18"},{"v":1819.5166666666664,"d":"1819.52"},{"v":1793.4333333333332,"d":"1793.43"},{"v":1768.7666666666664,"d":"1768.77"},{"v":1870.2666666666664,"d":"1870.27"},{"v":1894.933333333333,"d":"1894.93"},{"v":1921.0166666666664,"d":"1921.02"},1868.85,1818.1,2.0678]
[3,"POWERINDIA",2342.85,{"v":2335.616666666667,"d":"2335.62"},{"v":2301.2333333333336,"d":"2301.23"},{"v":2259.616666666667,"d":"2259.62"},{"v":2225.2333333333336,"d":"2225.23"},{"v":2377.2333333333336,"d":"2377.23"},{"v":2411.616666666667,"d":"2411.62"},{"v":2453.2333333333336,"d":"2453.23"},2370,2294,0.45123]
[4,"ACC",2236.3,{"v":2230.4166666666665,"d":"2230.42"},{"v":2215.883333333333,"d":"2215.88"},{"v":2195.4666666666667,"d":"2195.47"},{"v":2180.9333333333334,"d":"2180.93"},{"v":2250.833333333333,"d":"2250.83"},{"v":2265.366666666667,"d":"2265.37"},{"v":2285.783333333333,"d":"2285.78"},2244.95,2210,4.84377]
[5,"AIAENG",1906.85,{"v":1913.1333333333332,"d":"1913.13"},{"v":1896.0166666666664,"d":"1896.02"},{"v":1885.1833333333332,"d":"1885.18"},{"v":1868.0666666666664,"d":"1868.07"},{"v":1923.9666666666665,"d":"1923.97"},{"v":1941.0833333333333,"d":"1941.08"},{"v":1951.9166666666665,"d":"1951.92"},1930.25,1902.3,0.19553]
[6,"APLAPOLLO",807.5,{"v":797.5,"d":"797.50"},{"v":771.2,"d":"771.20"},{"v":734.9000000000001,"d":"734.90"},{"v":708.6000000000001,"d":"708.60"},{"v":833.8,"d":"833.80"},{"v":860.0999999999999,"d":"860.10"},{"v":896.3999999999999,"d":"896.40"},823.8,761.2,10.42136]
[7,"AUBANK",1260.95,1245.75,1223.05,{"v":1185.1499999999999,"d":"1185.15"},{"v":1162.4499999999998,"d":"1162.45"},1283.65,1306.35,{"v":1344.2500000000002,"d":"1344.25"},1268.45,1207.85,22.64912]
[8,"AARTIDRUGS",632.25,{"v":635.4166666666666,"d":"635.42"},{"v":626.8333333333333,"d":"626.83"},{"v":621.4166666666666,"d":"621.42"},{"v":612.8333333333333,"d":"612.83"},{"v":640.8333333333333,"d":"640.83"},{"v":649.4166666666665,"d":"649.42"},{"v":654.8333333333333,"d":"654.83"},644,630,3.00312]
[9,"AARTIIND",1014.45,{"v":1012.1333333333333,"d":"1012.13"},{"v":1005.3166666666666,"d":"1005.32"},{"v":996.1833333333333,"d":"996.18"},{"v":989.3666666666666,"d":"989.37"},{"v":1021.2666666666667,"d":"1021.27"},{"v":1028.0833333333335,"d":"1028.08"},{"v":1037.2166666666667,"d":"1037.22"},1018.95,1003,4.56876]
[10,"AAVAS",2820.1,{"v":2806.6,"d":"2806.60"},{"v":2778.2,"d":"2778.20"},{"v":2736.2999999999997,"d":"2736.30"},{"v":2707.8999999999996,"d":"2707.90"},{"v":2848.5,"d":"2848.50"},{"v":2876.9000000000005,"d":"2876.90"},{"v":2918.8,"d":"2918.80"},2835,2764.7,0.40779]
{"$rows_left_out":511}
{"sheet":"Bulk Deals","index":4,"n_rows":75,"n_cols":8,"rows_kept":75,"merged":[[4,0,4,1],[4,2,4,3],[6,1,6,2]]}
[" "]
[]
[]
[]
[]
[{"$nulls":4},"Back To Main Page"]
["Subject :","BULK DEAL",null,{"$f":"Main!B10","v":"2021-10-27"}]
[]
["Date","Scrip code","Scrip Name","Client Name","Buy / Sell","Quantity Traded","Trade Price / Wt.Avg.trade price","Exchange  "]
["2021-10-26",543319,"AAPLUSTRAD","AJAY SINGHAL AND SONS HUF","BUY",{"v":96000,"d":"96,000"},8.39,"BSE"]
["2021-10-26",539570,"ACEWIN","SURESH KUMAR","SELL",{"v":76800,"d":"76,800"},4.32,"BSE"]
["2021-10-26",540146,"ACML","INVICTUS STOCK RESEARCH PRIVATE LIMITED","SELL",{"v":100000,"d":"100,000"},37.9,"BSE"]
["2021-10-26",540718,"AKM","RAHUL ANANTRAI MEHTA","BUY",{"v":18000,"d":"18,000"},22.93,"BSE"]
["2021-10-26",540718,"AKM","RAHUL ANANTRAI MEHTA","SELL",{"v":18000,"d":"18,000"},24.45,"BSE"]
["2021-10-26",540718,"AKM","RAMESHKUMAR HEMRAJ PARMAR","BUY",{"v":42000,"d":"42,000"},24.48,"BSE"]
["2021-10-26",540718,"AKM","MANJU G RANKA","BUY",{"v":120000,"d":"120,000"},24.88,"BSE"]
["2021-10-26",540718,"AKM","MBM BEARINGS (RAJASTHAN) P LTD","SELL",{"v":138000,"d":"138,000"},24.78,"BSE"]
["2021-10-26",540718,"AKM","TVISHA CORPORATE ADVISORS LLP","BUY",{"v":24000,"d":"24,000"},26.6,"BSE"]
["2021-10-26",540718,"AKM","TVISHA CORPORATE ADVISORS LLP","SELL",{"v":6000,"d":"6,000"},23,"BSE"]
["2021-10-26",539304,"CANOPYFIN","RAJESH KUMAR AGARWAL","SELL",{"v":100000,"d":"100,000"},11.05,"BSE"]
{"$rows_left_out":56}
{"sheet":"Call Tracker (Equity & F&O)","index":5,"n_rows":328,"n_cols":18,"rows_kept":328,"merged":[[94,0,95,0],[94,1,95,1],[94,12,95,12],[94,13,95,13],[94,14,95,14],[94,15,95,15],[103,0,104,0],[103,1,104,1],[103,9,104,9],[103,12,104,12],[103,13,104,13],[103,14,104,14],[103,15,104,15],[112,0,113,0],[112,1,113,1],[112,9,113,9],[112,12,113,12],[112,13,113,13],[112,14,113,14],[112,15,113,15]]}
[]
[]
[]
[]
[{"$nulls":12},"Back To Main Page"]
["Retail Research Technical Calls & Fundamental Performance Report for the month of Oct-2021"]
[{"$nulls":12},{"$f":"Main!B10","v":"2021-10-27"}]
[null,"Positional  Call"]
["Sr.no","Date",null,"Company","Rec","Rec Price","Stop Loss***","Call Closed At","Target","Remark","Profit / Loss per Share","All charges","Net Gain / Loss  %","Status","Closed Date","Market Closing Price"]
[1,"2021-09-15",null,"AKZOINDIA","Buy",2195,2080,{"v":2295,"d":"2,295.00"},"2400-2500","Part Profit of Rs.100/-",{"$f":"H10-F10","v":100},{"$f":"(F10*-0.7)/100","v":{"v":-15.365,"d":"-15.37"}},{"$f":"(K10+L10)/F10","v":{"v":0.03855808656036447,"d":"3.86%"}},"Successful","2021-09-30",{"$f":"VLOOKUP(D10,'MidCap Intra'!B11:C504,2,0)","v":2093.6},null,"H"]
[2,"2021-09-21",null,"GLAXO","Buy","1500-1520",1395,null,"1680-1720","Open",{"$nulls":5},{"$f":"VLOOKUP(D11,'MidCap Intra'!B13:C506,2,0)","v":1462.4},null,"H"]
[3,"2021-09-24",null,"JKCEMENT","Buy",3130,2920,{"v":3320,"d":"3,320.00"},"3500-3600","Profit of Rs.190-/-",{"$f":"H12-F12","v":190},{"$f":"(F12*-0.7)/100","v":-21.91},{"$f":"(K12+L12)/F12","v":{"v":0.05370287539936102,"d":"5.37%"}},"Successful","2021-10-04",null,null,"H"]
[4,"2021-09-27",null,"IGL","Buy",527.5,495,{"v":495,"d":"495.00"},"580-600","Loss of Rs.32.5/-",-32.5,{"v":-3.6925,"d":"-3.69"},{"v":-0.06861137440758294,"d":"-6.86%"},"Unsuccessful","2021-10-22",null,null,"H"]
[5,"2021-09-27",null,"CROMPTON","Buy",472.5,445,{"v":503,"d":"503.00"},530,"Profit of Rs.30.5/-",{"$f":"H14-F14","v":30.5},{"$f":"(F14*-0.7)/100","v":{"v":-3.3075,"d":"-3.31"}},{"$f":"(K14+L14)/F14","v":{"v":0.057550264550264546,"d":"5.76%"}},"Successful","2021-10-01",null,null,"H"]
[6,"2021-09-27",null,"DALBHARAT","Buy",2040,1895,{"$f":"(2155+1895)/2","v":{"v":2025,"d":"2,025.00"}},"2300-2400","Loss of Rs.15/-",-15,-14.28,{"v":-0.01435294117647059,"d":"-1.44%"},"Unsuccessful","2021-10-25",null,null,"N"]
[7,"2021-09-27",null,"ENDURANCE","Buy",1580,1490,{"v":1685,"d":"1,685.00"},"1750-1800","Profit of Rs.105/-",{"$f":"H16-F16","v":105},{"$f":"(F16*-0.7)/100","v":-11.06},{"$f":"(K16+L16)/F16","v":{"v":0.05945569620253165,"d":"5.95%"}},"Successful","2021-10-12",null,null,"H"]
[8,"2021-09-29",null,"CAMS","Buy",3270,3140,{"v":3025,"d":"3,025.00"},"3600-3700","Loss of Rs.245/-",{"$f":"H17-F17","v":-245},{"$f":"(F17*-0.7)/100","v":-22.89},{"$f":"(K17+L17)/F17","v":{"v":-0.08192354740061161,"d":"-8.19%"}},"Unsuccessful","2021-10-01",null,null,"H"]
[9,"2021-09-29",null,"INDIACEM","Buy",191.5,178,{"v":204.5,"d":"204.50"},210,"Profit of Rs.13/-",{"$f":"H18-F18","v":13},{"$f":"(F18*-0.7)/100","v":{"v":-1.3404999999999998,"d":"-1.34"}},{"$f":"(K18+L18)/F18","v":{"v":0.060885117493472585,"d":"6.09%"}},"Successful","2021-10-01",null,null,"N"]
[10,"2021-10-04",null,"PIIND","Buy",3120,2980,{"v":3315,"d":"3,315.00"},"3350-3400","Profit of Rs.195/-",{"$f":"H19-F19","v":195},{"$f":"(F19*-0.7)/100","v":-21.84},{"$f":"(K19+L19)/F19","v":{"v":0.0555,"d":"5.55%"}},"Successful","2021-10-08",null,null,"H"]
[11,"2021-10-05",null,"HDFCLIFE","Buy","715-725",660,null,"820-850","Open",{"$nulls":5},{"$f":"VLOOKUP(D20,'MidCap Intra'!B22:C521,2,0)","v":690.05},null,"H"]
{"$rows_left_out":289}