{"text_format":"3","workbook":"xlsx","n_sheets":6,"sheets":["Main","Future Intra","Cash Intra","MidCap Intra","Bulk Deals","Call Tracker (Equity & F&O)"],"not_rendered":{"images":2,"defined_names":2},"read":"whole","date_system":"1900"}

{"sheet":"Main","index":0,"n_rows":27,"n_cols":11,"rows_kept":27}
[null,"                                                                                                 "]
{"$rows_empty":8}
[null,"2022-03-25"]
[]
[null,"Sheet No.","Template Name","Summary"]
[null,1,"Future Intra","For Intraday trading in F&O segment"]
[null,2,"Cash Intra","For Intraday trading in cash market segment"]
[null,3,"Mid-cap Intra","For Intraday trading in Mid-cap stocks"]
[null,4,"Bulk Deals","Reveals Bulk Deals carried on NSE & BSE"]
[null,5,"Call Tracker"]
{"$rows_empty":9}
[{"$nulls":10},"`"]

{"sheet":"Future Intra","index":1,"n_rows":240,"n_cols":16,"rows_kept":240,"merged":[[8,0,9,0],[8,1,9,1],[8,2,9,2],[8,3,9,3],[8,6,8,8],[8,9,8,11]]}
[]
[]
[]
[]
[{"$nulls":12},"Back to Main Page"]
["FOR INTRA DAY TRADING",{"$nulls":10},{"$f":"Main!B10","v":"2022-03-25"}]
[]
[]
["Sr.no","Sector","Scrip","Expiry Date","CLOSE RATE","Pivot Point","Supports",null,null,"Resistances"]
[{"$nulls":4},"Point","Point","S1","S2","S3","R1","R2","R3","HIGH","LOW","OI","% Change in OI"]
[1,"Index","NIFTY","2022-03-31",{"v":17242.8,"d":"17242.80"},{"v":17230.933333333334,"d":"17230.93"},{"v":17122.86666666667,"d":"17122.87"},{"v":17002.933333333334,"d":"17002.93"},{"v":16894.86666666667,"d":"16894.87"},{"v":17350.86666666667,"d":"17350.87"},{"v":17458.933333333334,"d":"17458.93"},{"v":17578.86666666667,"d":"17578.87"},17339,17111,16396150,{"v":-0.014343467740723485,"d":"-1.43%"}]
[2,"Index","BANKNIFTY","2022-03-31",{"v":35641.2,"d":"35641.20"},{"v":35733.38333333333,"d":"35733.38"},{"v":35409.816666666666,"d":"35409.82"},{"v":35178.433333333334,"d":"35178.43"},{"v":34854.86666666667,"d":"34854.87"},{"v":35964.76666666666,"d":"35964.77"},{"v":36288.33333333333,"d":"36288.33"},{"v":36519.71666666666,"d":"36519.72"},36056.95,35502,6601000,{"v":0.020010816657652784,"d":"2.00%"}]
[3,"Index","FINNIFTY","2022-03-29",16720.95,{"v":16808.8,"d":"16808.80"},{"v":16632.149999999998,"d":"16632.15"},16543.35,{"v":16366.699999999997,"d":"16366.70"},{"v":16897.6,"d":"16897.60"},17074.25,17163.05,16985.45,16720,5000,{"v":0.3157894736842105,"d":"31.58%"}]
[4,"Index","MIDCPNIFTY","2022-03-29",{"v":7232,"d":"7232.00"},{"v":7237.283333333333,"d":"7237.28"},{"v":7224.566666666666,"d":"7224.57"},{"v":7217.133333333333,"d":"7217.13"},{"v":7204.416666666666,"d":"7204.42"},{"v":7244.716666666665,"d":"7244.72"},{"v":7257.4333333333325,"d":"7257.43"},{"v":7264.866666666665,"d":"7264.87"},7250,7229.85,1950,{"v":-0.037037037037037035,"d":"-3.70%"}]
[5,"Chemical","AARTIIND","2022-03-31",{"v":919.5,"d":"919.50"},{"v":918.5,"d":"918.50"},{"v":911,"d":"911.00"},{"v":902.5,"d":"902.50"},{"v":895,"d":"895.00"},{"v":927,"d":"927.00"},{"v":934.5,"d":"934.50"},{"v":943,"d":"943.00"},926,910,2516000,{"v":-0.016611295681063124,"d":"-1.66%"}]
[6,"Capital_Goods","ABB","2022-03-31",{"v":2044,"d":"2044.00"},{"v":2029.8500000000001,"d":"2029.85"},{"v":1999.4,"d":"1999.40"},{"v":1954.8,"d":"1954.80"},1924.35,{"v":2074.4500000000003,"d":"2074.45"},{"v":2104.9000000000005,"d":"2104.90"},{"v":2149.5000000000005,"d":"2149.50"},2060.3,1985.25,253250,{"v":0.014014014014014014,"d":"1.40%"}]
[7,"Pharma","ABBOTINDIA","2022-03-31",16496.05,{"v":16565.133333333335,"d":"16565.13"},{"v":16361.06666666667,"d":"16361.07"},{"v":16226.083333333336,"d":"16226.08"},{"v":16022.01666666667,"d":"16022.02"},{"v":16700.11666666667,"d":"16700.12"},{"v":16904.183333333334,"d":"16904.18"},{"v":17039.166666666668,"d":"17039.17"},16769.2,16430.15,40550,{"v":0.03509891512444161,"d":"3.51%"}]
[8,"Others","ABCAPITAL","2022-03-31",110.35,{"v":110.39999999999999,"d":"110.40"},{"v":108.19999999999999,"d":"108.20"},106.05,103.85,{"v":112.54999999999998,"d":"112.55"},114.75,{"v":116.89999999999998,"d":"116.90"},112.6,108.25,18141200,{"v":0.05286006128702758,"d":"5.29%"}]
[9,"Textile","ABFRL","2022-03-31",{"v":296.7,"d":"296.70"},{"v":292.46666666666664,"d":"292.47"},{"v":285.9833333333333,"d":"285.98"},{"v":275.26666666666665,"d":"275.27"},{"v":268.7833333333333,"d":"268.78"},{"v":303.1833333333333,"d":"303.18"},{"v":309.66666666666663,"d":"309.67"},{"v":320.38333333333327,"d":"320.38"},298.95,281.75,12461800,{"v":0.08267449740230404,"d":"8.27%"}]
[10,"Cement","ACC","2022-03-31",{"v":2086.7,"d":"2086.70"},{"v":2080.2666666666664,"d":"2080.27"},{"v":2062.683333333333,"d":"2062.68"},{"v":2038.6666666666665,"d":"2038.67"},{"v":2021.083333333333,"d":"2021.08"},{"v":2104.283333333333,"d":"2104.28"},{"v":2121.866666666667,"d":"2121.87"},{"v":2145.8833333333328,"d":"2145.88"},2097.85,2056.25,2604750,{"v":-0.003348000765257318,"d":"-0.33%"}]
{"$rows_left_out":211}
{"sheet":"Cash Intra","index":2,"n_rows":246,"n_cols":13,"rows_kept":246,"merged":[[7,0,8,0],[7,1,8,1],[7,2,8,2],[7,3,8,3],[7,4,7,6],[7,7,7,9]]}
[]
[]
[]
[]
[{"$nulls":12},"Back to Main Page"]
["FOR INTRA DAY TRADING",{"$nulls":9},{"$f":"Main!B10","v":"2022-03-25"}]
[]
["Sr.no",null,"CLOSE RATE","Pivot Point","Supports",null,null,"Resistances"]
[{"$nulls":4},"S1","S2","S3","R1","R2","R3","HIGH","LOW","Total Trade Quanity in Lakhs"]
[1,"Nifty 50",17222.75,{"v":17201.883333333335,"d":"17201.88"},{"v":17112.01666666667,"d":"17112.02"},{"v":17001.283333333336,"d":"17001.28"},{"v":16911.41666666667,"d":"16911.42"},{"v":17312.61666666667,"d":"17312.62"},{"v":17402.48333333333,"d":"17402.48"},{"v":17513.216666666667,"d":"17513.22"},17291.75,17091.15]
[2,"Nifty Bank",35527.1,{"v":35635.49999999999,"d":"35635.50"},{"v":35313.29999999999,"d":"35313.30"},{"v":35099.49999999999,"d":"35099.50"},{"v":34777.29999999999,"d":"34777.30"},{"v":35849.29999999999,"d":"35849.30"},{"v":36171.499999999985,"d":"36171.50"},{"v":36385.29999999999,"d":"36385.30"},35957.7,35421.7]
[3,"Nifty CPSE",2532,{"v":2526.0499999999997,"d":"2526.05"},{"v":2516.2999999999993,"d":"2516.30"},{"v":2500.5999999999995,"d":"2500.60"},{"v":2490.849999999999,"d":"2490.85"},{"v":2541.7499999999995,"d":"2541.75"},{"v":2551.5000000000005,"d":"2551.50"},{"v":2567.2,"d":"2567.20"},2535.8,2510.35]
[4,"Nifty Infra",4916.8,4897.85,4874.35,{"v":4831.9,"d":"4831.90"},{"v":4808.4,"d":"4808.40"},{"v":4940.300000000001,"d":"4940.30"},{"v":4963.800000000001,"d":"4963.80"},{"v":5006.250000000002,"d":"5006.25"},4921.35,4855.4]
[5,"Nifty IT",36516.75,{"v":36322.549999999996,"d":"36322.55"},{"v":36047.29999999999,"d":"36047.30"},{"v":35577.84999999999,"d":"35577.85"},{"v":35302.599999999984,"d":"35302.60"},{"v":36791.99999999999,"d":"36792.00"},{"v":37067.25000000001,"d":"37067.25"},{"v":37536.7,"d":"37536.70"},36597.8,35853.1]
[6,"Nifty PSE",4102.45,4097.35,{"v":4082.2000000000007,"d":"4082.20"},{"v":4061.9500000000003,"d":"4061.95"},{"v":4046.8000000000006,"d":"4046.80"},{"v":4117.6,"d":"4117.60"},4132.75,{"v":4153.000000000001,"d":"4153.00"},4112.5,4077.1]
[7,"Nifty Midcap 50",8087.9,{"v":8062.766666666667,"d":"8062.77"},{"v":8030.7333333333345,"d":"8030.73"},{"v":7973.5666666666675,"d":"7973.57"},{"v":7941.533333333335,"d":"7941.53"},{"v":8119.933333333334,"d":"8119.93"},{"v":8151.966666666667,"d":"8151.97"},{"v":8209.133333333335,"d":"8209.13"},8094.8,8005.6]
[8,"ACC",2080.4,{"v":2074.5,"d":"2074.50"},2056.05,{"v":2031.7000000000003,"d":"2031.70"},{"v":2013.2500000000005,"d":"2013.25"},2098.85,{"v":2117.2999999999997,"d":"2117.30"},{"v":2141.6499999999996,"d":"2141.65"},2092.95,2050.15,2.94252]
[9,"AUBANK",1241.45,{"v":1241.7666666666667,"d":"1241.77"},{"v":1224.6833333333334,"d":"1224.68"},{"v":1207.9166666666667,"d":"1207.92"},{"v":1190.8333333333335,"d":"1190.83"},{"v":1258.5333333333333,"d":"1258.53"},{"v":1275.6166666666668,"d":"1275.62"},{"v":1292.3833333333332,"d":"1292.38"},1258.85,1225,10.78509]
[10,"AARTIIND",919.4,{"v":918.2833333333333,"d":"918.28"},{"v":910.7166666666666,"d":"910.72"},{"v":902.0333333333333,"d":"902.03"},{"v":894.4666666666666,"d":"894.47"},{"v":926.9666666666666,"d":"926.97"},{"v":934.5333333333332,"d":"934.53"},{"v":943.2166666666666,"d":"943.22"},925.85,909.6,4.46309]
[11,"ADANIENT",1832.8,{"v":1824.1666666666667,"d":"1824.17"},{"v":1808.7833333333335,"d":"1808.78"},{"v":1784.7666666666669,"d":"1784.77"},{"v":1769.3833333333337,"d":"1769.38"},{"v":1848.1833333333334,"d":"1848.18"},{"v":1863.5666666666666,"d":"1863.57"},{"v":1887.5833333333333,"d":"1887.58"},1839.55,1800.15,10.30145]
{"$rows_left_out":227}
{"sheet":"MidCap Intra","index":3,"n_rows":531,"n_cols":13,"rows_kept":531,"merged":[[0,0,0,1],[8,0,9,0],[8,1,9,1],[8,2,9,2],[8,3,9,3],[8,4,8,6],[8,7,8,9]]}
[]
[]
[]
[]
[{"$nulls":11},"Back To Main Page"]
["FOR INTRA DAY TRADING",{"$nulls":9},{"$f":"Main!B10","v":"2022-03-25"}]
[null,null," "]
[]
["Sr.no","Scrip","CLOSE RATE","Pivot Point","Supports",null,null,"Resistances"]
[{"$nulls":4},"S1","S2","S3","R1","R2","R3","HIGH","LOW","Total Trade Quanity in Lakhs"]
[1,"3MINDIA",19976.8,{"v":20067.1,"d":"20067.10"},{"v":19809.549999999996,"d":"19809.55"},{"v":19642.299999999996,"d":"19642.30"},{"v":19384.749999999993,"d":"19384.75"},20234.35,{"v":20491.9,"d":"20491.90"},20659.15,20324.65,19899.85,0.02642]
[2,"AARTIDRUGS",438.65,{"v":440.6333333333334,"d":"440.63"},{"v":434.01666666666677,"d":"434.02"},{"v":429.3833333333334,"d":"429.38"},{"v":422.76666666666677,"d":"422.77"},{"v":445.26666666666677,"d":"445.27"},{"v":451.88333333333344,"d":"451.88"},{"v":456.51666666666677,"d":"456.52"},447.25,436,1.92727]
[3,"AARTIIND",919.4,{"v":918.2833333333333,"d":"918.28"},{"v":910.7166666666666,"d":"910.72"},{"v":902.0333333333333,"d":"902.03"},{"v":894.4666666666666,"d":"894.47"},{"v":926.9666666666666,"d":"926.97"},{"v":934.5333333333332,"d":"934.53"},{"v":943.2166666666666,"d":"943.22"},925.85,909.6,4.46309]
[4,"AAVAS",2258.2,{"v":2271.3666666666663,"d":"2271.37"},{"v":2224.783333333333,"d":"2224.78"},{"v":2191.3666666666663,"d":"2191.37"},{"v":2144.783333333333,"d":"2144.78"},{"v":2304.783333333333,"d":"2304.78"},{"v":2351.366666666666,"d":"2351.37"},{"v":2384.783333333333,"d":"2384.78"},2317.95,2237.95,1.81406]
[5,"ABB",2038.65,{"v":2024.8833333333332,"d":"2024.88"},{"v":1995.7666666666664,"d":"1995.77"},{"v":1952.8833333333332,"d":"1952.88"},{"v":1923.7666666666664,"d":"1923.77"},{"v":2067.7666666666664,"d":"2067.77"},{"v":2096.883333333333,"d":"2096.88"},{"v":2139.7666666666664,"d":"2139.77"},2054,1982,2.51286]
[6,"ABBOTINDIA",16469.25,{"v":16522.716666666667,"d":"16522.72"},{"v":16346.533333333333,"d":"16346.53"},{"v":16223.816666666666,"d":"16223.82"},{"v":16047.633333333331,"d":"16047.63"},{"v":16645.433333333334,"d":"16645.43"},{"v":16821.61666666667,"d":"16821.62"},{"v":16944.333333333336,"d":"16944.33"},16698.9,16400,0.09497]
[7,"ABCAPITAL",109.95,{"v":110.2,"d":"110.20"},{"v":108,"d":"108.00"},106.05,103.85,112.15,{"v":114.35000000000002,"d":"114.35"},{"v":116.30000000000001,"d":"116.30"},112.4,108.25,48.28323]
[8,"ABFRL",296.25,{"v":293.5,"d":"293.50"},{"v":288,"d":"288.00"},279.75,274.25,301.75,307.25,{"v":315.5,"d":"315.50"},299,285.25,34.32943]
[9,"ACC",2080.4,{"v":2074.5,"d":"2074.50"},2056.05,{"v":2031.7000000000003,"d":"2031.70"},{"v":2013.2500000000005,"d":"2013.25"},2098.85,{"v":2117.2999999999997,"d":"2117.30"},{"v":2141.6499999999996,"d":"2141.65"},2092.95,2050.15,2.94252]
[10,"ADANIENT",1832.8,{"v":1824.1666666666667,"d":"1824.17"},{"v":1808.7833333333335,"d":"1808.78"},{"v":1784.7666666666669,"d":"1784.77"},{"v":1769.3833333333337,"d":"1769.38"},{"v":1848.1833333333334,"d":"1848.18"},{"v":1863.5666666666666,"d":"1863.57"},{"v":1887.5833333333333,"d":"1887.58"},1839.55,1800.15,10.30145]
{"$rows_left_out":512}
{"sheet":"Bulk Deals","index":4,"n_rows":135,"n_cols":8,"rows_kept":135,"merged":[[4,0,4,1],[4,2,4,3],[6,1,6,2]]}
[" "]
[]
[]
[]
[]
[{"$nulls":4},"Back To Main Page"]
["Subject :","BULK DEAL",null,{"$f":"Main!B10","v":"2022-03-25"}]
[]
["Date","Scrip code","Scrip Name","Client Name","Buy / Sell","Quantity Traded","Trade Price / Wt.Avg.trade price","Exchange  "]
["2022-03-24",542670,"AEPL","SANJEEV HARBANSLAL BHATIA","BUY",{"v":300000,"d":"300,000"},51.44,"BSE"]
["2022-03-24",542670,"AEPL","NNM SECURITIES PVT LTD","SELL",{"v":300000,"d":"300,000"},51.44,"BSE"]
["2022-03-24",540718,"AKM","ADITYA SONI","SELL",{"v":24000,"d":"24,000"},29.95,"BSE"]
["2022-03-24",540718,"AKM","SUNRISE ENTERPRISES","BUY",{"v":24000,"d":"24,000"},29.95,"BSE"]
["2022-03-24",539621,"BCLENTERPR","DHARMESH MALDEVBHAI GODHANIA","SELL",{"v":814209,"d":"814,209"},4.26,"BSE"]
["2022-03-24",531900,"CCLINTER","AAR INFRACITY LIMITED","BUY",{"v":150000,"d":"150,000"},17.2,"BSE"]
["2022-03-24",531900,"CCLINTER","TANVI FINCAP PRIVATE LIMITED","SELL",{"v":150000,"d":"150,000"},17.2,"BSE"]
["2022-03-24",532701,"CELLA","SEETHARAMAN ANANTHARAMAN TRIKKUR","BUY",{"v":100000,"d":"100,000"},5.5,"BSE"]
["2022-03-24",532701,"CELLA","INBOT PROPERTIES PRIVATE LTD","BUY",{"v":494760,"d":"494,760"},5.5,"BSE"]
["2022-03-24",532701,"CELLA","RAJA RAM","SELL",{"v":600000,"d":"600,000"},5.5,"BSE"]
["2022-03-24",539986,"COMSYN","MINAKSHI RAJENDRA SARAF","BUY",{"v":75000,"d":"75,000"},278.89,"BSE"]
{"$rows_left_out":116}
{"sheet":"Call Tracker (Equity & F&O)","index":5,"n_rows":379,"n_cols":18,"rows_kept":379,"merged":[[108,0,109,0],[108,1,109,1],[108,9,109,9],[108,12,109,12],[108,14,109,14],[108,15,109,15]]}
[]
[]
[]
[]
[{"$nulls":12},"Back To Main Page"]
["Retail Research Technical Calls & Fundamental Performance Report for the month of Mar-2022"]
[{"$nulls":12},{"$f":"Main!B10","v":"2022-03-25"}]
[null,"Positional  Call"]
["Sr.no","Date",null,"Company","Rec","Rec Price","Stop Loss***","Call Closed At","Target","Remark","Profit / Loss per Share","All charges","Net Gain / Loss  %","Status","Closed Date","Market Closing Price"]
[1,"2022-01-21",null,"HCLTECH","Buy",1160,1090,{"v":1205,"d":"1,205.00"},"1250-1300","Part profit of Rs.45/-",{"$f":"H10-F10","v":45},{"$f":"(F10*-0.7)/100","v":-8.12},{"$f":"(K10+L10)/F10","v":{"v":0.031793103448275864,"d":"3.18%"}},"Successful","2022-03-11",null,null,"H"]
[2,"2022-01-25",null,"TRENT","Buy",1069,995,{"v":1132.5,"d":"1,132.50"},"1150-1200","Profit of Rs.63.5/-",63.5,{"$f":"(F11*-0.7)/100","v":{"v":-7.483,"d":"-7.48"}},{"v":0.05240130963517306,"d":"5.24%"},"Successful","2022-03-03",null,null,"H"]
[3,"2022-02-11",null,"CARBORUNIV","Buy",847.5,798,{"v":798,"d":"798.00"},"920-960","Loss of Rs.49.5/-",-49.5,{"$f":"(F12*-0.7)/100","v":{"v":-5.9325,"d":"-5.93"}},{"v":-0.06540707964601769,"d":"-6.54%"},"Unsuccessful","2022-03-03",null,null,"H"]
[4,"2022-02-28",null,"REDINGTON","Buy",148,138,{"v":156,"d":"156.00"},"160-170","Profit of Rs.8/-",8,{"$f":"(F13*-0.4)/100","v":{"v":-0.5920000000000001,"d":"-0.59"}},{"v":0.050054054054054054,"d":"5.01%"},"Successful","2022-03-03",null,null,"H"]
[5,"2022-02-28",null,"HDFC","Buy",2360,2230,{"v":2230,"d":"2,230.00"},"2500-2600","Loss of Rs.130/-",-130,{"$f":"(F14*-0.7)/100","v":-16.52},{"v":-0.06208474576271187,"d":"-6.21%"},"Unsuccessful","2022-03-04",null,null,"H"]
[6,"2022-02-28",null,"ICICIBANK","Buy",715,675,{"$f":"(675+738.5)/2","v":706.75},"750-780","Loss of Rs.8.25/-",-8.25,{"$f":"(F15*-0.4)/100","v":-2.86},{"v":-0.015538461538461537,"d":"-1.55%"},"Unsuccessful","2022-03-08",null,null,"H"]
[7,"2022-02-28",null,"AARTIIND","Buy",925,860,{"v":860,"d":"860.00"},"1000-1050","Loss of Rs.65/-",-65,{"$f":"(F16*-0.7)/100","v":{"v":-6.475,"d":"-6.48"}},{"v":-0.07727027027027027,"d":"-7.73%"},"Unsuccessful","2022-03-04",null,null,"H"]
[8,"2022-03-02",null,"BHARTIARTL","Buy",669,618,{"v":707.5,"d":"707.50"},"740-780","Profit of Rs.38.5/-",38.5,{"v":-4.683,"d":"-4.68"},{"v":0.05054857997010463,"d":"5.05%"},"Successful","2022-03-15",null,null,"H"]
[9,"2022-03-03",null,"ACC","Buy",1997.5,1870,{"v":2115,"d":"2,115.00"},"2150-2250","Profit of Rs.117.5/-",117.5,{"v":-13.9825,"d":"-13.98"},{"v":0.051823529411764706,"d":"5.18%"},"Successful","2022-03-16",null,null,"H"]
[10,"2022-03-07",null,"TRENT","Buy",1070,990,{"v":1132.5,"d":"1,132.50"},"1140-1200","Profit of Rs.62.5/-",62.5,-7.49,{"v":0.05141121495327103,"d":"5.14%"},"Successful","2022-03-09",null,null,"H"]
[11,"2022-03-07",null,"REDINGTON","Buy",146.5,135,{"v":153.5,"d":"153.50"},"160-170","Part profit of Rs.7/-",7,{"v":-1.0255,"d":"-1.03"},{"v":0.040781569965870304,"d":"4.08%"},"Successful","2022-03-10",{"$f":"VLOOKUP(D20,'MidCap Intra'!B16:C571,2,0)","v":151.15},null,"H"]
{"$rows_left_out":348}