{"text_format":"3","workbook":"xlsx","n_sheets":6,"sheets":["Main","Future Intra","Cash Intra","MidCap Intra","Bulk Deals","Call Tracker (Equity & F&O)"],"not_rendered":{"images":2,"external_links":1,"defined_names":2},"read":"whole","date_system":"1900"}

{"sheet":"Main","index":0,"n_rows":27,"n_cols":11,"rows_kept":27}
[null,"                                                                                                 "]
{"$rows_empty":8}
[null,"2022-02-25"]
[]
[null,"Sheet No.","Template Name","Summary"]
[null,1,"Future Intra","For Intraday trading in F&O segment"]
[null,2,"Cash Intra","For Intraday trading in cash market segment"]
[null,3,"Mid-cap Intra","For Intraday trading in Mid-cap stocks"]
[null,4,"Bulk Deals","Reveals Bulk Deals carried on NSE & BSE"]
[null,5,"Call Tracker"]
{"$rows_empty":9}
[{"$nulls":10},"`"]

{"sheet":"Future Intra","index":1,"n_rows":240,"n_cols":16,"rows_kept":240,"merged":[[8,0,9,0],[8,1,9,1],[8,2,9,2],[8,3,9,3],[8,6,8,8],[8,9,8,11]]}
[]
[]
[]
[]
[{"$nulls":12},"Back to Main Page"]
["FOR INTRA DAY TRADING",{"$nulls":10},{"$f":"Main!B10","v":"2022-02-25"}]
[]
[]
["Sr.no","Sector","Scrip","Expiry Date","CLOSE RATE","Pivot Point","Supports",null,null,"Resistances"]
[{"$nulls":4},"Point","Point","S1","S2","S3","R1","R2","R3","HIGH","LOW","OI","% Change in OI"]
[1,"Index","NIFTY","2022-03-31",{"v":16272.7,"d":"16272.70"},{"v":16428.68333333333,"d":"16428.68"},{"v":16070.366666666661,"d":"16070.37"},{"v":15868.033333333331,"d":"15868.03"},{"v":15509.716666666662,"d":"15509.72"},{"v":16631.016666666663,"d":"16631.02"},{"v":16989.333333333336,"d":"16989.33"},{"v":17191.66666666666,"d":"17191.67"},16787,16226.35,11668200,{"v":-0.10666886142043953,"d":"-10.67%"}]
[2,"Index","BANKNIFTY","2022-03-31",{"v":35243.7,"d":"35243.70"},{"v":35706.933333333334,"d":"35706.93"},{"v":34572.566666666666,"d":"34572.57"},{"v":33901.433333333334,"d":"33901.43"},{"v":32767.066666666666,"d":"32767.07"},{"v":36378.066666666666,"d":"36378.07"},{"v":37512.433333333334,"d":"37512.43"},{"v":38183.566666666666,"d":"38183.57"},36841.3,35035.8,2175500,{"v":-0.07244955605060917,"d":"-7.24%"}]
[3,"Index","FINNIFTY","2022-03-29",{"v":16411.4,"d":"16411.40"},{"v":16734.183333333334,"d":"16734.18"},{"v":15978.416666666668,"d":"15978.42"},{"v":15545.433333333334,"d":"15545.43"},{"v":14789.666666666668,"d":"14789.67"},{"v":17167.166666666668,"d":"17167.17"},{"v":17922.93333333333,"d":"17922.93"},{"v":18355.916666666668,"d":"18355.92"},17489.95,16301.2,3040,{"v":0.49019607843137253,"d":"49.02%"}]
[4,"Index","MIDCPNIFTY","2022-03-29",{"v":6700,"d":"6700.00"},{"v":6799.883333333334,"d":"6799.88"},{"v":6600.116666666669,"d":"6600.12"},{"v":6500.2333333333345,"d":"6500.23"},{"v":6300.466666666669,"d":"6300.47"},{"v":6899.766666666668,"d":"6899.77"},{"v":7099.533333333333,"d":"7099.53"},{"v":7199.416666666668,"d":"7199.42"},6999.65,6700,2175,{"v":0.3181818181818182,"d":"31.82%"}]
[5,"Chemical","AARTIIND","2022-03-31",{"v":864.1,"d":"864.10"},{"v":876.3166666666666,"d":"876.32"},{"v":847.2833333333332,"d":"847.28"},{"v":830.4666666666666,"d":"830.47"},{"v":801.4333333333332,"d":"801.43"},{"v":893.1333333333332,"d":"893.13"},{"v":922.1666666666665,"d":"922.17"},{"v":938.9833333333332,"d":"938.98"},905.35,859.5,2136900,{"v":-0.2808924485125858,"d":"-28.09%"}]
[6,"Pharma","ABBOTINDIA","2022-03-31",16741.45,{"v":16725.533333333336,"d":"16725.53"},{"v":16460.966666666674,"d":"16460.97"},{"v":16180.483333333337,"d":"16180.48"},{"v":15915.916666666675,"d":"15915.92"},{"v":17006.016666666674,"d":"17006.02"},{"v":17270.583333333332,"d":"17270.58"},{"v":17551.066666666673,"d":"17551.07"},16990.1,16445.05,36925,{"v":-0.2826614861583293,"d":"-28.27%"}]
[7,"Others","ABCAPITAL","2022-03-31",{"v":99.3,"d":"99.30"},{"v":101.53333333333335,"d":"101.53"},{"v":96.16666666666669,"d":"96.17"},{"v":93.03333333333335,"d":"93.03"},{"v":87.66666666666669,"d":"87.67"},{"v":104.66666666666669,"d":"104.67"},{"v":110.03333333333333,"d":"110.03"},{"v":113.16666666666669,"d":"113.17"},106.9,98.4,15892800,{"v":-0.11012564671101256,"d":"-11.01%"}]
[8,"Textile","ABFRL","2022-03-31",250.75,{"v":256.23333333333335,"d":"256.23"},{"v":243.36666666666667,"d":"243.37"},{"v":235.98333333333332,"d":"235.98"},{"v":223.11666666666665,"d":"223.12"},{"v":263.6166666666667,"d":"263.62"},{"v":276.48333333333335,"d":"276.48"},{"v":283.86666666666673,"d":"283.87"},269.1,248.85,12864800,{"v":-0.04497201312487937,"d":"-4.50%"}]
[9,"Cement","ACC","2022-03-31",{"v":2019.7,"d":"2019.70"},{"v":2051.5333333333333,"d":"2051.53"},{"v":1977.5666666666666,"d":"1977.57"},{"v":1935.4333333333334,"d":"1935.43"},{"v":1861.4666666666667,"d":"1861.47"},{"v":2093.6666666666665,"d":"2093.67"},{"v":2167.6333333333328,"d":"2167.63"},{"v":2209.7666666666664,"d":"2209.77"},2125.5,2009.4,2174250,{"v":-0.03730352003542174,"d":"-3.73%"}]
[10,"Others","ADANIENT","2022-03-31",1551.25,{"v":1582.1833333333334,"d":"1582.18"},{"v":1503.3166666666668,"d":"1503.32"},{"v":1455.3833333333334,"d":"1455.38"},{"v":1376.5166666666669,"d":"1376.52"},{"v":1630.1166666666668,"d":"1630.12"},{"v":1708.9833333333336,"d":"1708.98"},{"v":1756.9166666666667,"d":"1756.92"},1661.05,1534.25,21242000,{"v":-0.004078953537437292,"d":"-0.41%"}]
{"$rows_left_out":209}
{"sheet":"Cash Intra","index":2,"n_rows":246,"n_cols":13,"rows_kept":246,"merged":[[7,0,8,0],[7,1,8,1],[7,2,8,2],[7,3,8,3],[7,4,7,6],[7,7,7,9]]}
[]
[]
[]
[]
[{"$nulls":12},"Back to Main Page"]
["FOR INTRA DAY TRADING",{"$nulls":9},{"$f":"Main!B10","v":"2022-02-25"}]
[]
["Sr.no",null,"CLOSE RATE","Pivot Point","Supports",null,null,"Resistances"]
[{"$nulls":4},"S1","S2","S3","R1","R2","R3","HIGH","LOW","Total Trade Quanity in Lakhs"]
[1,"Nifty 50",16247.95,{"v":16385.483333333334,"d":"16385.48"},{"v":16065.716666666667,"d":"16065.72"},{"v":15883.483333333334,"d":"15883.48"},{"v":15563.716666666667,"d":"15563.72"},{"v":16567.716666666667,"d":"16567.72"},{"v":16887.483333333337,"d":"16887.48"},{"v":17069.716666666667,"d":"17069.72"},16705.25,16203.25]
[2,"Nifty Bank",35228.1,{"v":35642.86666666667,"d":"35642.87"},{"v":34576.583333333336,"d":"34576.58"},{"v":33925.066666666666,"d":"33925.07"},{"v":32858.78333333333,"d":"32858.78"},{"v":36294.38333333334,"d":"36294.38"},{"v":37360.666666666664,"d":"37360.67"},{"v":38012.18333333334,"d":"38012.18"},36709.15,34991.35]
[3,"Nifty CPSE",2248.4,{"v":2270.016666666667,"d":"2270.02"},{"v":2219.833333333334,"d":"2219.83"},{"v":2191.266666666667,"d":"2191.27"},{"v":2141.083333333334,"d":"2141.08"},{"v":2298.583333333334,"d":"2298.58"},{"v":2348.7666666666673,"d":"2348.77"},{"v":2377.333333333334,"d":"2377.33"},2320.2,2241.45]
[4,"Nifty Infra",4581.65,{"v":4631.633333333333,"d":"4631.63"},{"v":4520.616666666667,"d":"4520.62"},{"v":4459.583333333334,"d":"4459.58"},{"v":4348.5666666666675,"d":"4348.57"},{"v":4692.666666666666,"d":"4692.67"},{"v":4803.6833333333325,"d":"4803.68"},{"v":4864.716666666665,"d":"4864.72"},4742.65,4570.6]
[5,"Nifty IT",32547.9,{"v":32794.13333333333,"d":"32794.13"},{"v":32192.016666666663,"d":"32192.02"},{"v":31836.13333333333,"d":"31836.13"},{"v":31234.016666666663,"d":"31234.02"},{"v":33150.01666666666,"d":"33150.02"},{"v":33752.13333333333,"d":"33752.13"},{"v":34108.01666666666,"d":"34108.02"},33396.25,32438.25]
[6,"Nifty PSE",3692.35,{"v":3736.183333333333,"d":"3736.18"},{"v":3638.166666666666,"d":"3638.17"},{"v":3583.983333333333,"d":"3583.98"},{"v":3485.9666666666662,"d":"3485.97"},{"v":3790.366666666666,"d":"3790.37"},{"v":3888.383333333333,"d":"3888.38"},{"v":3942.5666666666657,"d":"3942.57"},3834.2,3682]
[7,"Nifty Midcap 50",7407.65,{"v":7505.983333333333,"d":"7505.98"},{"v":7296.5166666666655,"d":"7296.52"},{"v":7185.383333333333,"d":"7185.38"},{"v":6975.916666666666,"d":"6975.92"},{"v":7617.116666666665,"d":"7617.12"},{"v":7826.583333333332,"d":"7826.58"},{"v":7937.716666666664,"d":"7937.72"},7715.45,7394.85]
[8,"ACC",2014,2045.55,{"v":1970.4499999999998,"d":"1970.45"},{"v":1926.8999999999999,"d":"1926.90"},{"v":1851.7999999999997,"d":"1851.80"},{"v":2089.1,"d":"2089.10"},{"v":2164.2,"d":"2164.20"},2207.75,2120.65,2002,4.74202]
[9,"AUBANK",1179.55,{"v":1203.1499999999999,"d":"1203.15"},{"v":1141.3999999999996,"d":"1141.40"},{"v":1103.2499999999998,"d":"1103.25"},{"v":1041.4999999999995,"d":"1041.50"},{"v":1241.2999999999997,"d":"1241.30"},{"v":1303.0500000000002,"d":"1303.05"},{"v":1341.1999999999998,"d":"1341.20"},1264.9,1165,13.08463]
[10,"AARTIIND",865.85,{"v":877.9499999999999,"d":"877.95"},{"v":848.8999999999999,"d":"848.90"},{"v":831.9499999999999,"d":"831.95"},{"v":802.8999999999999,"d":"802.90"},{"v":894.8999999999999,"d":"894.90"},{"v":923.9499999999998,"d":"923.95"},{"v":940.8999999999999,"d":"940.90"},907,861,12.6602]
[11,"ADANIENT",1543.95,{"v":1573.7833333333335,"d":"1573.78"},{"v":1498.9666666666672,"d":"1498.97"},{"v":1453.9833333333336,"d":"1453.98"},{"v":1379.1666666666672,"d":"1379.17"},{"v":1618.766666666667,"d":"1618.77"},{"v":1693.5833333333333,"d":"1693.58"},{"v":1738.566666666667,"d":"1738.57"},1648.6,1528.8,27.98065]
{"$rows_left_out":227}
{"sheet":"MidCap Intra","index":3,"n_rows":531,"n_cols":13,"rows_kept":531,"merged":[[0,0,0,1],[8,0,9,0],[8,1,9,1],[8,2,9,2],[8,3,9,3],[8,4,8,6],[8,7,8,9]]}
[]
[]
[]
[]
[{"$nulls":11},"Back To Main Page"]
["FOR INTRA DAY TRADING",{"$nulls":9},{"$f":"Main!B10","v":"2022-02-25"}]
[null,null," "]
[]
["Sr.no","Scrip","CLOSE RATE","Pivot Point","Supports",null,null,"Resistances"]
[{"$nulls":4},"S1","S2","S3","R1","R2","R3","HIGH","LOW","Total Trade Quanity in Lakhs"]
[1,"3MINDIA",20568.2,{"v":20659.916666666668,"d":"20659.92"},{"v":20208.283333333336,"d":"20208.28"},{"v":19848.36666666667,"d":"19848.37"},{"v":19396.733333333337,"d":"19396.73"},{"v":21019.833333333336,"d":"21019.83"},{"v":21471.466666666667,"d":"21471.47"},{"v":21831.383333333335,"d":"21831.38"},21111.55,20300,0.04518]
[2,"AARTIDRUGS",453.4,{"v":463.4666666666667,"d":"463.47"},{"v":439.9333333333334,"d":"439.93"},{"v":426.4666666666667,"d":"426.47"},{"v":402.9333333333334,"d":"402.93"},{"v":476.9333333333334,"d":"476.93"},{"v":500.4666666666667,"d":"500.47"},{"v":513.9333333333334,"d":"513.93"},487,450,2.61995]
[3,"AARTIIND",865.85,{"v":877.9499999999999,"d":"877.95"},{"v":848.8999999999999,"d":"848.90"},{"v":831.9499999999999,"d":"831.95"},{"v":802.8999999999999,"d":"802.90"},{"v":894.8999999999999,"d":"894.90"},{"v":923.9499999999998,"d":"923.95"},{"v":940.8999999999999,"d":"940.90"},907,861,12.6602]
[4,"AAVAS",2905.2,2920.35,{"v":2853.7,"d":"2853.70"},{"v":2802.2,"d":"2802.20"},{"v":2735.5499999999997,"d":"2735.55"},2971.85,{"v":3038.5000000000005,"d":"3038.50"},{"v":3090,"d":"3090.00"},2987,2868.85,0.8866]
[5,"ABB",2045.55,{"v":2048.1666666666665,"d":"2048.17"},{"v":1997.3833333333332,"d":"1997.38"},{"v":1949.2166666666667,"d":"1949.22"},{"v":1898.4333333333334,"d":"1898.43"},{"v":2096.333333333333,"d":"2096.33"},{"v":2147.116666666667,"d":"2147.12"},{"v":2195.283333333333,"d":"2195.28"},2098.95,2000,3.60203]
[6,"ABBOTINDIA",16777.6,{"v":16675.866666666665,"d":"16675.87"},{"v":16401.73333333333,"d":"16401.73"},{"v":16025.866666666665,"d":"16025.87"},{"v":15751.73333333333,"d":"15751.73"},{"v":17051.73333333333,"d":"17051.73"},{"v":17325.86666666667,"d":"17325.87"},{"v":17701.73333333333,"d":"17701.73"},16950,16300,0.43783]
[7,"ABCAPITAL",99.3,{"v":101.64999999999999,"d":"101.65"},{"v":96.19999999999999,"d":"96.20"},{"v":93.1,"d":"93.10"},{"v":87.64999999999999,"d":"87.65"},{"v":104.74999999999999,"d":"104.75"},{"v":110.2,"d":"110.20"},{"v":113.29999999999998,"d":"113.30"},107.1,98.55,73.84232]
[8,"ABFRL",250.8,{"v":256.1666666666667,"d":"256.17"},{"v":244.63333333333338,"d":"244.63"},{"v":238.4666666666667,"d":"238.47"},{"v":226.9333333333334,"d":"226.93"},{"v":262.33333333333337,"d":"262.33"},{"v":273.8666666666667,"d":"273.87"},{"v":280.03333333333336,"d":"280.03"},267.7,250,56.3343]
[9,"ACC",2014,2045.55,{"v":1970.4499999999998,"d":"1970.45"},{"v":1926.8999999999999,"d":"1926.90"},{"v":1851.7999999999997,"d":"1851.80"},{"v":2089.1,"d":"2089.10"},{"v":2164.2,"d":"2164.20"},2207.75,2120.65,2002,4.74202]
[10,"ADANIENT",1543.95,{"v":1573.7833333333335,"d":"1573.78"},{"v":1498.9666666666672,"d":"1498.97"},{"v":1453.9833333333336,"d":"1453.98"},{"v":1379.1666666666672,"d":"1379.17"},{"v":1618.766666666667,"d":"1618.77"},{"v":1693.5833333333333,"d":"1693.58"},{"v":1738.566666666667,"d":"1738.57"},1648.6,1528.8,27.98065]
{"$rows_left_out":512}
{"sheet":"Bulk Deals","index":4,"n_rows":107,"n_cols":8,"rows_kept":107,"merged":[[4,0,4,1],[4,2,4,3],[6,1,6,2]]}
[" "]
[]
[]
[]
[]
[{"$nulls":4},"Back To Main Page"]
["Subject :","BULK DEAL",null,{"$f":"Main!B10","v":"2022-02-25"}]
[]
["Date","Scrip code","Scrip Name","Client Name","Buy / Sell","Quantity Traded","Trade Price / Wt.Avg.trade price","Exchange  "]
["2022-02-24",539773,"ADVIKCA","PARESH DHIRAJLAL SHAH","BUY",{"v":2000,"d":"2,000"},2.91,"BSE"]
["2022-02-24",539773,"ADVIKCA","PARESH DHIRAJLAL SHAH","SELL",{"v":302000,"d":"302,000"},2.91,"BSE"]
["2022-02-24",539773,"ADVIKCA","ALPHA LEON ENTERPRISES LLP","SELL",{"v":403769,"d":"403,769"},2.91,"BSE"]
["2022-02-24",537069,"ARNOLD","KEEMTEE FINANCIAL SERVICES LTD","BUY",{"v":1028815,"d":"1,028,815"},12,"BSE"]
["2022-02-24",537069,"ARNOLD","KEERTI KNOWLEDGE AND SKILLS LIMITED","SELL",{"v":171582,"d":"171,582"},12,"BSE"]
["2022-02-24",537069,"ARNOLD","NAVRATRI SHARE TRADING PRIVATE LIMITED .","SELL",{"v":1000000,"d":"1,000,000"},12,"BSE"]
["2022-02-24",543435,"CLARA","BIPIN CHINUBHAI SHAH","SELL",{"v":30000,"d":"30,000"},97,"BSE"]
["2022-02-24",543435,"CLARA","SHIVAAY TRADING COMPANY","BUY",{"v":33000,"d":"33,000"},96.64,"BSE"]
["2022-02-24",539197,"DEVHARI","RASHMIBHARDWAJ","BUY",{"v":1030500,"d":"1,030,500"},1.09,"BSE"]
["2022-02-24",539197,"DEVHARI","KAVIPRIYA GURUPRASATH","BUY",{"v":400000,"d":"400,000"},1.05,"BSE"]
["2022-02-24",504397,"GANHOLD","JAYESH DILIPKUMAR SHAH","BUY",500,51.15,"BSE"]
{"$rows_left_out":88}
{"sheet":"Call Tracker (Equity & F&O)","index":5,"n_rows":338,"n_cols":18,"rows_kept":338,"merged":[[66,0,67,0],[66,1,67,1],[66,9,67,9],[66,12,67,12],[66,13,67,13],[66,14,67,14],[66,15,67,15],[98,0,99,0],[98,1,99,1],[98,9,99,9],[98,12,99,12],[98,13,99,13],[98,14,99,14],[98,15,99,15],[103,0,104,0],[103,1,104,1],[103,9,104,9],[103,12,104,12],[103,13,104,13],[103,14,104,14],[103,15,104,15]]}
[]
[]
[]
[]
[{"$nulls":12},"Back To Main Page"]
["Retail Research Technical Calls & Fundamental Performance Report for the month of Feb-2022"]
[{"$nulls":12},{"$f":"Main!B10","v":"2022-02-25"}]
[null,"Positional  Call"]
["Sr.no","Date",null,"Company","Rec","Rec Price","Stop Loss***","Call Closed At","Target","Remark","Profit / Loss per Share","All charges","Net Gain / Loss  %","Status","Closed Date","Market Closing Price"]
[1,"2022-01-21",null,"HCLTECH","Buy","1150-1170",1090,null,"1250-1300","Open",{"$nulls":5},{"$f":"VLOOKUP(D10,'MidCap Intra'!B55:C546,2,0)","v":1098.55},null,"H"]
[2,"2022-01-21",null,"TCS","Buy",3775,3590,{"v":3590,"d":"3,590.00"},"4000-4100","Loss of Rs.185/-",{"$f":"H11-F11","v":-185},{"$f":"(F11*-0.7)/100","v":{"v":-26.425,"d":"-26.43"}},{"$f":"(K11+L11)/F11","v":{"v":-0.0560066225165563,"d":"-5.60%"}},"Unsuccessful","2022-02-23",null,null,"H"]
[3,"2022-01-25",null,"TATACOMM","Buy",1255,1190,{"v":1327.5,"d":"1,327.50"},"1350-1400","Profit of Rs.72.5/-",{"$f":"H12-F12","v":72.5},{"$f":"(F12*-0.7)/100","v":{"v":-8.785,"d":"-8.79"}},{"$f":"(K12+L12)/F12","v":{"v":0.05076892430278885,"d":"5.08%"}},"Successful","2022-02-03",null,null,"H"]
[4,"2022-01-25",null,"HDFC","Buy",2500,2340,{"v":2595,"d":"2,595.00"},"2700-2800","Profit of Rs.95/-",{"$f":"H13-F13","v":95},{"$f":"(F13*-0.7)/100","v":{"v":-17.5,"d":"-17.50"}},{"$f":"(K13+L13)/F13","v":{"v":0.031,"d":"3.10%"}},"Successful","2022-02-01",null,null,"H"]
[5,"2022-01-25",null,"CARBORUNIV","Buy",855,815,{"v":905,"d":"905.00"},"900-930","Profit of Rs.50/-",{"$f":"H14-F14","v":50},{"$f":"(F14*-0.7)/100","v":{"v":-5.985,"d":"-5.99"}},{"$f":"(K14+L14)/F14","v":{"v":0.05147953216374269,"d":"5.15%"}},"Successful","2022-02-04",null,null,"H"]
[6,"2022-01-25",null,"TRENT","Buy","1060-1080",995,null,"1150-1200","Open",{"$nulls":5},{"$f":"VLOOKUP(D15,'MidCap Intra'!B62:C553,2,0)","v":1020.65},null,"H"]
[7,"2022-01-27",null,"SRF","Buy",2360,2200,{"v":2505,"d":"2,505.00"},"2550-2650","Profit of Rs.145/-",{"$f":"H16-F16","v":145},{"$f":"(F16*-0.7)/100","v":-16.52},{"$f":"(K16+L16)/F16","v":{"v":0.05444067796610169,"d":"5.44%"}},"Successful","2022-02-07",null,null,"N"]
[8,"2022-01-28",null,"INDIGO","Buy",1860,1695,{"v":1900,"d":"1,900.00"},"2050-2150","Profit of Rs.40/-",40,-13.02,{"v":0.014505376344086022,"d":"1.45%"},"Successful","2022-02-01",null,null,"H"]
[9,"2022-02-03",null,"APOLLOTYRE","Buy",223.5,210,{"v":210,"d":"210.00"},"240-250","Loss of Rs.13.5/-",-13.5,{"v":-1.5644999999999998,"d":"-1.56"},{"v":-0.06740268456375838,"d":"-6.74%"},"Unsuccessful","2022-02-18",null,null,"N"]
[10,"2022-02-07",null,"SUMICHEM","Buy",412.5,387,{"v":387,"d":"387.00"},"440-460","Loss of Rs.25.5/-",{"$f":"H19-F19","v":-25.5},{"$f":"(F19*-0.7)/100","v":{"v":-2.8875,"d":"-2.89"}},{"$f":"(K19+L19)/F19","v":{"v":-0.06881818181818182,"d":"-6.88%"}},"Unsuccessful","2022-02-17",null,null,"H"]
[11,"2022-02-09",null,"REDINGTON","Buy",162.5,149,{"v":177,"d":"177.00"},"180-190","Profit of Rs.14.5/-",{"$f":"H20-F20","v":14.5},{"$f":"(F20*-0.7)/100","v":{"v":-1.1375,"d":"-1.14"}},{"$f":"(K20+L20)/F20","v":{"v":0.08223076923076923,"d":"8.22%"}},"Successful","2022-02-10",null,null,"H"]
{"$rows_left_out":307}