{"text_format":"3","workbook":"xlsx","n_sheets":6,"sheets":["Main","Future Intra","Cash Intra","MidCap Intra","Bulk Deals","Call Tracker (Equity & F&O)"],"not_rendered":{"images":2,"defined_names":2},"read":"whole","date_system":"1900"}

{"sheet":"Main","index":0,"n_rows":27,"n_cols":11,"rows_kept":27}
[null,"                                                                                                 "]
{"$rows_empty":8}
[null,"2022-04-22"]
[]
[null,"Sheet No.","Template Name","Summary"]
[null,1,"Future Intra","For Intraday trading in F&O segment"]
[null,2,"Cash Intra","For Intraday trading in cash market segment"]
[null,3,"Mid-cap Intra","For Intraday trading in Mid-cap stocks"]
[null,4,"Bulk Deals","Reveals Bulk Deals carried on NSE & BSE"]
[null,5,"Call Tracker"]
{"$rows_empty":9}
[{"$nulls":10},"`"]

{"sheet":"Future Intra","index":1,"n_rows":240,"n_cols":16,"rows_kept":240,"merged":[[8,0,9,0],[8,1,9,1],[8,2,9,2],[8,3,9,3],[8,6,8,8],[8,9,8,11]]}
[]
[]
[]
[]
[{"$nulls":12},"Back to Main Page"]
["FOR INTRA DAY TRADING",{"$nulls":10},{"$f":"Main!B10","v":"2022-04-22"}]
[]
[]
["Sr.no","Sector","Scrip","Expiry Date","CLOSE RATE","Pivot Point","Supports",null,null,"Resistances"]
[{"$nulls":4},"Point","Point","S1","S2","S3","R1","R2","R3","HIGH","LOW","OI","% Change in OI"]
[1,"Index","NIFTY","2022-04-28",17410.15,17357.05,{"v":17275.1,"d":"17275.10"},17140.05,{"v":17058.1,"d":"17058.10"},{"v":17492.1,"d":"17492.10"},{"v":17574.050000000003,"d":"17574.05"},{"v":17709.1,"d":"17709.10"},17439,17222,11987050,{"v":0.08433478821321151,"d":"8.43%"}]
[2,"Index","BANKNIFTY","2022-04-28",36930.25,{"v":36819.4,"d":"36819.40"},{"v":36588.8,"d":"36588.80"},36247.35,36016.75,{"v":37160.850000000006,"d":"37160.85"},37391.45,{"v":37732.90000000001,"d":"37732.90"},37050,36477.95,2649550,{"v":-0.010022885432721498,"d":"-1.00%"}]
[3,"Index","FINNIFTY","2022-04-26",{"v":17022.1,"d":"17022.10"},{"v":16950.8,"d":"16950.80"},{"v":16851.649999999998,"d":"16851.65"},{"v":16681.199999999997,"d":"16681.20"},{"v":16582.049999999996,"d":"16582.05"},17121.25,{"v":17220.4,"d":"17220.40"},{"v":17390.850000000002,"d":"17390.85"},17049.95,16780.35,3280,{"v":0.07894736842105263,"d":"7.89%"}]
[4,"Index","MIDCPNIFTY","2022-04-26",7350.15,{"v":2450.0499999999997,"d":"2450.05"},{"v":4900.099999999999,"d":"4900.10"},{"v":2450.0499999999997,"d":"2450.05"},{"v":4900.099999999999,"d":"4900.10"},{"v":4900.099999999999,"d":"4900.10"},{"v":2450.0499999999997,"d":"2450.05"},{"v":4900.099999999999,"d":"4900.10"},0,0,1575,{"v":0,"d":"0.00%"}]
[5,"Chemical","AARTIIND","2022-04-28",{"v":945,"d":"945.00"},{"v":947.5333333333334,"d":"947.53"},{"v":940.6666666666669,"d":"940.67"},{"v":936.3333333333335,"d":"936.33"},{"v":929.4666666666669,"d":"929.47"},{"v":951.8666666666668,"d":"951.87"},{"v":958.7333333333333,"d":"958.73"},{"v":963.0666666666667,"d":"963.07"},954.4,943.2,2023850,{"v":0.04659340659340659,"d":"4.66%"}]
[6,"Capital_Goods","ABB","2022-04-28",{"v":2143.2,"d":"2143.20"},{"v":2144.8666666666663,"d":"2144.87"},{"v":2124.783333333333,"d":"2124.78"},{"v":2106.3666666666663,"d":"2106.37"},{"v":2086.283333333333,"d":"2086.28"},{"v":2163.283333333333,"d":"2163.28"},{"v":2183.366666666666,"d":"2183.37"},{"v":2201.783333333333,"d":"2201.78"},2164.95,2126.45,266250,{"v":0.020114942528735632,"d":"2.01%"}]
[7,"Pharma","ABBOTINDIA","2022-04-28",{"v":17439.2,"d":"17439.20"},{"v":17311.083333333332,"d":"17311.08"},{"v":17052.316666666666,"d":"17052.32"},{"v":16665.433333333334,"d":"16665.43"},{"v":16406.666666666668,"d":"16406.67"},{"v":17697.966666666664,"d":"17697.97"},{"v":17956.733333333334,"d":"17956.73"},{"v":18343.61666666666,"d":"18343.62"},17569.85,16924.2,35000,{"v":-0.047619047619047616,"d":"-4.76%"}]
[8,"Others","ABCAPITAL","2022-04-28",113.65,{"v":112.65000000000002,"d":"112.65"},{"v":111.40000000000003,"d":"111.40"},{"v":109.15000000000002,"d":"109.15"},{"v":107.90000000000003,"d":"107.90"},{"v":114.90000000000003,"d":"114.90"},116.15,{"v":118.40000000000003,"d":"118.40"},113.9,110.4,22435600,{"v":0.00611681136543015,"d":"0.61%"}]
[9,"Textile","ABFRL","2022-04-28",293.65,{"v":294.18333333333334,"d":"294.18"},{"v":291.31666666666666,"d":"291.32"},{"v":288.98333333333335,"d":"288.98"},{"v":286.1166666666667,"d":"286.12"},{"v":296.51666666666665,"d":"296.52"},{"v":299.3833333333333,"d":"299.38"},{"v":301.71666666666664,"d":"301.72"},297.05,291.85,12009400,{"v":0.04525910839556461,"d":"4.53%"}]
[10,"Cement","ACC","2022-04-28",{"v":2269.5,"d":"2269.50"},{"v":2249.7833333333333,"d":"2249.78"},{"v":2224.5666666666666,"d":"2224.57"},{"v":2179.633333333333,"d":"2179.63"},{"v":2154.4166666666665,"d":"2154.42"},{"v":2294.7166666666667,"d":"2294.72"},{"v":2319.933333333333,"d":"2319.93"},{"v":2364.866666666667,"d":"2364.87"},2275,2204.85,3326000,{"v":-0.08026270307639129,"d":"-8.03%"}]
{"$rows_left_out":211}
{"sheet":"Cash Intra","index":2,"n_rows":246,"n_cols":13,"rows_kept":246,"merged":[[7,0,8,0],[7,1,8,1],[7,2,8,2],[7,3,8,3],[7,4,7,6],[7,7,7,9]]}
[]
[]
[]
[]
[{"$nulls":12},"Back to Main Page"]
["FOR INTRA DAY TRADING",{"$nulls":9},{"$f":"Main!B10","v":"2022-04-22"}]
[]
["Sr.no",null,"CLOSE RATE","Pivot Point","Supports",null,null,"Resistances"]
[{"$nulls":4},"S1","S2","S3","R1","R2","R3","HIGH","LOW","Total Trade Quanity in Lakhs"]
[1,"Nifty 50",17392.6,{"v":17340.933333333334,"d":"17340.93"},{"v":17267.166666666668,"d":"17267.17"},{"v":17141.733333333334,"d":"17141.73"},{"v":17067.966666666667,"d":"17067.97"},{"v":17466.36666666667,"d":"17466.37"},{"v":17540.13333333333,"d":"17540.13"},{"v":17665.56666666667,"d":"17665.57"},17414.7,17215.5]
[2,"Nifty Bank",36816.1,{"v":36708.38333333333,"d":"36708.38"},{"v":36503.416666666664,"d":"36503.42"},{"v":36190.73333333333,"d":"36190.73"},{"v":35985.76666666666,"d":"35985.77"},{"v":37021.066666666666,"d":"37021.07"},{"v":37226.03333333334,"d":"37226.03"},{"v":37538.71666666667,"d":"37538.72"},36913.35,36395.7]
[3,"Nifty CPSE",2795.4,{"v":2790.9,"d":"2790.90"},{"v":2781.8500000000004,"d":"2781.85"},{"v":2768.3,"d":"2768.30"},{"v":2759.2500000000005,"d":"2759.25"},{"v":2804.4500000000003,"d":"2804.45"},{"v":2813.5000000000005,"d":"2813.50"},2827.05,2799.95,2777.35]
[4,"Nifty Infra",5237.85,{"v":5226.283333333333,"d":"5226.28"},{"v":5206.366666666666,"d":"5206.37"},{"v":5174.883333333333,"d":"5174.88"},{"v":5154.966666666666,"d":"5154.97"},{"v":5257.7666666666655,"d":"5257.77"},{"v":5277.683333333333,"d":"5277.68"},{"v":5309.166666666665,"d":"5309.17"},5246.2,5194.8]
[5,"Nifty IT",32611.6,{"v":32485.63333333333,"d":"32485.63"},{"v":32271.266666666663,"d":"32271.27"},{"v":31930.93333333333,"d":"31930.93"},{"v":31716.566666666662,"d":"31716.57"},{"v":32825.96666666666,"d":"32825.97"},{"v":33040.33333333333,"d":"33040.33"},{"v":33380.666666666664,"d":"33380.67"},32700,32145.3]
[6,"Nifty PSE",4469.9,{"v":4461.566666666667,"d":"4461.57"},{"v":4447.633333333333,"d":"4447.63"},{"v":4425.366666666667,"d":"4425.37"},{"v":4411.433333333333,"d":"4411.43"},{"v":4483.833333333333,"d":"4483.83"},{"v":4497.7666666666655,"d":"4497.77"},{"v":4520.033333333333,"d":"4520.03"},4475.5,4439.3]
[7,"Nifty Midcap 50",8386.7,{"v":8375.250000000002,"d":"8375.25"},{"v":8354.150000000003,"d":"8354.15"},{"v":8321.600000000002,"d":"8321.60"},{"v":8300.500000000004,"d":"8300.50"},{"v":8407.800000000003,"d":"8407.80"},{"v":8428.900000000001,"d":"8428.90"},{"v":8461.450000000003,"d":"8461.45"},8396.35,8342.7]
[8,"ACC",2270.1,{"v":2250.116666666667,"d":"2250.12"},{"v":2225.2333333333336,"d":"2225.23"},{"v":2180.366666666667,"d":"2180.37"},{"v":2155.4833333333336,"d":"2155.48"},{"v":2294.9833333333336,"d":"2294.98"},{"v":2319.866666666667,"d":"2319.87"},{"v":2364.7333333333336,"d":"2364.73"},2275,2205.25,14.91272]
[9,"AUBANK",1435.05,{"v":1441.3333333333333,"d":"1441.33"},{"v":1416.7166666666665,"d":"1416.72"},{"v":1398.3833333333332,"d":"1398.38"},{"v":1373.7666666666664,"d":"1373.77"},{"v":1459.6666666666665,"d":"1459.67"},{"v":1484.2833333333333,"d":"1484.28"},{"v":1502.6166666666666,"d":"1502.62"},1465.95,1423,10.94297]
[10,"AARTIIND",940.8,{"v":943.9833333333332,"d":"943.98"},{"v":935.9666666666665,"d":"935.97"},{"v":931.1333333333332,"d":"931.13"},{"v":923.1166666666664,"d":"923.12"},{"v":948.8166666666665,"d":"948.82"},{"v":956.8333333333331,"d":"956.83"},{"v":961.6666666666665,"d":"961.67"},952,939.15,3.48379]
[11,"ADANIENT",2286.35,{"v":2261.2666666666664,"d":"2261.27"},{"v":2228.9833333333327,"d":"2228.98"},{"v":2171.6166666666663,"d":"2171.62"},{"v":2139.3333333333326,"d":"2139.33"},{"v":2318.6333333333328,"d":"2318.63"},{"v":2350.9166666666665,"d":"2350.92"},{"v":2408.283333333333,"d":"2408.28"},2293.55,2203.9,22.43636]
{"$rows_left_out":227}
{"sheet":"MidCap Intra","index":3,"n_rows":531,"n_cols":13,"rows_kept":531,"merged":[[0,0,0,1],[8,0,9,0],[8,1,9,1],[8,2,9,2],[8,3,9,3],[8,4,8,6],[8,7,8,9]]}
[]
[]
[]
[]
[{"$nulls":11},"Back To Main Page"]
["FOR INTRA DAY TRADING",{"$nulls":9},{"$f":"Main!B10","v":"2022-04-22"}]
[null,null," "]
[]
["Sr.no","Scrip","CLOSE RATE","Pivot Point","Supports",null,null,"Resistances"]
[{"$nulls":4},"S1","S2","S3","R1","R2","R3","HIGH","LOW","Total Trade Quanity in Lakhs"]
[1,"3MINDIA",21209.6,{"v":21124.866666666665,"d":"21124.87"},{"v":20851.73333333333,"d":"20851.73"},{"v":20493.866666666665,"d":"20493.87"},{"v":20220.73333333333,"d":"20220.73"},{"v":21482.73333333333,"d":"21482.73"},{"v":21755.86666666667,"d":"21755.87"},{"v":22113.73333333333,"d":"22113.73"},21398,20767,0.01384]
[2,"AARTIDRUGS",491.5,{"v":491.2833333333333,"d":"491.28"},{"v":486.5666666666666,"d":"486.57"},{"v":481.6333333333333,"d":"481.63"},{"v":476.91666666666663,"d":"476.92"},{"v":496.2166666666666,"d":"496.22"},{"v":500.9333333333333,"d":"500.93"},{"v":505.86666666666656,"d":"505.87"},496,486.35,0.59105]
[3,"AARTIIND",940.8,{"v":943.9833333333332,"d":"943.98"},{"v":935.9666666666665,"d":"935.97"},{"v":931.1333333333332,"d":"931.13"},{"v":923.1166666666664,"d":"923.12"},{"v":948.8166666666665,"d":"948.82"},{"v":956.8333333333331,"d":"956.83"},{"v":961.6666666666665,"d":"961.67"},952,939.15,3.48379]
[4,"AAVAS",2405.45,{"v":2429.933333333333,"d":"2429.93"},{"v":2375.516666666666,"d":"2375.52"},{"v":2345.583333333333,"d":"2345.58"},{"v":2291.166666666666,"d":"2291.17"},{"v":2459.866666666666,"d":"2459.87"},{"v":2514.283333333333,"d":"2514.28"},{"v":2544.216666666666,"d":"2544.22"},2484.35,2400,0.41995]
[5,"ABB",2143.5,{"v":2145.4666666666667,"d":"2145.47"},{"v":2121.2333333333336,"d":"2121.23"},{"v":2098.9666666666667,"d":"2098.97"},{"v":2074.7333333333336,"d":"2074.73"},{"v":2167.7333333333336,"d":"2167.73"},{"v":2191.9666666666662,"d":"2191.97"},{"v":2214.2333333333336,"d":"2214.23"},2169.7,2123.2,1.22239]
[6,"ABBOTINDIA",17428.85,{"v":17293.483333333334,"d":"17293.48"},{"v":17047.016666666666,"d":"17047.02"},{"v":16665.183333333334,"d":"16665.18"},{"v":16418.716666666667,"d":"16418.72"},{"v":17675.316666666666,"d":"17675.32"},{"v":17921.783333333333,"d":"17921.78"},{"v":18303.616666666665,"d":"18303.62"},17539.95,16911.65,0.17973]
[7,"ABCAPITAL",113.65,{"v":112.60000000000001,"d":"112.60"},{"v":111.30000000000001,"d":"111.30"},108.95,107.65,{"v":114.95000000000002,"d":"114.95"},116.25,{"v":118.60000000000002,"d":"118.60"},113.9,110.25,54.15248]
[8,"ABFRL",292.8,{"v":293.4,"d":"293.40"},{"v":290.29999999999995,"d":"290.30"},{"v":287.79999999999995,"d":"287.80"},{"v":284.69999999999993,"d":"284.70"},{"v":295.9,"d":"295.90"},{"v":299,"d":"299.00"},{"v":301.5,"d":"301.50"},296.5,290.9,21.81901]
[9,"ACC",2270.1,{"v":2250.116666666667,"d":"2250.12"},{"v":2225.2333333333336,"d":"2225.23"},{"v":2180.366666666667,"d":"2180.37"},{"v":2155.4833333333336,"d":"2155.48"},{"v":2294.9833333333336,"d":"2294.98"},{"v":2319.866666666667,"d":"2319.87"},{"v":2364.7333333333336,"d":"2364.73"},2275,2205.25,14.91272]
[10,"ADANIENT",2286.35,{"v":2261.2666666666664,"d":"2261.27"},{"v":2228.9833333333327,"d":"2228.98"},{"v":2171.6166666666663,"d":"2171.62"},{"v":2139.3333333333326,"d":"2139.33"},{"v":2318.6333333333328,"d":"2318.63"},{"v":2350.9166666666665,"d":"2350.92"},{"v":2408.283333333333,"d":"2408.28"},2293.55,2203.9,22.43636]
{"$rows_left_out":512}
{"sheet":"Bulk Deals","index":4,"n_rows":187,"n_cols":8,"rows_kept":187,"merged":[[4,0,4,1],[4,2,4,3],[6,1,6,2]]}
[" "]
[]
[]
[]
[]
[{"$nulls":4},"Back To Main Page"]
["Subject :","BULK DEAL",null,{"$f":"Main!B10","v":"2022-04-22"}]
[]
["Date","Scrip code","Scrip Name","Client Name","Buy / Sell","Quantity Traded","Trade Price / Wt.Avg.trade price","Exchange  "]
["2022-04-21",540615,"7NR","KAUSHIK SHAH SHARES & SEC. LTD","BUY",{"v":600000,"d":"600,000"},2.46,"BSE"]
["2022-04-21",539773,"ADVIKCA","STEPPING STONE CONSTRUCTION PRIVATE LIMITED","SELL",{"v":337646,"d":"337,646"},6.01,"BSE"]
["2022-04-21",539773,"ADVIKCA","NISHCHAYA TRADINGS PRIVATE LIMITED","BUY",{"v":233385,"d":"233,385"},5.7,"BSE"]
["2022-04-21",539773,"ADVIKCA","NISHCHAYA TRADINGS PRIVATE LIMITED","SELL",{"v":184503,"d":"184,503"},6.01,"BSE"]
["2022-04-21",539773,"ADVIKCA","ALTOLITE ELECTRO SIGNS PRIVATE LIMITED","SELL",{"v":280000,"d":"280,000"},6.01,"BSE"]
["2022-04-21",540135,"ARCFIN","BP FINTRADE PRIVATE LIMITED","BUY",{"v":3238526,"d":"3,238,526"},1.93,"BSE"]
["2022-04-21",540135,"ARCFIN","ALPHA LEON ENTERPRISES LLP","BUY",{"v":5089606,"d":"5,089,606"},1.93,"BSE"]
["2022-04-21",540135,"ARCFIN","BP FINTRADE PRIVATE LIMITED","SELL",{"v":3238526,"d":"3,238,526"},1.95,"BSE"]
["2022-04-21",540135,"ARCFIN","ALPHA LEON ENTERPRISES LLP","SELL",{"v":13566917,"d":"13,566,917"},2.01,"BSE"]
["2022-04-21",540135,"ARCFIN","EPITOME TRADING AND INVESTMENTS","BUY",{"v":2616318,"d":"2,616,318"},1.95,"BSE"]
["2022-04-21",540135,"ARCFIN","TOPGAIN FINANCE PRIVATE LIMITED","BUY",{"v":11843194,"d":"11,843,194"},1.95,"BSE"]
{"$rows_left_out":168}
{"sheet":"Call Tracker (Equity & F&O)","index":5,"n_rows":348,"n_cols":18,"rows_kept":348,"merged":[[82,0,83,0],[82,1,83,1],[82,9,83,9],[82,12,83,12],[82,13,83,13],[82,14,83,14],[82,15,83,15],[128,0,129,0],[128,1,129,1],[128,12,129,12],[128,13,129,13],[128,14,129,14],[128,15,129,15]]}
[]
[]
[]
[]
[{"$nulls":12},"Back To Main Page"]
["Retail Research Technical Calls & Fundamental Performance Report for the month of Apr-2022"]
[{"$nulls":12},{"$f":"Main!B10","v":"2022-04-22"}]
[null,"Positional  Call"]
["Sr.no","Date",null,"Company","Rec","Rec Price","Stop Loss***","Call Closed At","Target","Remark","Profit / Loss per Share","All charges","Net Gain / Loss  %","Status","Closed Date","Market Closing Price"]
[1,"2022-03-07",null,"REDINGTON","Buy",146.5,135,156.5,"160-170","Profit of Rs.10/-",{"$f":"H10-F10","v":10},{"$f":"(F10*-0.7)/100","v":{"v":-1.0255,"d":"-1.03"}},{"$f":"(K10+L10)/F10","v":{"v":0.061259385665529006,"d":"6.13%"}},"Successful","2022-04-07",null,null,"H"]
[2,"2022-03-17",null,"TATACOMM","Buy",1165,1090,1240,"1250-1300","Profit of Rs.75/-",75,{"v":-8.155,"d":"-8.16"},{"v":0.05737768240343347,"d":"5.74%"},"Successful","2022-04-01",null,null,"H"]
[3,"2022-03-21",null,"WHIRLPOOL","Buy",1640,1530,1705,"1800-1900","Part profit of Rs.65/-",65,-11.48,{"v":0.03263414634146341,"d":"3.26%"},"Successful","2022-04-11",{"$f":"VLOOKUP(D12,'MidCap Intra'!B18:C573,2,0)","v":1634.1},null,"H"]
[4,"2022-03-25",null,"SEQUENT","Buy",134.5,125,142.5,"150-160","Profit of Rs.8/-",{"$f":"H13-F13","v":8},{"$f":"(F13*-0.7)/100","v":{"v":-0.9414999999999999,"d":"-0.94"}},{"$f":"(K13+L13)/F13","v":{"v":0.05247955390334573,"d":"5.25%"}},"Successful","2022-04-01",null,null,"H"]
[5,"2022-04-01",null,"HCLTECH","Buy",1155,1090,{"$f":"(1199.5+1090)/2","v":1144.75},"1250-1300","Loss of Rs.10.25/-",-10.25,{"v":-8.085,"d":"-8.09"},{"v":-0.015874458874458874,"d":"-1.59%"},"Unsuccessful","2022-04-19",null,null,"H"]
[6,"2022-04-06",null,"APOLLOHOSP","Buy",4540,4195,4805,"4800-5000","Part profit of Rs.265/-",{"$f":"H15-F15","v":265},{"$f":"(F15*-0.7)/100","v":-31.78},{"$f":"(K15+L15)/F15","v":{"v":0.05137004405286343,"d":"5.14%"}},"Successful","2022-04-19",null,null,"H"]
[7,"2022-04-07",null,"LT","Buy",1820,1715,1715,"1950-2000","Loss of Rs.105/-",-105,-12.74,{"v":-0.06469230769230769,"d":"-6.47%"},"Unsuccessful","2022-04-19",null,null,"H"]
[8,"2022-04-08",null,"REDINGTON","Buy",152,144,161.5,"165-170","Profit of Rs.9.5/-",{"$f":"H17-F17","v":9.5},{"$f":"(F17*-0.7)/100","v":{"v":-1.0639999999999998,"d":"-1.06"}},{"$f":"(K17+L17)/F17","v":{"v":0.0555,"d":"5.55%"}},"Successful","2022-04-11",null,null,"H"]
[9,"2022-04-12",null,"REDINGTON","Buy",154.5,144,164,"170-180","Profit of Rs.9.5/-",9.5,{"$f":"(F18*-0.4)/100","v":{"v":-0.618,"d":"-0.62"}},{"v":0.05748867313915857,"d":"5.75%"},"Successful","2022-04-13",null,null,"H"]
[10,"2022-04-13",null,"TATACOMM","Buy","1280-1300",1215,null,"1400-1450","Open",{"$nulls":7},"H"]
[11,"2022-04-13",null,"CAMS","Buy","2580-2610",2395,null,"2800-2900","Open",{"$nulls":7},"H"]
{"$rows_left_out":317}