{"text_format":"3","workbook":"xlsx","n_sheets":6,"sheets":["Main","Future Intra","Cash Intra","MidCap Intra","Bulk Deals","Call Tracker (Equity & F&O)"],"not_rendered":{"images":2,"defined_names":2},"read":"whole","date_system":"1900"}

{"sheet":"Main","index":0,"n_rows":27,"n_cols":11,"rows_kept":27}
[null,"                                                                                                 "]
{"$rows_empty":8}
[null,"2021-11-23"]
[]
[null,"Sheet No.","Template Name","Summary"]
[null,1,"Future Intra","For Intraday trading in F&O segment"]
[null,2,"Cash Intra","For Intraday trading in cash market segment"]
[null,3,"Mid-cap Intra","For Intraday trading in Mid-cap stocks"]
[null,4,"Bulk Deals","Reveals Bulk Deals carried on NSE & BSE"]
[null,5,"Call Tracker"]
{"$rows_empty":9}
[{"$nulls":10},"`"]

{"sheet":"Future Intra","index":1,"n_rows":225,"n_cols":16,"rows_kept":225,"merged":[[8,0,9,0],[8,1,9,1],[8,2,9,2],[8,3,9,3],[8,6,8,8],[8,9,8,11]]}
[]
[]
[]
[]
[{"$nulls":12},"Back to Main Page"]
["FOR INTRA DAY TRADING",{"$nulls":10},{"$f":"Main!B10","v":"2021-11-23"}]
[]
[]
["Sr.no","Sector","Scrip","Expiry Date","CLOSE RATE","Pivot Point","Supports",null,null,"Resistances"]
[{"$nulls":4},"Point","Point","S1","S2","S3","R1","R2","R3","HIGH","LOW","OI","% Change in OI"]
[1,"Index","BANKNIFTY","2021-11-25",{"v":37182.1,"d":"37182.10"},37358.75,{"v":36503.4,"d":"36503.40"},{"v":35824.700000000004,"d":"35824.70"},{"v":34969.350000000006,"d":"34969.35"},38037.45,{"v":38892.8,"d":"38892.80"},{"v":39571.49999999999,"d":"39571.50"},38214.1,36680.05,2727300,{"v":0.06899491430755211,"d":"6.90%"}]
[2,"Index","NIFTY","2021-11-25",17435.05,{"v":17513.86666666667,"d":"17513.87"},{"v":17222.733333333337,"d":"17222.73"},{"v":17010.416666666668,"d":"17010.42"},{"v":16719.283333333336,"d":"16719.28"},{"v":17726.183333333338,"d":"17726.18"},{"v":18017.31666666667,"d":"18017.32"},{"v":18229.63333333334,"d":"18229.63"},17805,17301.55,12332200,{"v":0.017823171360775818,"d":"1.78%"}]
[3,"Index","FINNIFTY","2021-11-30",{"v":18250,"d":"18250.00"},{"v":18333.350000000002,"d":"18333.35"},{"v":18166.650000000005,"d":"18166.65"},{"v":18083.300000000003,"d":"18083.30"},{"v":17916.600000000006,"d":"17916.60"},{"v":18416.700000000004,"d":"18416.70"},{"v":18583.4,"d":"18583.40"},{"v":18666.750000000004,"d":"18666.75"},18500.05,18250,1320,{"v":-0.175,"d":"-17.50%"}]
[4,"Chemical","AARTIIND","2021-11-25",911.85,{"v":926.0666666666666,"d":"926.07"},{"v":883.9833333333332,"d":"883.98"},{"v":856.1166666666667,"d":"856.12"},{"v":814.0333333333333,"d":"814.03"},{"v":953.9333333333332,"d":"953.93"},{"v":996.0166666666667,"d":"996.02"},{"v":1023.8833333333331,"d":"1023.88"},968.15,898.2,3547900,{"v":-4.0563111429253165E-3,"d":"-0.41%"}]
[5,"Pharma","ABBOTINDIA","2021-11-25",{"v":19490.1,"d":"19490.10"},{"v":19543.68333333333,"d":"19543.68"},{"v":19400.516666666663,"d":"19400.52"},{"v":19310.93333333333,"d":"19310.93"},{"v":19167.766666666663,"d":"19167.77"},{"v":19633.266666666663,"d":"19633.27"},{"v":19776.433333333327,"d":"19776.43"},{"v":19866.016666666663,"d":"19866.02"},19686.85,19454.1,33750,{"v":-0.06315058986814712,"d":"-6.32%"}]
[6,"Textile","ABFRL","2021-11-25",{"v":270.1,"d":"270.10"},{"v":272.90000000000003,"d":"272.90"},{"v":263.75000000000006,"d":"263.75"},{"v":257.40000000000003,"d":"257.40"},{"v":248.25000000000006,"d":"248.25"},{"v":279.25000000000006,"d":"279.25"},{"v":288.40000000000003,"d":"288.40"},{"v":294.75000000000006,"d":"294.75"},282.05,266.55,11372400,{"v":0.025076165924537146,"d":"2.51%"}]
[7,"Cement","ACC","2021-11-25",2378.55,{"v":2395.116666666667,"d":"2395.12"},{"v":2343.2333333333336,"d":"2343.23"},{"v":2307.916666666667,"d":"2307.92"},{"v":2256.0333333333338,"d":"2256.03"},{"v":2430.4333333333334,"d":"2430.43"},{"v":2482.3166666666666,"d":"2482.32"},{"v":2517.633333333333,"d":"2517.63"},2447,2359.8,2189000,{"v":0.010385414262635588,"d":"1.04%"}]
[8,"Others","ADANIENT","2021-11-25",{"v":1674.9,"d":"1674.90"},{"v":1673.3333333333333,"d":"1673.33"},{"v":1642.1666666666665,"d":"1642.17"},{"v":1609.4333333333332,"d":"1609.43"},{"v":1578.2666666666664,"d":"1578.27"},{"v":1706.0666666666666,"d":"1706.07"},{"v":1737.2333333333331,"d":"1737.23"},{"v":1769.9666666666667,"d":"1769.97"},1704.5,1640.6,21640000,{"v":-0.03858542328453695,"d":"-3.86%"}]
[9,"Others","ADANIPORTS","2021-11-25",{"v":714.8,"d":"714.80"},{"v":717.5999999999999,"d":"717.60"},{"v":700.7999999999998,"d":"700.80"},{"v":686.8,"d":"686.80"},{"v":669.9999999999999,"d":"670.00"},{"v":731.5999999999998,"d":"731.60"},{"v":748.4,"d":"748.40"},{"v":762.3999999999997,"d":"762.40"},734.4,703.6,92206250,{"v":-3.1217903670468674E-3,"d":"-0.31%"}]
[10,"Pharma","ALKEM","2021-11-25",3291.25,{"v":3340.7166666666667,"d":"3340.72"},{"v":3200.9333333333334,"d":"3200.93"},{"v":3110.616666666667,"d":"3110.62"},{"v":2970.8333333333335,"d":"2970.83"},{"v":3431.0333333333333,"d":"3431.03"},{"v":3570.816666666667,"d":"3570.82"},{"v":3661.133333333333,"d":"3661.13"},3480.5,3250.4,665000,{"v":3.0084235860409147E-4,"d":"0.03%"}]
{"$rows_left_out":199}
{"sheet":"Cash Intra","index":2,"n_rows":246,"n_cols":13,"rows_kept":246,"merged":[[7,0,8,0],[7,1,8,1],[7,2,8,2],[7,3,8,3],[7,4,7,6],[7,7,7,9]]}
[]
[]
[]
[]
[{"$nulls":12},"Back to Main Page"]
["FOR INTRA DAY TRADING",{"$nulls":9},{"$f":"Main!B10","v":"2021-11-23"}]
[]
["Sr.no",null,"CLOSE RATE","Pivot Point","Supports",null,null,"Resistances"]
[{"$nulls":4},"S1","S2","S3","R1","R2","R3","HIGH","LOW","Total Trade Quanity in Lakhs"]
[1,"Nifty 50",17416.55,17500.75,17196.25,16975.95,16671.45,17721.05,18025.55,18245.85,17805.25,17280.45]
[2,"Nifty Bank",37128.8,{"v":37341.73333333334,"d":"37341.73"},{"v":36442.466666666674,"d":"36442.47"},{"v":35756.13333333334,"d":"35756.13"},{"v":34856.866666666676,"d":"34856.87"},{"v":38028.06666666667,"d":"38028.07"},{"v":38927.333333333336,"d":"38927.33"},{"v":39613.66666666667,"d":"39613.67"},38241,36655.4]
[3,"Nifty CPSE",2244.7,{"v":2262.4666666666667,"d":"2262.47"},{"v":2218.6833333333334,"d":"2218.68"},{"v":2192.6666666666665,"d":"2192.67"},{"v":2148.883333333333,"d":"2148.88"},{"v":2288.4833333333336,"d":"2288.48"},{"v":2332.2666666666673,"d":"2332.27"},{"v":2358.2833333333338,"d":"2358.28"},2306.25,2236.45]
[4,"Nifty Infra",5075.05,{"v":5097.2,"d":"5097.20"},5004.75,4934.45,{"v":4842,"d":"4842.00"},{"v":5167.5,"d":"5167.50"},{"v":5259.949999999999,"d":"5259.95"},5330.25,5189.65,5026.9]
[5,"Nifty IT",35478.95,{"v":35600.166666666664,"d":"35600.17"},{"v":35103.33333333333,"d":"35103.33"},{"v":34727.71666666667,"d":"34727.72"},{"v":34230.88333333333,"d":"34230.88"},{"v":35975.783333333326,"d":"35975.78"},{"v":36472.616666666654,"d":"36472.62"},{"v":36848.23333333332,"d":"36848.23"},36097,35224.55]
[6,"Nifty PSE",3907.2,{"v":3936.1666666666665,"d":"3936.17"},{"v":3859.283333333333,"d":"3859.28"},{"v":3811.3666666666663,"d":"3811.37"},{"v":3734.4833333333327,"d":"3734.48"},{"v":3984.083333333333,"d":"3984.08"},{"v":4060.966666666667,"d":"4060.97"},{"v":4108.883333333333,"d":"4108.88"},4013.05,3888.25]
[7,"Nifty Midcap 50",8476.45,{"v":8539.883333333333,"d":"8539.88"},{"v":8324.216666666667,"d":"8324.22"},{"v":8171.983333333334,"d":"8171.98"},{"v":7956.3166666666675,"d":"7956.32"},{"v":8692.116666666667,"d":"8692.12"},{"v":8907.783333333335,"d":"8907.78"},{"v":9060.016666666666,"d":"9060.02"},8755.55,8387.65]
[8,"ACC",2373.55,{"v":2391.1833333333334,"d":"2391.18"},{"v":2337.366666666667,"d":"2337.37"},{"v":2301.1833333333334,"d":"2301.18"},{"v":2247.366666666667,"d":"2247.37"},{"v":2427.366666666667,"d":"2427.37"},{"v":2481.1833333333334,"d":"2481.18"},{"v":2517.366666666667,"d":"2517.37"},2445,2355,2.44687]
[9,"AUBANK",1191.25,{"v":1198.6833333333334,"d":"1198.68"},{"v":1166.6166666666668,"d":"1166.62"},{"v":1141.9833333333333,"d":"1141.98"},{"v":1109.9166666666667,"d":"1109.92"},{"v":1223.3166666666668,"d":"1223.32"},{"v":1255.3833333333334,"d":"1255.38"},{"v":1280.0166666666669,"d":"1280.02"},1230.75,1174.05,11.83734]
[10,"AARTIIND",912.45,927.15,{"v":885.3,"d":"885.30"},858.15,{"v":816.3,"d":"816.30"},{"v":954.3,"d":"954.30"},{"v":996.1500000000001,"d":"996.15"},{"v":1023.3,"d":"1023.30"},969,900,19.14206]
[11,"ADANIENT",1675.75,{"v":1662.3999999999999,"d":"1662.40"},{"v":1623.3999999999996,"d":"1623.40"},{"v":1571.0499999999997,"d":"1571.05"},{"v":1532.0499999999995,"d":"1532.05"},{"v":1714.7499999999998,"d":"1714.75"},{"v":1753.7500000000002,"d":"1753.75"},{"v":1806.1,"d":"1806.10"},1701.4,1610.05,25.5217]
{"$rows_left_out":227}
{"sheet":"MidCap Intra","index":3,"n_rows":533,"n_cols":13,"rows_kept":533,"merged":[[0,0,0,1],[8,0,9,0],[8,1,9,1],[8,2,9,2],[8,3,9,3],[8,4,8,6],[8,7,8,9]]}
[]
[]
[]
[]
[{"$nulls":11},"Back To Main Page"]
["FOR INTRA DAY TRADING",{"$nulls":9},{"$f":"Main!B10","v":"2021-11-23"}]
[null,null," "]
[]
["Sr.no","Scrip","CLOSE RATE","Pivot Point","Supports",null,null,"Resistances"]
[{"$nulls":4},"S1","S2","S3","R1","R2","R3","HIGH","LOW","Total Trade Quanity in Lakhs"]
[1,"3MINDIA",25250.9,{"v":25283.966666666664,"d":"25283.97"},{"v":24967.933333333327,"d":"24967.93"},{"v":24684.966666666664,"d":"24684.97"},{"v":24368.933333333327,"d":"24368.93"},{"v":25566.933333333327,"d":"25566.93"},{"v":25882.96666666666,"d":"25882.97"},{"v":26165.933333333327,"d":"26165.93"},25600,25001,0.02224]
[2,"AARTIDRUGS",505.95,{"v":514.1999999999999,"d":"514.20"},{"v":495.2499999999999,"d":"495.25"},{"v":484.54999999999995,"d":"484.55"},{"v":465.5999999999999,"d":"465.60"},{"v":524.8999999999999,"d":"524.90"},{"v":543.8499999999999,"d":"543.85"},{"v":554.5499999999998,"d":"554.55"},533.15,503.5,2.56887]
[3,"AARTIIND",912.45,927.15,{"v":885.3,"d":"885.30"},858.15,{"v":816.3,"d":"816.30"},{"v":954.3,"d":"954.30"},{"v":996.1500000000001,"d":"996.15"},{"v":1023.3,"d":"1023.30"},969,900,19.14206]
[4,"AAVAS",2777.05,{"v":2777.466666666667,"d":"2777.47"},{"v":2735.133333333334,"d":"2735.13"},{"v":2693.216666666667,"d":"2693.22"},{"v":2650.883333333334,"d":"2650.88"},{"v":2819.383333333334,"d":"2819.38"},{"v":2861.716666666667,"d":"2861.72"},{"v":2903.633333333334,"d":"2903.63"},2819.8,2735.55,0.40407]
[5,"ABB",2099.8,{"v":2087.566666666667,"d":"2087.57"},{"v":1990.483333333334,"d":"1990.48"},{"v":1881.166666666667,"d":"1881.17"},{"v":1784.083333333334,"d":"1784.08"},{"v":2196.883333333334,"d":"2196.88"},{"v":2293.966666666667,"d":"2293.97"},{"v":2403.283333333334,"d":"2403.28"},2184.65,1978.25,2.40928]
[6,"ABBOTINDIA",19512.1,{"v":19567.383333333335,"d":"19567.38"},{"v":19394.86666666667,"d":"19394.87"},{"v":19277.633333333335,"d":"19277.63"},{"v":19105.11666666667,"d":"19105.12"},{"v":19684.61666666667,"d":"19684.62"},{"v":19857.13333333334,"d":"19857.13"},{"v":19974.36666666667,"d":"19974.37"},19739.9,19450.15,0.10912]
[7,"ABCAPITAL",100.25,{"v":100.78333333333335,"d":"100.78"},{"v":98.4666666666667,"d":"98.47"},{"v":96.68333333333335,"d":"96.68"},{"v":94.3666666666667,"d":"94.37"},{"v":102.56666666666669,"d":"102.57"},{"v":104.88333333333333,"d":"104.88"},{"v":106.66666666666669,"d":"106.67"},103.1,99,20.59731]
[8,"ABFRL",269.55,{"v":272.86666666666673,"d":"272.87"},{"v":262.88333333333344,"d":"262.88"},{"v":256.2166666666667,"d":"256.22"},{"v":246.2333333333334,"d":"246.23"},{"v":279.5333333333335,"d":"279.53"},{"v":289.5166666666667,"d":"289.52"},{"v":296.1833333333335,"d":"296.18"},282.85,266.2,80.49409]
[9,"ACC",2373.55,{"v":2391.1833333333334,"d":"2391.18"},{"v":2337.366666666667,"d":"2337.37"},{"v":2301.1833333333334,"d":"2301.18"},{"v":2247.366666666667,"d":"2247.37"},{"v":2427.366666666667,"d":"2427.37"},{"v":2481.1833333333334,"d":"2481.18"},{"v":2517.366666666667,"d":"2517.37"},2445,2355,2.44687]
[10,"ADANIENT",1675.75,{"v":1662.3999999999999,"d":"1662.40"},{"v":1623.3999999999996,"d":"1623.40"},{"v":1571.0499999999997,"d":"1571.05"},{"v":1532.0499999999995,"d":"1532.05"},{"v":1714.7499999999998,"d":"1714.75"},{"v":1753.7500000000002,"d":"1753.75"},{"v":1806.1,"d":"1806.10"},1701.4,1610.05,25.5217]
{"$rows_left_out":508}
{"sheet":"Bulk Deals","index":4,"n_rows":101,"n_cols":8,"rows_kept":101,"merged":[[4,0,4,1],[4,2,4,3],[6,1,6,2]]}
[" "]
[]
[]
[]
[]
[{"$nulls":4},"Back To Main Page"]
["Subject :","BULK DEAL",null,{"$f":"Main!B10","v":"2021-11-23"}]
[]
["Date","Scrip code","Scrip Name","Client Name","Buy / Sell","Quantity Traded","Trade Price / Wt.Avg.trade price","Exchange  "]
["2021-11-22",520123,"ABCINDQ","RAGHUPATI SINGHANIA","SELL",{"v":40000,"d":"40,000"},117.5,"BSE"]
["2021-11-22",520123,"ABCINDQ","ABC FINANCIAL SERVICES PRIVATE LIMITED","BUY",{"v":40000,"d":"40,000"},117.5,"BSE"]
["2021-11-22",519216,"AJANTSOY","DOLLY KHANNA","BUY",{"v":140000,"d":"140,000"},147.72,"BSE"]
["2021-11-22",531991,"AMRAAGRI","SRIKANTH PASUMURTHI","BUY",{"v":837456,"d":"837,456"},0.51,"BSE"]
["2021-11-22",536965,"BPCAP","MANJU SINGHI","SELL",{"v":17238,"d":"17,238"},7.8,"BSE"]
["2021-11-22",536965,"BPCAP","PRADIP BHAMARE","BUY",{"v":19161,"d":"19,161"},7.79,"BSE"]
["2021-11-22",530249,"BRIDGESE","VISHAL PRAGNESHBHAI SHAH","SELL",{"v":50000,"d":"50,000"},51.5,"BSE"]
["2021-11-22",524440,"CAMEXLTD","KALPESH DEVENDRAKUMAR CHOPRA","SELL",{"v":90000,"d":"90,000"},30.37,"BSE"]
["2021-11-22",539304,"CANOPYFIN","VIJAY LALTAPRASAD YADAV","BUY",{"v":75676,"d":"75,676"},13.83,"BSE"]
["2021-11-22",539304,"CANOPYFIN","SHEKHAR BATHWAL","SELL",{"v":75976,"d":"75,976"},13.83,"BSE"]
["2021-11-22",539198,"CAPFIN","BABITAMANTRY","BUY",{"v":16904,"d":"16,904"},5.51,"BSE"]
{"$rows_left_out":82}
{"sheet":"Call Tracker (Equity & F&O)","index":5,"n_rows":315,"n_cols":18,"rows_kept":315,"merged":[[68,0,69,0],[68,1,69,1],[68,12,69,12],[68,13,69,13],[68,14,69,14],[68,15,69,15],[89,0,90,0],[89,1,90,1],[89,9,90,9],[89,12,90,12],[89,13,90,13],[89,14,90,14],[89,15,90,15],[104,0,105,0],[104,1,105,1],[104,9,105,9],[104,12,105,12],[104,13,105,13],[104,14,105,14],[104,15,105,15],[108,1,109,1],[108,9,109,9],[108,12,109,12],[108,13,109,13],[108,14,109,14],[108,15,109,15]]}
[]
[]
[]
[]
[{"$nulls":12},"Back To Main Page"]
["Retail Research Technical Calls & Fundamental Performance Report for the month of Nov-2021"]
[{"$nulls":12},{"$f":"Main!B10","v":"2021-11-23"}]
[null,"Positional  Call"]
["Sr.no","Date",null,"Company","Rec","Rec Price","Stop Loss***","Call Closed At","Target","Remark","Profit / Loss per Share","All charges","Net Gain / Loss  %","Status","Closed Date","Market Closing Price"]
[1,"2021-09-15",null,"AKZOINDIA","Buy",2195,2080,{"v":2295,"d":"2,295.00"},"2400-2500"," Profit of Rs.50/-",50,{"$f":"(F10*-0.7)/100","v":{"v":-15.365,"d":"-15.37"}},{"$f":"(K10+L10)/F10","v":{"v":0.01577904328018223,"d":"1.58%"}},"Successful","2021-11-22",null,null,"H"]
[2,"2021-09-21",null,"GLAXO","Buy",1510,1395,{"v":1585,"d":"1,585.00"},"1680-1720","Profit of Rs.75/-",{"$f":"H11-F11","v":75},-10.57,{"v":0.042668874172185435,"d":"4.27%"},"Successful","2021-11-01",null,null,"H"]
[3,"2021-10-05",null,"HDFCLIFE","Buy","715-725",660,null,"820-850","Open",{"$nulls":5},{"$f":"VLOOKUP(D12,'MidCap Intra'!B22:C524,2,0)","v":688.85},null,"H"]
[4,"2021-10-08",null,"BRITANNIA","Buy",3870,3670,{"v":3670,"d":"3,670.00"},"4200-4300","Loss of Rs.200/-",{"$f":"H13-F13","v":-200},{"$f":"(F13*-0.7)/100","v":-27.09},{"$f":"(K13+L13)/F13","v":{"v":-0.0586795865633075,"d":"-5.87%"}},"Unsuccessful","2021-11-03",null,null,"H"]
[5,"2021-10-11",null,"ULTRACEMCO","Buy",7330,6980,{"v":7760,"d":"7,760.00"},"7700-8000","Profit of Rs.430/-",{"$f":"H14-F14","v":430},{"$f":"(F14*-0.7)/100","v":-51.31},{"$f":"(K14+L14)/F14","v":{"v":0.051663028649386086,"d":"5.17%"}},"Successful","2021-11-01",null,null,"H"]
[6,"2021-10-26",null,"ICICIGI","Buy","1480-1500",1395,null,"1600-1700","Open",{"$nulls":5},{"$f":"VLOOKUP(D15,'MidCap Intra'!B29:C522,2,0)","v":1462.35},null,"H"]
[7,"2021-10-27",null,"WHIRLPOOL","Buy",2245,2080,{"v":2080,"d":"2,080.00"},"2400-2500","Loss of Rs.165/-",{"$f":"H16-F16","v":-165},{"$f":"(F16*-0.7)/100","v":{"v":-15.715,"d":"-15.72"}},{"$f":"(K16+L16)/F16","v":{"v":-0.0804966592427617,"d":"-8.05%"}},"Unsuccessful","2021-11-03",null,null,"H"]
[8,"2021-11-01",null,"IGL","Buy",474,447,{"v":501,"d":"501.00"},"500-520","Profit of Rs.27/-",27,{"v":-3.3179999999999996,"d":"-3.32"},{"v":0.0499620253164557,"d":"5.00%"},"Successful","2021-11-11",null,null,"H"]
[9,"2021-11-01",null,"MGL","Buy",1010,955,{"v":955,"d":"955.00"},"1070-1120","Loss of Rs.55/-",{"$f":"H18-F18","v":-55},{"$f":"(F18*-0.7)/100","v":-7.07},{"$f":"(K18+L18)/F18","v":{"v":-0.061455445544554455,"d":"-6.15%"}},"Unsuccessful","2021-11-22",null,null,"N"]
[10,"2021-11-02",null,"BEL","Buy",201,188,{"v":214.5,"d":"214.50"},"215-225","Profit of Rs.13.5/-",{"$f":"H19-F19","v":13.5},{"$f":"(F19*-0.7)/100","v":{"v":-1.4069999999999998,"d":"-1.41"}},{"$f":"(K19+L19)/F19","v":{"v":0.06016417910447761,"d":"6.02%"}},"Successful","2021-11-09",null,null,"H"]
[11,"2021-11-09",null,"JBCHEPHARM","Buy",1660,1578,{"v":1745,"d":"1,745.00"},"1740-1800","Profit of Rs.85/-",{"$f":"H20-F20","v":85},{"$f":"(F20*-0.7)/100","v":-11.62},{"$f":"(K20+L20)/F20","v":{"v":0.04420481927710843,"d":"4.42%"}},"Successful","2021-11-10",null,null,"H"]
{"$rows_left_out":284}