{"text_format":"3","workbook":"xlsx","n_sheets":6,"sheets":["Main","Future Intra","Cash Intra","MidCap Intra","Bulk Deals","Call Tracker (Equity & F&O)"],"not_rendered":{"images":2,"defined_names":2},"read":"whole","date_system":"1900"}

{"sheet":"Main","index":0,"n_rows":27,"n_cols":11,"rows_kept":27}
[null,"                                                                                                 "]
{"$rows_empty":8}
[null,"2022-04-20"]
[]
[null,"Sheet No.","Template Name","Summary"]
[null,1,"Future Intra","For Intraday trading in F&O segment"]
[null,2,"Cash Intra","For Intraday trading in cash market segment"]
[null,3,"Mid-cap Intra","For Intraday trading in Mid-cap stocks"]
[null,4,"Bulk Deals","Reveals Bulk Deals carried on NSE & BSE"]
[null,5,"Call Tracker"]
{"$rows_empty":9}
[{"$nulls":10},"`"]

{"sheet":"Future Intra","index":1,"n_rows":240,"n_cols":16,"rows_kept":240,"merged":[[8,0,9,0],[8,1,9,1],[8,2,9,2],[8,3,9,3],[8,6,8,8],[8,9,8,11]]}
[]
[]
[]
[]
[{"$nulls":12},"Back to Main Page"]
["FOR INTRA DAY TRADING",{"$nulls":10},{"$f":"Main!B10","v":"2022-04-20"}]
[]
[]
["Sr.no","Sector","Scrip","Expiry Date","CLOSE RATE","Pivot Point","Supports",null,null,"Resistances"]
[{"$nulls":4},"Point","Point","S1","S2","S3","R1","R2","R3","HIGH","LOW","OI","% Change in OI"]
[1,"Index","NIFTY","2022-04-28",16969.35,{"v":17042.216666666664,"d":"17042.22"},{"v":16770.433333333327,"d":"16770.43"},{"v":16571.516666666663,"d":"16571.52"},{"v":16299.733333333326,"d":"16299.73"},{"v":17241.133333333328,"d":"17241.13"},{"v":17512.91666666666,"d":"17512.92"},{"v":17711.83333333333,"d":"17711.83"},17314,16843.3,12147000,{"v":-0.00842435225547338,"d":"-0.84%"}]
[2,"Index","BANKNIFTY","2022-04-28",{"v":36403.2,"d":"36403.20"},{"v":36534.23333333333,"d":"36534.23"},{"v":35839.11666666666,"d":"35839.12"},{"v":35275.03333333333,"d":"35275.03"},{"v":34579.916666666664,"d":"34579.92"},{"v":37098.31666666666,"d":"37098.32"},{"v":37793.43333333333,"d":"37793.43"},{"v":38357.516666666656,"d":"38357.52"},37229.35,35970.15,2757550,{"v":0.05004521871578847,"d":"5.00%"}]
[3,"Index","FINNIFTY","2022-04-26",{"v":16728.4,"d":"16728.40"},{"v":16778.483333333334,"d":"16778.48"},{"v":16491.966666666667,"d":"16491.97"},{"v":16255.533333333333,"d":"16255.53"},{"v":15969.016666666666,"d":"15969.02"},{"v":17014.916666666668,"d":"17014.92"},{"v":17301.433333333338,"d":"17301.43"},{"v":17537.86666666667,"d":"17537.87"},17065,16542.05,2680,{"v":0.13559322033898305,"d":"13.56%"}]
[4,"Index","MIDCPNIFTY","2022-04-26",7268.25,{"v":7321.066666666667,"d":"7321.07"},{"v":7172.233333333334,"d":"7172.23"},{"v":7076.216666666667,"d":"7076.22"},{"v":6927.383333333334,"d":"6927.38"},{"v":7417.083333333333,"d":"7417.08"},{"v":7565.916666666667,"d":"7565.92"},{"v":7661.9333333333325,"d":"7661.93"},7469.9,7225.05,1575,{"v":-0.2222222222222222,"d":"-22.22%"}]
[5,"Chemical","AARTIIND","2022-04-28",936.25,{"v":939.7166666666667,"d":"939.72"},{"v":922.4333333333334,"d":"922.43"},{"v":908.6166666666667,"d":"908.62"},{"v":891.3333333333334,"d":"891.33"},{"v":953.5333333333334,"d":"953.53"},{"v":970.8166666666667,"d":"970.82"},{"v":984.6333333333334,"d":"984.63"},957,925.9,2015350,{"v":-0.006702974444909929,"d":"-0.67%"}]
[6,"Capital_Goods","ABB","2022-04-28",{"v":2152.4,"d":"2152.40"},{"v":2162.6,"d":"2162.60"},{"v":2112.2,"d":"2112.20"},{"v":2072,"d":"2072.00"},{"v":2021.6,"d":"2021.60"},{"v":2202.7999999999997,"d":"2202.80"},{"v":2253.2000000000003,"d":"2253.20"},{"v":2293.3999999999996,"d":"2293.40"},2213,2122.4,256750,{"v":-0.05606617647058824,"d":"-5.61%"}]
[7,"Pharma","ABBOTINDIA","2022-04-28",{"v":16960.4,"d":"16960.40"},{"v":17092.283333333336,"d":"17092.28"},{"v":16679.91666666667,"d":"16679.92"},{"v":16399.433333333334,"d":"16399.43"},{"v":15987.06666666667,"d":"15987.07"},{"v":17372.766666666674,"d":"17372.77"},{"v":17785.133333333335,"d":"17785.13"},{"v":18065.616666666676,"d":"18065.62"},17504.65,16811.8,35125,{"v":0.027046783625730993,"d":"2.70%"}]
[8,"Others","ABCAPITAL","2022-04-28",109.65,{"v":110.96666666666668,"d":"110.97"},{"v":106.23333333333336,"d":"106.23"},{"v":102.81666666666668,"d":"102.82"},{"v":98.08333333333336,"d":"98.08"},{"v":114.38333333333337,"d":"114.38"},{"v":119.11666666666669,"d":"119.12"},{"v":122.53333333333337,"d":"122.53"},115.7,107.55,21617200,{"v":-0.043419003115264795,"d":"-4.34%"}]
[9,"Textile","ABFRL","2022-04-28",291.25,{"v":291.8666666666666,"d":"291.87"},{"v":282.83333333333326,"d":"282.83"},{"v":274.41666666666663,"d":"274.42"},{"v":265.38333333333327,"d":"265.38"},{"v":300.28333333333325,"d":"300.28"},{"v":309.31666666666666,"d":"309.32"},{"v":317.73333333333323,"d":"317.73"},300.9,283.45,11957400,{"v":5.905511811023622E-3,"d":"0.59%"}]
[10,"Cement","ACC","2022-04-28",{"v":2053.9,"d":"2053.90"},{"v":2085.6,"d":"2085.60"},1993.25,{"v":1932.6000000000001,"d":"1932.60"},{"v":1840.2500000000002,"d":"1840.25"},2146.25,{"v":2238.5999999999995,"d":"2238.60"},{"v":2299.2499999999995,"d":"2299.25"},2177.95,2024.95,3245000,{"v":0.02148422129534902,"d":"2.15%"}]
{"$rows_left_out":211}
{"sheet":"Cash Intra","index":2,"n_rows":246,"n_cols":13,"rows_kept":246,"merged":[[7,0,8,0],[7,1,8,1],[7,2,8,2],[7,3,8,3],[7,4,7,6],[7,7,7,9]]}
[]
[]
[]
[]
[{"$nulls":12},"Back to Main Page"]
["FOR INTRA DAY TRADING",{"$nulls":9},{"$f":"Main!B10","v":"2022-04-20"}]
[]
["Sr.no",null,"CLOSE RATE","Pivot Point","Supports",null,null,"Resistances"]
[{"$nulls":4},"S1","S2","S3","R1","R2","R3","HIGH","LOW","Total Trade Quanity in Lakhs"]
[1,"Nifty 50",16958.65,{"v":17019.666666666668,"d":"17019.67"},{"v":16763.683333333334,"d":"16763.68"},{"v":16568.716666666667,"d":"16568.72"},{"v":16312.733333333334,"d":"16312.73"},{"v":17214.633333333335,"d":"17214.63"},{"v":17470.616666666665,"d":"17470.62"},{"v":17665.583333333336,"d":"17665.58"},17275.65,16824.7]
[2,"Nifty Bank",36341.6,{"v":36463.816666666666,"d":"36463.82"},{"v":35804.08333333333,"d":"35804.08"},{"v":35266.566666666666,"d":"35266.57"},{"v":34606.83333333333,"d":"34606.83"},{"v":37001.33333333333,"d":"37001.33"},{"v":37661.066666666666,"d":"37661.07"},{"v":38198.58333333333,"d":"38198.58"},37123.55,35926.3]
[3,"Nifty CPSE",2767.45,{"v":2781.116666666667,"d":"2781.12"},{"v":2734.4833333333336,"d":"2734.48"},{"v":2701.516666666667,"d":"2701.52"},{"v":2654.8833333333337,"d":"2654.88"},{"v":2814.0833333333335,"d":"2814.08"},{"v":2860.7166666666667,"d":"2860.72"},{"v":2893.6833333333334,"d":"2893.68"},2827.75,2748.15]
[4,"Nifty Infra",5102.85,{"v":5118.400000000001,"d":"5118.40"},{"v":5049.750000000001,"d":"5049.75"},{"v":4996.650000000001,"d":"4996.65"},{"v":4928.000000000001,"d":"4928.00"},{"v":5171.500000000001,"d":"5171.50"},{"v":5240.150000000001,"d":"5240.15"},{"v":5293.250000000001,"d":"5293.25"},5187.05,5065.3]
[5,"Nifty IT",31804.2,{"v":32160.733333333337,"d":"32160.73"},{"v":31212.816666666673,"d":"31212.82"},{"v":30621.433333333334,"d":"30621.43"},{"v":29673.51666666667,"d":"29673.52"},{"v":32752.116666666676,"d":"32752.12"},{"v":33700.03333333334,"d":"33700.03"},{"v":34291.41666666668,"d":"34291.42"},33108.65,31569.35]
[6,"Nifty PSE",4426,{"v":4446.133333333333,"d":"4446.13"},{"v":4375.116666666667,"d":"4375.12"},{"v":4324.233333333334,"d":"4324.23"},{"v":4253.216666666667,"d":"4253.22"},{"v":4497.016666666666,"d":"4497.02"},{"v":4568.033333333333,"d":"4568.03"},{"v":4618.916666666666,"d":"4618.92"},4517.15,4395.25]
[7,"Nifty Midcap 50",8253.3,{"v":8291.416666666666,"d":"8291.42"},{"v":8135.283333333333,"d":"8135.28"},{"v":8017.266666666666,"d":"8017.27"},{"v":7861.133333333333,"d":"7861.13"},{"v":8409.433333333332,"d":"8409.43"},{"v":8565.566666666668,"d":"8565.57"},{"v":8683.583333333332,"d":"8683.58"},8447.55,8173.4]
[8,"ACC",2056.5,{"v":2084.8833333333337,"d":"2084.88"},{"v":1995.1666666666674,"d":"1995.17"},{"v":1933.8333333333337,"d":"1933.83"},{"v":1844.1166666666675,"d":"1844.12"},{"v":2146.216666666667,"d":"2146.22"},{"v":2235.9333333333334,"d":"2235.93"},{"v":2297.2666666666673,"d":"2297.27"},2174.6,2023.55,8.2474]
[9,"AUBANK",1420.5,{"v":1425.1166666666668,"d":"1425.12"},{"v":1390.4833333333336,"d":"1390.48"},{"v":1360.4666666666667,"d":"1360.47"},{"v":1325.8333333333335,"d":"1325.83"},{"v":1455.1333333333337,"d":"1455.13"},{"v":1489.7666666666669,"d":"1489.77"},{"v":1519.7833333333338,"d":"1519.78"},1459.75,1395.1,45.85249]
[10,"AARTIIND",939.2,{"v":938.8666666666667,"d":"938.87"},{"v":923.4333333333334,"d":"923.43"},{"v":907.6666666666667,"d":"907.67"},{"v":892.2333333333335,"d":"892.23"},{"v":954.6333333333333,"d":"954.63"},{"v":970.0666666666665,"d":"970.07"},{"v":985.8333333333333,"d":"985.83"},954.3,923.1,5.08256]
[11,"ADANIENT",2168.3,{"v":2187.7999999999997,"d":"2187.80"},{"v":2120.5999999999995,"d":"2120.60"},{"v":2072.8999999999996,"d":"2072.90"},{"v":2005.6999999999994,"d":"2005.70"},{"v":2235.4999999999995,"d":"2235.50"},{"v":2302.6999999999994,"d":"2302.70"},{"v":2350.3999999999996,"d":"2350.40"},2255,2140.1,16.39219]
{"$rows_left_out":227}
{"sheet":"MidCap Intra","index":3,"n_rows":531,"n_cols":13,"rows_kept":531,"merged":[[0,0,0,1],[8,0,9,0],[8,1,9,1],[8,2,9,2],[8,3,9,3],[8,4,8,6],[8,7,8,9]]}
[]
[]
[]
[]
[{"$nulls":11},"Back To Main Page"]
["FOR INTRA DAY TRADING",{"$nulls":9},{"$f":"Main!B10","v":"2022-04-20"}]
[null,null," "]
[]
["Sr.no","Scrip","CLOSE RATE","Pivot Point","Supports",null,null,"Resistances"]
[{"$nulls":4},"S1","S2","S3","R1","R2","R3","HIGH","LOW","Total Trade Quanity in Lakhs"]
[1,"3MINDIA",21257.9,{"v":21355.966666666667,"d":"21355.97"},{"v":20911.933333333334,"d":"20911.93"},{"v":20565.966666666667,"d":"20565.97"},{"v":20121.933333333334,"d":"20121.93"},{"v":21701.933333333334,"d":"21701.93"},{"v":22145.966666666667,"d":"22145.97"},{"v":22491.933333333334,"d":"22491.93"},21800,21010,0.04248]
[2,"AARTIDRUGS",489.15,{"v":493.40000000000003,"d":"493.40"},{"v":478.75000000000006,"d":"478.75"},468.35,{"v":453.70000000000005,"d":"453.70"},{"v":503.80000000000007,"d":"503.80"},518.45,{"v":528.8500000000001,"d":"528.85"},508.05,483,1.02544]
[3,"AARTIIND",939.2,{"v":938.8666666666667,"d":"938.87"},{"v":923.4333333333334,"d":"923.43"},{"v":907.6666666666667,"d":"907.67"},{"v":892.2333333333335,"d":"892.23"},{"v":954.6333333333333,"d":"954.63"},{"v":970.0666666666665,"d":"970.07"},{"v":985.8333333333333,"d":"985.83"},954.3,923.1,5.08256]
[4,"AAVAS",2456.7,{"v":2467.5166666666664,"d":"2467.52"},{"v":2385.033333333333,"d":"2385.03"},{"v":2313.3666666666663,"d":"2313.37"},{"v":2230.8833333333328,"d":"2230.88"},{"v":2539.183333333333,"d":"2539.18"},{"v":2621.6666666666665,"d":"2621.67"},{"v":2693.333333333333,"d":"2693.33"},2550,2395.85,1.2247]
[5,"ABB",2152.2,{"v":2175.733333333333,"d":"2175.73"},{"v":2101.4666666666662,"d":"2101.47"},{"v":2050.733333333333,"d":"2050.73"},{"v":1976.4666666666662,"d":"1976.47"},{"v":2226.4666666666662,"d":"2226.47"},{"v":2300.7333333333336,"d":"2300.73"},{"v":2351.4666666666662,"d":"2351.47"},2250,2125,0.76918]
[6,"ABBOTINDIA",16944.8,{"v":17073.933333333334,"d":"17073.93"},{"v":16670.86666666667,"d":"16670.87"},{"v":16396.933333333334,"d":"16396.93"},{"v":15993.866666666669,"d":"15993.87"},{"v":17347.86666666667,"d":"17347.87"},{"v":17750.933333333334,"d":"17750.93"},{"v":18024.86666666667,"d":"18024.87"},17477,16800,0.10946]
[7,"ABCAPITAL",109.75,{"v":111.14999999999999,"d":"111.15"},{"v":106.59999999999998,"d":"106.60"},{"v":103.44999999999999,"d":"103.45"},{"v":98.89999999999998,"d":"98.90"},{"v":114.29999999999998,"d":"114.30"},118.85,{"v":121.99999999999999,"d":"122.00"},115.7,108,69.51986]
[8,"ABFRL",292.85,{"v":292.2166666666667,"d":"292.22"},{"v":283.6333333333334,"d":"283.63"},{"v":274.4166666666667,"d":"274.42"},{"v":265.83333333333337,"d":"265.83"},{"v":301.4333333333334,"d":"301.43"},{"v":310.01666666666665,"d":"310.02"},{"v":319.2333333333334,"d":"319.23"},300.8,283,25.34588]
[9,"ACC",2056.5,{"v":2084.8833333333337,"d":"2084.88"},{"v":1995.1666666666674,"d":"1995.17"},{"v":1933.8333333333337,"d":"1933.83"},{"v":1844.1166666666675,"d":"1844.12"},{"v":2146.216666666667,"d":"2146.22"},{"v":2235.9333333333334,"d":"2235.93"},{"v":2297.2666666666673,"d":"2297.27"},2174.6,2023.55,8.2474]
[10,"ADANIENT",2168.3,{"v":2187.7999999999997,"d":"2187.80"},{"v":2120.5999999999995,"d":"2120.60"},{"v":2072.8999999999996,"d":"2072.90"},{"v":2005.6999999999994,"d":"2005.70"},{"v":2235.4999999999995,"d":"2235.50"},{"v":2302.6999999999994,"d":"2302.70"},{"v":2350.3999999999996,"d":"2350.40"},2255,2140.1,16.39219]
{"$rows_left_out":512}
{"sheet":"Bulk Deals","index":4,"n_rows":171,"n_cols":8,"rows_kept":171,"merged":[[4,0,4,1],[4,2,4,3],[6,1,6,2]]}
[" "]
[]
[]
[]
[]
[{"$nulls":4},"Back To Main Page"]
["Subject :","BULK DEAL",null,{"$f":"Main!B10","v":"2022-04-20"}]
[]
["Date","Scrip code","Scrip Name","Client Name","Buy / Sell","Quantity Traded","Trade Price / Wt.Avg.trade price","Exchange  "]
["2022-04-19",540615,"7NR","VASHIST R ANDHALE","BUY",{"v":900000,"d":"900,000"},2.25,"BSE"]
["2022-04-19",540615,"7NR","SAMIR HARSHAD MEHTA","BUY",{"v":1050000,"d":"1,050,000"},2.25,"BSE"]
["2022-04-19",540615,"7NR","FALGUN KANTILAL DOSHI","SELL",{"v":1500000,"d":"1,500,000"},2.25,"BSE"]
["2022-04-19",540615,"7NR","JATIN RAMNIKLAL MEHTA","SELL",{"v":530000,"d":"530,000"},2.25,"BSE"]
["2022-04-19",540615,"7NR","JAIMESH G SHETH HUF","SELL",{"v":540000,"d":"540,000"},2.25,"BSE"]
["2022-04-19",540615,"7NR","VIKRAMKUMAR KARANRAJ SAKARIA HUF","BUY",{"v":2844495,"d":"2,844,495"},2.25,"BSE"]
["2022-04-19",540615,"7NR","VIKRAMKUMAR KARANRAJ SAKARIA HUF","SELL",{"v":674495,"d":"674,495"},2.3,"BSE"]
["2022-04-19",540615,"7NR","NEXPACT LIMITED","SELL",{"v":5000000,"d":"5,000,000"},2.25,"BSE"]
["2022-04-19",540615,"7NR","NATVARSINH T CHAVDA . .","BUY",{"v":1563000,"d":"1,563,000"},2.26,"BSE"]
["2022-04-19",540615,"7NR","SANGITA PRAVINKUMAR TUNDIYA","BUY",{"v":540000,"d":"540,000"},2.26,"BSE"]
["2022-04-19",540615,"7NR","PREETI AGGARWAL","SELL",{"v":1000000,"d":"1,000,000"},2.25,"BSE"]
{"$rows_left_out":152}
{"sheet":"Call Tracker (Equity & F&O)","index":5,"n_rows":325,"n_cols":18,"rows_kept":325,"merged":[[76,0,77,0],[76,1,77,1],[76,9,77,9],[115,0,116,0],[115,1,116,1],[115,12,116,12],[115,13,116,13],[115,14,116,14],[115,15,116,15]]}
[]
[]
[]
[]
[{"$nulls":12},"Back To Main Page"]
["Retail Research Technical Calls & Fundamental Performance Report for the month of Apr-2022"]
[{"$nulls":12},{"$f":"Main!B10","v":"2022-04-20"}]
[null,"Positional  Call"]
["Sr.no","Date",null,"Company","Rec","Rec Price","Stop Loss***","Call Closed At","Target","Remark","Profit / Loss per Share","All charges","Net Gain / Loss  %","Status","Closed Date","Market Closing Price"]
[1,"2022-03-07",null,"REDINGTON","Buy",146.5,135,156.5,"160-170","Profit of Rs.10/-",{"$f":"H10-F10","v":10},{"$f":"(F10*-0.7)/100","v":{"v":-1.0255,"d":"-1.03"}},{"$f":"(K10+L10)/F10","v":{"v":0.061259385665529006,"d":"6.13%"}},"Successful","2022-04-07",null,null,"H"]
[2,"2022-03-17",null,"TATACOMM","Buy",1165,1090,1240,"1250-1300","Profit of Rs.75/-",75,{"v":-8.155,"d":"-8.16"},{"v":0.05737768240343347,"d":"5.74%"},"Successful","2022-04-01",null,null,"H"]
[3,"2022-03-21",null,"WHIRLPOOL","Buy",1640,1530,1705,"1800-1900","Part profit of Rs.65/-",65,-11.48,{"v":0.03263414634146341,"d":"3.26%"},"Successful","2022-04-11",{"$f":"VLOOKUP(D12,'MidCap Intra'!B18:C573,2,0)","v":1595.9},null,"H"]
[4,"2022-03-25",null,"SEQUENT","Buy",134.5,125,142.5,"150-160","Profit of Rs.8/-",{"$f":"H13-F13","v":8},{"$f":"(F13*-0.7)/100","v":{"v":-0.9414999999999999,"d":"-0.94"}},{"$f":"(K13+L13)/F13","v":{"v":0.05247955390334573,"d":"5.25%"}},"Successful","2022-04-01",null,null,"H"]
[5,"2022-04-01",null,"HCLTECH","Buy",1155,1090,{"$f":"(1199.5+1090)/2","v":1144.75},"1250-1300","Loss of Rs.10.25/-",-10.25,{"v":-8.085,"d":"-8.09"},{"v":-0.015874458874458874,"d":"-1.59%"},"Unsuccessful","2022-04-19",null,null,"H"]
[6,"2022-04-06",null,"APOLLOHOSP","Buy",4540,4195,4805,"4800-5000","Part profit of Rs.265/-",{"$f":"H15-F15","v":265},{"$f":"(F15*-0.7)/100","v":-31.78},{"$f":"(K15+L15)/F15","v":{"v":0.05137004405286343,"d":"5.14%"}},"Successful","2022-04-19",null,null,"H"]
[7,"2022-04-07",null,"LT","Buy","1810-1830",1715,null,"1950-2000","Open",{"$nulls":7},"H"]
[8,"2022-04-08",null,"REDINGTON","Buy",152,144,161.5,"165-170","Profit of Rs.9.5/-",{"$f":"H17-F17","v":9.5},{"$f":"(F17*-0.7)/100","v":{"v":-1.0639999999999998,"d":"-1.06"}},{"$f":"(K17+L17)/F17","v":{"v":0.0555,"d":"5.55%"}},"Successful","2022-04-11",null,null,"H"]
[9,"2022-04-12",null,"REDINGTON","Buy",154.5,144,164,"170-180","Profit of Rs.9.5/-",9.5,{"$f":"(F18*-0.4)/100","v":{"v":-0.618,"d":"-0.62"}},{"v":0.05748867313915857,"d":"5.75%"},"Successful","2022-04-13",null,null,"H"]
[10,"2022-04-13",null,"TATACOMM","Buy","1280-1300",1215,null,"1400-1450","Open",{"$nulls":7},"H"]
[11,"2022-04-13",null,"CAMS","Buy","2580-2610",2395,null,"2800-2900","Open",{"$nulls":7},"H"]
{"$rows_left_out":294}