{"text_format":"3","workbook":"xlsx","n_sheets":6,"sheets":["Main","Future Intra","Cash Intra","MidCap Intra","Bulk Deals","Call Tracker (Equity & F&O)"],"not_rendered":{"images":2,"defined_names":2},"read":"whole","date_system":"1900"}

{"sheet":"Main","index":0,"n_rows":27,"n_cols":11,"rows_kept":27}
[null,"                                                                                                 "]
{"$rows_empty":8}
[null,"2022-04-19"]
[]
[null,"Sheet No.","Template Name","Summary"]
[null,1,"Future Intra","For Intraday trading in F&O segment"]
[null,2,"Cash Intra","For Intraday trading in cash market segment"]
[null,3,"Mid-cap Intra","For Intraday trading in Mid-cap stocks"]
[null,4,"Bulk Deals","Reveals Bulk Deals carried on NSE & BSE"]
[null,5,"Call Tracker"]
{"$rows_empty":9}
[{"$nulls":10},"`"]

{"sheet":"Future Intra","index":1,"n_rows":240,"n_cols":16,"rows_kept":240,"merged":[[8,0,9,0],[8,1,9,1],[8,2,9,2],[8,3,9,3],[8,6,8,8],[8,9,8,11]]}
[]
[]
[]
[]
[{"$nulls":12},"Back to Main Page"]
["FOR INTRA DAY TRADING",{"$nulls":10},{"$f":"Main!B10","v":"2022-04-19"}]
[]
[]
["Sr.no","Sector","Scrip","Expiry Date","CLOSE RATE","Pivot Point","Supports",null,null,"Resistances"]
[{"$nulls":4},"Point","Point","S1","S2","S3","R1","R2","R3","HIGH","LOW","OI","% Change in OI"]
[1,"Index","NIFTY","2022-04-28",{"v":17229.6,"d":"17229.60"},17208.75,{"v":17130.8,"d":"17130.80"},{"v":17032,"d":"17032.00"},16954.05,17307.55,{"v":17385.499999999996,"d":"17385.50"},{"v":17484.3,"d":"17484.30"},17286.7,17109.95,12250200,{"v":0.037840310753968084,"d":"3.78%"}]
[2,"Index","BANKNIFTY","2022-04-28",36906.35,{"v":36848.71666666667,"d":"36848.72"},{"v":36613.183333333334,"d":"36613.18"},{"v":36320.01666666667,"d":"36320.02"},{"v":36084.48333333334,"d":"36084.48"},{"v":37141.88333333333,"d":"37141.88"},{"v":37377.41666666667,"d":"37377.42"},{"v":37670.58333333333,"d":"37670.58"},37084.25,36555.55,2626125,{"v":0.016557957690595544,"d":"1.66%"}]
[3,"Index","FINNIFTY","2022-04-26",{"v":17134.7,"d":"17134.70"},{"v":17129.766666666666,"d":"17129.77"},{"v":17004.933333333334,"d":"17004.93"},{"v":16875.166666666668,"d":"16875.17"},{"v":16750.333333333336,"d":"16750.33"},{"v":17259.533333333333,"d":"17259.53"},{"v":17384.36666666667,"d":"17384.37"},{"v":17514.13333333333,"d":"17514.13"},17254.6,17000,2360,{"v":-0.016666666666666666,"d":"-1.67%"}]
[4,"Index","MIDCPNIFTY","2022-04-26",7250.05,{"v":7405.216666666667,"d":"7405.22"},{"v":7065.4833333333345,"d":"7065.48"},{"v":6880.916666666667,"d":"6880.92"},{"v":6541.183333333334,"d":"6541.18"},{"v":7589.783333333335,"d":"7589.78"},{"v":7929.516666666668,"d":"7929.52"},{"v":8114.083333333335,"d":"8114.08"},7744.95,7220.65,2025,{"v":0.038461538461538464,"d":"3.85%"}]
[5,"Chemical","AARTIIND","2022-04-28",{"v":944.4,"d":"944.40"},{"v":942.8000000000001,"d":"942.80"},{"v":931.6000000000001,"d":"931.60"},{"v":918.8000000000001,"d":"918.80"},{"v":907.6000000000001,"d":"907.60"},{"v":955.6000000000001,"d":"955.60"},{"v":966.8000000000002,"d":"966.80"},{"v":979.6000000000001,"d":"979.60"},954,930,2028950,{"v":0.051541850220264314,"d":"5.15%"}]
[6,"Capital_Goods","ABB","2022-04-28",{"v":2187.3,"d":"2187.30"},2184.25,{"v":2144.5,"d":"2144.50"},{"v":2101.7,"d":"2101.70"},2061.95,2227.05,{"v":2266.8,"d":"2266.80"},{"v":2309.6000000000004,"d":"2309.60"},2224,2141.45,272000,{"v":-0.025089605734767026,"d":"-2.51%"}]
[7,"Pharma","ABBOTINDIA","2022-04-28",17394.65,{"v":17511.600000000002,"d":"17511.60"},{"v":17237.350000000006,"d":"17237.35"},{"v":17080.050000000003,"d":"17080.05"},{"v":16805.800000000007,"d":"16805.80"},{"v":17668.900000000005,"d":"17668.90"},{"v":17943.149999999998,"d":"17943.15"},{"v":18100.450000000004,"d":"18100.45"},17785.85,17354.3,34200,{"v":0.015590200445434299,"d":"1.56%"}]
[8,"Others","ABCAPITAL","2022-04-28",{"v":115,"d":"115.00"},{"v":115.2,"d":"115.20"},{"v":113.7,"d":"113.70"},{"v":112.4,"d":"112.40"},{"v":110.9,"d":"110.90"},{"v":116.5,"d":"116.50"},{"v":118,"d":"118.00"},{"v":119.3,"d":"119.30"},116.7,113.9,22598400,{"v":-0.005807200929152149,"d":"-0.58%"}]
[9,"Textile","ABFRL","2022-04-28",{"v":294.1,"d":"294.10"},{"v":293.3666666666667,"d":"293.37"},{"v":288.1333333333333,"d":"288.13"},{"v":282.16666666666663,"d":"282.17"},{"v":276.9333333333333,"d":"276.93"},{"v":299.33333333333337,"d":"299.33"},{"v":304.5666666666667,"d":"304.57"},{"v":310.5333333333334,"d":"310.53"},298.6,287.4,11887200,{"v":0.006826690156353226,"d":"0.68%"}]
[10,"Cement","ACC","2022-04-28",2159.15,{"v":2190.816666666667,"d":"2190.82"},{"v":2120.4333333333343,"d":"2120.43"},{"v":2081.716666666667,"d":"2081.72"},{"v":2011.3333333333344,"d":"2011.33"},{"v":2229.533333333334,"d":"2229.53"},{"v":2299.9166666666665,"d":"2299.92"},{"v":2338.633333333334,"d":"2338.63"},2261.2,2152.1,3176750,{"v":-7.8634898167806878E-4,"d":"-0.08%"}]
{"$rows_left_out":211}
{"sheet":"Cash Intra","index":2,"n_rows":246,"n_cols":13,"rows_kept":246,"merged":[[7,0,8,0],[7,1,8,1],[7,2,8,2],[7,3,8,3],[7,4,7,6],[7,7,7,9]]}
[]
[]
[]
[]
[{"$nulls":12},"Back to Main Page"]
["FOR INTRA DAY TRADING",{"$nulls":9},{"$f":"Main!B10","v":"2022-04-19"}]
[]
["Sr.no",null,"CLOSE RATE","Pivot Point","Supports",null,null,"Resistances"]
[{"$nulls":4},"S1","S2","S3","R1","R2","R3","HIGH","LOW","Total Trade Quanity in Lakhs"]
[1,"Nifty 50",17173.65,17159.75,17081.75,16989.85,16911.85,17251.65,17329.65,{"v":17421.550000000003,"d":"17421.55"},17237.75,17067.85]
[2,"Nifty Bank",36729,{"v":36712.06666666667,"d":"36712.07"},{"v":36458.28333333335,"d":"36458.28"},{"v":36187.56666666667,"d":"36187.57"},{"v":35933.78333333335,"d":"35933.78"},{"v":36982.78333333335,"d":"36982.78"},{"v":37236.56666666667,"d":"37236.57"},{"v":37507.28333333335,"d":"37507.28"},36965.85,36441.35]
[3,"Nifty CPSE",2765.4,{"v":2746.5499999999997,"d":"2746.55"},{"v":2725.1999999999994,"d":"2725.20"},{"v":2684.9999999999995,"d":"2685.00"},{"v":2663.649999999999,"d":"2663.65"},{"v":2786.7499999999995,"d":"2786.75"},{"v":2808.1,"d":"2808.10"},{"v":2848.2999999999997,"d":"2848.30"},2767.9,2706.35]
[4,"Nifty Infra",5110.4,{"v":5100.566666666667,"d":"5100.57"},{"v":5078.983333333334,"d":"5078.98"},{"v":5047.566666666667,"d":"5047.57"},{"v":5025.983333333334,"d":"5025.98"},{"v":5131.983333333334,"d":"5131.98"},{"v":5153.5666666666675,"d":"5153.57"},{"v":5184.983333333334,"d":"5184.98"},5122.15,5069.15]
[5,"Nifty IT",32780.05,{"v":32915.700000000004,"d":"32915.70"},{"v":32465.250000000007,"d":"32465.25"},{"v":32150.450000000004,"d":"32150.45"},{"v":31700.000000000007,"d":"31700.00"},{"v":33230.50000000001,"d":"33230.50"},{"v":33680.950000000004,"d":"33680.95"},{"v":33995.75000000001,"d":"33995.75"},33366.15,32600.9]
[6,"Nifty PSE",4426.1,{"v":4409.7,"d":"4409.70"},{"v":4388.4,"d":"4388.40"},{"v":4350.7,"d":"4350.70"},{"v":4329.4,"d":"4329.40"},{"v":4447.4,"d":"4447.40"},{"v":4468.700000000001,"d":"4468.70"},{"v":4506.4,"d":"4506.40"},4431,4372]
[7,"Nifty Midcap 50",8352.25,{"v":8337.699999999999,"d":"8337.70"},{"v":8291.699999999997,"d":"8291.70"},{"v":8231.149999999998,"d":"8231.15"},{"v":8185.149999999996,"d":"8185.15"},{"v":8398.249999999998,"d":"8398.25"},{"v":8444.250000000002,"d":"8444.25"},{"v":8504.8,"d":"8504.80"},8383.7,8277.15]
[8,"ACC",2155.2,{"v":2183.9166666666665,"d":"2183.92"},{"v":2118.933333333333,"d":"2118.93"},{"v":2082.6666666666665,"d":"2082.67"},{"v":2017.683333333333,"d":"2017.68"},{"v":2220.183333333333,"d":"2220.18"},{"v":2285.1666666666665,"d":"2285.17"},{"v":2321.433333333333,"d":"2321.43"},2248.9,2147.65,4.42194]
[9,"AUBANK",1380.2,{"v":1382.3333333333333,"d":"1382.33"},{"v":1361.8666666666666,"d":"1361.87"},{"v":1343.5333333333333,"d":"1343.53"},{"v":1323.0666666666666,"d":"1323.07"},{"v":1400.6666666666665,"d":"1400.67"},{"v":1421.1333333333332,"d":"1421.13"},{"v":1439.4666666666665,"d":"1439.47"},1402.8,1364,15.01913]
[10,"AARTIIND",939.45,{"v":938.7666666666668,"d":"938.77"},{"v":926.9833333333336,"d":"926.98"},{"v":914.5166666666668,"d":"914.52"},{"v":902.7333333333336,"d":"902.73"},{"v":951.2333333333336,"d":"951.23"},{"v":963.0166666666667,"d":"963.02"},{"v":975.4833333333336,"d":"975.48"},950.55,926.3,3.70861]
[11,"ADANIENT",2233.85,{"v":2210.2000000000003,"d":"2210.20"},{"v":2180.4000000000005,"d":"2180.40"},{"v":2126.9500000000003,"d":"2126.95"},{"v":2097.1500000000005,"d":"2097.15"},{"v":2263.6500000000005,"d":"2263.65"},{"v":2293.4500000000007,"d":"2293.45"},{"v":2346.9000000000005,"d":"2346.90"},2240,2156.75,17.47434]
{"$rows_left_out":227}
{"sheet":"MidCap Intra","index":3,"n_rows":531,"n_cols":13,"rows_kept":531,"merged":[[0,0,0,1],[8,0,9,0],[8,1,9,1],[8,2,9,2],[8,3,9,3],[8,4,8,6],[8,7,8,9]]}
[]
[]
[]
[]
[{"$nulls":11},"Back To Main Page"]
["FOR INTRA DAY TRADING",{"$nulls":9},{"$f":"Main!B10","v":"2022-04-19"}]
[null,null," "]
[]
["Sr.no","Scrip","CLOSE RATE","Pivot Point","Supports",null,null,"Resistances"]
[{"$nulls":4},"S1","S2","S3","R1","R2","R3","HIGH","LOW","Total Trade Quanity in Lakhs"]
[1,"3MINDIA",21598.75,{"v":21376.2,"d":"21376.20"},{"v":20952.4,"d":"20952.40"},20306.05,19882.25,{"v":22022.550000000003,"d":"22022.55"},22446.35,{"v":23092.700000000004,"d":"23092.70"},21800,20729.85,0.03299]
[2,"AARTIDRUGS",500.15,{"v":501.2,"d":"501.20"},492.95,485.75,{"v":477.5,"d":"477.50"},{"v":508.4,"d":"508.40"},516.65,{"v":523.8499999999999,"d":"523.85"},509.45,494,0.93396]
[3,"AARTIIND",939.45,{"v":938.7666666666668,"d":"938.77"},{"v":926.9833333333336,"d":"926.98"},{"v":914.5166666666668,"d":"914.52"},{"v":902.7333333333336,"d":"902.73"},{"v":951.2333333333336,"d":"951.23"},{"v":963.0166666666667,"d":"963.02"},{"v":975.4833333333336,"d":"975.48"},950.55,926.3,3.70861]
[4,"AAVAS",2412.55,{"v":2434.4333333333334,"d":"2434.43"},{"v":2383.0666666666666,"d":"2383.07"},{"v":2353.583333333333,"d":"2353.58"},{"v":2302.2166666666662,"d":"2302.22"},{"v":2463.916666666667,"d":"2463.92"},{"v":2515.2833333333338,"d":"2515.28"},{"v":2544.7666666666673,"d":"2544.77"},2485.8,2404.95,0.45463]
[5,"ABB",2183.5,{"v":2183.0333333333333,"d":"2183.03"},{"v":2142.0666666666666,"d":"2142.07"},{"v":2100.633333333333,"d":"2100.63"},{"v":2059.6666666666665,"d":"2059.67"},{"v":2224.4666666666667,"d":"2224.47"},{"v":2265.433333333333,"d":"2265.43"},{"v":2306.866666666667,"d":"2306.87"},2224,2141.6,1.27137]
[6,"ABBOTINDIA",17341.15,{"v":17480.433333333334,"d":"17480.43"},{"v":17160.86666666667,"d":"17160.87"},{"v":16980.583333333336,"d":"16980.58"},{"v":16661.01666666667,"d":"16661.02"},{"v":17660.716666666667,"d":"17660.72"},{"v":17980.283333333333,"d":"17980.28"},{"v":18160.566666666666,"d":"18160.57"},17800,17300.15,0.09766]
[7,"ABCAPITAL",114.65,114.95,{"v":113.55000000000001,"d":"113.55"},112.45,{"v":111.05000000000001,"d":"111.05"},{"v":116.05000000000001,"d":"116.05"},{"v":117.45000000000002,"d":"117.45"},{"v":118.55000000000001,"d":"118.55"},116.35,113.85,25.30342]
[8,"ABFRL",293.2,{"v":292.51666666666665,"d":"292.52"},{"v":286.9333333333333,"d":"286.93"},{"v":280.66666666666663,"d":"280.67"},{"v":275.08333333333326,"d":"275.08"},{"v":298.7833333333333,"d":"298.78"},{"v":304.3666666666667,"d":"304.37"},{"v":310.6333333333333,"d":"310.63"},298.1,286.25,16.8731]
[9,"ACC",2155.2,{"v":2183.9166666666665,"d":"2183.92"},{"v":2118.933333333333,"d":"2118.93"},{"v":2082.6666666666665,"d":"2082.67"},{"v":2017.683333333333,"d":"2017.68"},{"v":2220.183333333333,"d":"2220.18"},{"v":2285.1666666666665,"d":"2285.17"},{"v":2321.433333333333,"d":"2321.43"},2248.9,2147.65,4.42194]
[10,"ADANIENT",2233.85,{"v":2210.2000000000003,"d":"2210.20"},{"v":2180.4000000000005,"d":"2180.40"},{"v":2126.9500000000003,"d":"2126.95"},{"v":2097.1500000000005,"d":"2097.15"},{"v":2263.6500000000005,"d":"2263.65"},{"v":2293.4500000000007,"d":"2293.45"},{"v":2346.9000000000005,"d":"2346.90"},2240,2156.75,17.47434]
{"$rows_left_out":512}
{"sheet":"Bulk Deals","index":4,"n_rows":201,"n_cols":8,"rows_kept":201,"merged":[[4,0,4,1],[4,2,4,3],[6,1,6,2]]}
[" "]
[]
[]
[]
[]
[{"$nulls":4},"Back To Main Page"]
["Subject :","BULK DEAL",null,{"$f":"Main!B10","v":"2022-04-19"}]
[]
["Date","Scrip code","Scrip Name","Client Name","Buy / Sell","Quantity Traded","Trade Price / Wt.Avg.trade price","Exchange  "]
["2022-04-18",539773,"ADVIKCA","VINITI SHARMA","SELL",{"v":300000,"d":"300,000"},5.21,"BSE"]
["2022-04-18",539773,"ADVIKCA","STEPPING STONE CONSTRUCTION PRIVATE LIMITED","SELL",{"v":1000000,"d":"1,000,000"},5.21,"BSE"]
["2022-04-18",539773,"ADVIKCA","MUKESH MITTAL","SELL",{"v":350000,"d":"350,000"},5.21,"BSE"]
["2022-04-18",539773,"ADVIKCA","ISHANT HEERA","SELL",{"v":293843,"d":"293,843"},5.21,"BSE"]
["2022-04-18",539773,"ADVIKCA","CHETAN RASIKLAL SHAH","BUY",{"v":505099,"d":"505,099"},5.21,"BSE"]
["2022-04-18",531300,"AMITINT","AMRIT L GANDHI (HUF)","BUY",{"v":100000,"d":"100,000"},7.94,"BSE"]
["2022-04-18",531300,"AMITINT","SOMNATH VAIJNATH KUMBHAR","SELL",{"v":100000,"d":"100,000"},7.94,"BSE"]
["2022-04-18",540135,"ARCFIN","ALPHA LEON ENTERPRISES LLP","BUY",{"v":12856779,"d":"12,856,779"},2.24,"BSE"]
["2022-04-18",540135,"ARCFIN","ALPHA LEON ENTERPRISES LLP","SELL",{"v":2629469,"d":"2,629,469"},2.24,"BSE"]
["2022-04-18",540135,"ARCFIN","SATGURU TRADING","SELL",{"v":3087745,"d":"3,087,745"},2.24,"BSE"]
["2022-04-18",540135,"ARCFIN","TOPGAIN FINANCE PRIVATE LIMITED","BUY",{"v":4481602,"d":"4,481,602"},2.24,"BSE"]
{"$rows_left_out":182}
{"sheet":"Call Tracker (Equity & F&O)","index":5,"n_rows":314,"n_cols":18,"rows_kept":314,"merged":[[73,0,74,0],[73,1,74,1],[73,9,74,9],[107,0,108,0],[107,1,108,1],[107,12,108,12],[107,13,108,13],[107,14,108,14],[107,15,108,15]]}
[]
[]
[]
[]
[{"$nulls":12},"Back To Main Page"]
["Retail Research Technical Calls & Fundamental Performance Report for the month of Apr-2022"]
[{"$nulls":12},{"$f":"Main!B10","v":"2022-04-19"}]
[null,"Positional  Call"]
["Sr.no","Date",null,"Company","Rec","Rec Price","Stop Loss***","Call Closed At","Target","Remark","Profit / Loss per Share","All charges","Net Gain / Loss  %","Status","Closed Date","Market Closing Price"]
[1,"2022-03-07",null,"REDINGTON","Buy",146.5,135,156.5,"160-170","Profit of Rs.10/-",{"$f":"H10-F10","v":10},{"$f":"(F10*-0.7)/100","v":{"v":-1.0255,"d":"-1.03"}},{"$f":"(K10+L10)/F10","v":{"v":0.061259385665529006,"d":"6.13%"}},"Successful","2022-04-07",null,null,"H"]
[2,"2022-03-17",null,"TATACOMM","Buy",1165,1090,1240,"1250-1300","Profit of Rs.75/-",75,{"v":-8.155,"d":"-8.16"},{"v":0.05737768240343347,"d":"5.74%"},"Successful","2022-04-01",null,null,"H"]
[3,"2022-03-21",null,"WHIRLPOOL","Buy",1640,1530,1705,"1800-1900","Part profit of Rs.65/-",65,-11.48,{"v":0.03263414634146341,"d":"3.26%"},"Successful","2022-04-11",{"$f":"VLOOKUP(D12,'MidCap Intra'!B18:C573,2,0)","v":1624.35},null,"H"]
[4,"2022-03-25",null,"SEQUENT","Buy",134.5,125,142.5,"150-160","Profit of Rs.8/-",{"$f":"H13-F13","v":8},{"$f":"(F13*-0.7)/100","v":{"v":-0.9414999999999999,"d":"-0.94"}},{"$f":"(K13+L13)/F13","v":{"v":0.05247955390334573,"d":"5.25%"}},"Successful","2022-04-01",null,null,"H"]
[5,"2022-04-01",null,"HCLTECH","Buy",1155,1090,1199.5,"1250-1300","Part profit of Rs.44.5/-",44.5,{"v":-8.085,"d":"-8.09"},{"v":0.03152813852813853,"d":"3.15%"},"Successful","2022-04-05",{"$f":"VLOOKUP(D14,'MidCap Intra'!B20:C575,2,0)","v":1101.75},null,"H"]
[6,"2022-04-06",null,"APOLLOHOSP","Buy",4540,4195,4750,"4800-5000","Part profit of Rs.210/-",{"$f":"H15-F15","v":210},{"$f":"(F15*-0.7)/100","v":-31.78},{"$f":"(K15+L15)/F15","v":{"v":0.039255506607929515,"d":"3.93%"}},"Successful","2022-04-13",{"$f":"VLOOKUP(D15,'MidCap Intra'!B21:C576,2,0)","v":4554.5},null,"H"]
[7,"2022-04-07",null,"LT","Buy","1810-1830",1715,null,"1950-2000","Open",{"$nulls":7},"H"]
[8,"2022-04-08",null,"REDINGTON","Buy",152,144,161.5,"165-170","Profit of Rs.9.5/-",{"$f":"H17-F17","v":9.5},{"$f":"(F17*-0.7)/100","v":{"v":-1.0639999999999998,"d":"-1.06"}},{"$f":"(K17+L17)/F17","v":{"v":0.0555,"d":"5.55%"}},"Successful","2022-04-11",null,null,"H"]
[9,"2022-04-12",null,"REDINGTON","Buy",154.5,144,164,"170-180","Profit of Rs.9.5/-",9.5,{"$f":"(F18*-0.4)/100","v":{"v":-0.618,"d":"-0.62"}},{"v":0.05748867313915857,"d":"5.75%"},"Successful","2022-04-13",null,null,"H"]
[10,"2022-04-13",null,"TATACOMM","Buy","1280-1300",1215,null,"1400-1450","Open",{"$nulls":7},"H"]
[11,"2022-04-13",null,"CAMS","Buy","2580-2610",2395,null,"2800-2900","Open",{"$nulls":7},"H"]
{"$rows_left_out":283}