{"text_format":"3","workbook":"xlsx","n_sheets":6,"sheets":["Main","Future Intra","Cash Intra","MidCap Intra","Bulk Deals","Call Tracker (Equity & F&O)"],"not_rendered":{"images":4,"external_links":1,"defined_names":4},"read":"whole","date_system":"1900"}

{"sheet":"Main","index":0,"n_rows":27,"n_cols":11,"rows_kept":27}
[null,"                                                                                                 "]
{"$rows_empty":8}
[null,"2021-02-17"]
[]
[null,"Sheet No.","Template Name","Summary"]
[null,1,"Future Intra","For Intraday trading in F&O segment"]
[null,2,"Cash Intra","For Intraday trading in cash market segment"]
[null,3,"Mid-cap Intra","For Intraday trading in Mid-cap stocks"]
[null,4,"Bulk Deals","Reveals Bulk Deals carried on NSE & BSE"]
[null,5,"Call Tracker"]
{"$rows_empty":9}
[{"$nulls":10},"`"]

{"sheet":"Future Intra","index":1,"n_rows":190,"n_cols":16,"rows_kept":190,"merged":[[8,0,9,0],[8,1,9,1],[8,2,9,2],[8,3,9,3],[8,6,8,8],[8,9,8,11]]}
[]
[]
[]
[]
[{"$nulls":12},"Back to Main Page"]
["FOR INTRA DAY TRADING",{"$nulls":10},{"$f":"Main!B10","v":"2021-02-17"}]
[]
[]
["Sr.no","Sector","Scrip","Expiry Date","CLOSE RATE","Pivot Point","Supports",null,null,"Resistances"]
[null,"Sector",null,null,"Point","Point","S1","S2","S3","R1","R2","R3","HIGH","LOW","OI","% Change in OI"]
[1,"Index","BANKNIFTY","2021-02-25",37218.15,{"v":37273.583333333336,"d":"37273.58"},{"v":36777.16666666667,"d":"36777.17"},{"v":36336.183333333334,"d":"36336.18"},{"v":35839.76666666667,"d":"35839.77"},{"v":37714.56666666667,"d":"37714.57"},{"v":38210.983333333344,"d":"38210.98"},{"v":38651.966666666674,"d":"38651.97"},37770,36832.6,1934275,{"v":-0.12554391437516246,"d":"-12.55%"}]
[2,"Index","NIFTY","2021-02-25",15330.25,{"v":15335.449999999999,"d":"15335.45"},{"v":15240.899999999998,"d":"15240.90"},15151.55,{"v":15056.999999999998,"d":"15057.00"},{"v":15424.799999999997,"d":"15424.80"},{"v":15519.349999999997,"d":"15519.35"},{"v":15608.699999999997,"d":"15608.70"},15430,15246.1,12693375,{"v":-1.3099895554886793E-3,"d":"-0.13%"}]
[3,"Index","FINNIFTY","2021-02-25",{"v":17505.4,"d":"17505.40"},{"v":17550.583333333332,"d":"17550.58"},{"v":17304.816666666666,"d":"17304.82"},{"v":17104.233333333334,"d":"17104.23"},{"v":16858.466666666667,"d":"16858.47"},{"v":17751.166666666664,"d":"17751.17"},{"v":17996.933333333334,"d":"17996.93"},{"v":18197.516666666663,"d":"18197.52"},17796.35,17350,28920,{"v":-0.08596713021491782,"d":"-8.60%"}]
[4,"Others","AARTIIND","2021-02-25",1228.25,{"v":1222.3500000000001,"d":"1222.35"},{"v":1215.0500000000002,"d":"1215.05"},{"v":1201.8500000000001,"d":"1201.85"},{"v":1194.5500000000002,"d":"1194.55"},{"v":1235.5500000000002,"d":"1235.55"},1242.85,{"v":1256.0500000000002,"d":"1256.05"},1229.65,1209.15,549950,{"v":-0.05616338439095551,"d":"-5.62%"}]
[5,"Cement","ACC","2021-02-25",{"v":1826.2,"d":"1826.20"},{"v":1823,"d":"1823.00"},{"v":1797,"d":"1797.00"},{"v":1767.8,"d":"1767.80"},{"v":1741.8,"d":"1741.80"},{"v":1852.2,"d":"1852.20"},{"v":1878.2,"d":"1878.20"},{"v":1907.4,"d":"1907.40"},1849,1793.8,3362000,{"v":-0.03140305387496399,"d":"-3.14%"}]
[6,"Others","ADANIENT","2021-02-25",{"v":783.7,"d":"783.70"},{"v":781.7833333333333,"d":"781.78"},{"v":760.5666666666666,"d":"760.57"},{"v":737.4333333333333,"d":"737.43"},{"v":716.2166666666666,"d":"716.22"},{"v":804.9166666666666,"d":"804.92"},{"v":826.1333333333333,"d":"826.13"},{"v":849.2666666666667,"d":"849.27"},803,758.65,16560000,{"v":0.010865584177756073,"d":"1.09%"}]
[7,"Others","ADANIPORTS","2021-02-25",639.85,{"v":638.0833333333334,"d":"638.08"},{"v":631.2666666666668,"d":"631.27"},{"v":622.6833333333334,"d":"622.68"},{"v":615.8666666666668,"d":"615.87"},{"v":646.6666666666667,"d":"646.67"},{"v":653.4833333333333,"d":"653.48"},{"v":662.0666666666667,"d":"662.07"},644.9,629.5,53445000,{"v":0.028282828282828285,"d":"2.83%"}]
[8,"Automobile","AMARAJABAT","2021-02-25",898.85,{"v":904.4666666666667,"d":"904.47"},{"v":886.6333333333334,"d":"886.63"},{"v":874.4166666666667,"d":"874.42"},{"v":856.5833333333335,"d":"856.58"},{"v":916.6833333333334,"d":"916.68"},{"v":934.5166666666667,"d":"934.52"},{"v":946.7333333333333,"d":"946.73"},922.3,892.25,3426000,{"v":0.0910828025477707,"d":"9.11%"}]
[9,"Cement","AMBUJACEM","2021-02-25",{"v":285.2,"d":"285.20"},{"v":284.6166666666666,"d":"284.62"},{"v":281.3833333333332,"d":"281.38"},{"v":277.5666666666666,"d":"277.57"},{"v":274.3333333333332,"d":"274.33"},{"v":288.4333333333332,"d":"288.43"},{"v":291.6666666666667,"d":"291.67"},{"v":295.48333333333323,"d":"295.48"},287.85,280.8,18594000,{"v":-0.011640886620953595,"d":"-1.16%"}]
[10,"Others","APOLLOHOSP","2021-02-25",{"v":3203.2,"d":"3203.20"},{"v":3172.383333333333,"d":"3172.38"},{"v":3090.7666666666664,"d":"3090.77"},{"v":2978.333333333333,"d":"2978.33"},{"v":2896.7166666666662,"d":"2896.72"},{"v":3284.8166666666666,"d":"3284.82"},{"v":3366.4333333333334,"d":"3366.43"},{"v":3478.866666666667,"d":"3478.87"},3254,3059.95,2031500,{"v":-0.005628976994615761,"d":"-0.56%"}]
{"$rows_left_out":155}
{"sheet":"Cash Intra","index":2,"n_rows":246,"n_cols":13,"rows_kept":246,"merged":[[7,0,8,0],[7,1,8,1],[7,2,8,2],[7,3,8,3],[7,4,7,6],[7,7,7,9]]}
[]
[]
[]
[]
[{"$nulls":12},"Back to Main Page"]
["FOR INTRA DAY TRADING",{"$nulls":9},{"$f":"Main!B10","v":"2021-02-17"}]
[]
["Sr.no","Scrip","CLOSE RATE","Pivot Point","Supports",null,null,"Resistances"]
[null,null,"Point",null,"S1","S2","S3","R1","R2","R3","HIGH","LOW","Total Trade Quanity in Lakhs"]
[1,"Nifty 50",15313.45,{"v":15329.133333333333,"d":"15329.13"},{"v":15226.516666666666,"d":"15226.52"},{"v":15139.583333333334,"d":"15139.58"},{"v":15036.966666666667,"d":"15036.97"},{"v":15416.066666666666,"d":"15416.07"},{"v":15518.68333333333,"d":"15518.68"},{"v":15605.616666666665,"d":"15605.62"},15431.75,15242.2]
[2,"Nifty Bank",37098.4,{"v":37189.96666666667,"d":"37189.97"},{"v":36671.183333333334,"d":"36671.18"},{"v":36243.96666666667,"d":"36243.97"},{"v":35725.183333333334,"d":"35725.18"},{"v":37617.183333333334,"d":"37617.18"},{"v":38135.966666666674,"d":"38135.97"},{"v":38563.183333333334,"d":"38563.18"},37708.75,36762.75]
[3,"Nifty CPSE",1747.3,{"v":1736.4166666666667,"d":"1736.42"},{"v":1712.8333333333335,"d":"1712.83"},{"v":1678.3666666666668,"d":"1678.37"},{"v":1654.7833333333335,"d":"1654.78"},{"v":1770.8833333333334,"d":"1770.88"},{"v":1794.466666666667,"d":"1794.47"},{"v":1828.9333333333334,"d":"1828.93"},1760,1701.95]
[4,"Nifty Infra",4177.6,{"v":4174.166666666667,"d":"4174.17"},{"v":4147.733333333334,"d":"4147.73"},{"v":4117.866666666667,"d":"4117.87"},{"v":4091.4333333333334,"d":"4091.43"},{"v":4204.033333333334,"d":"4204.03"},{"v":4230.466666666666,"d":"4230.47"},{"v":4260.333333333334,"d":"4260.33"},4200.6,4144.3]
[5,"Nifty IT",25613.95,25767.25,25366.65,{"v":25119.350000000002,"d":"25119.35"},{"v":24718.750000000004,"d":"24718.75"},26014.55,{"v":26415.149999999998,"d":"26415.15"},{"v":26662.449999999997,"d":"26662.45"},26167.85,25519.95]
[6,"Nifty PSE",3050.65,{"v":3036.9,"d":"3036.90"},{"v":3007.2000000000003,"d":"3007.20"},2963.75,2934.05,{"v":3080.3500000000004,"d":"3080.35"},3110.05,{"v":3153.5000000000005,"d":"3153.50"},3066.6,2993.45]
[7,"Nifty Midcap 50",6885.5,6876.45,6830.65,{"v":6775.8,"d":"6775.80"},{"v":6730,"d":"6730.00"},{"v":6931.299999999999,"d":"6931.30"},{"v":6977.1,"d":"6977.10"},{"v":7031.949999999999,"d":"7031.95"},6922.25,6821.6]
[8,"ACC",1819.3,{"v":1815.9333333333334,"d":"1815.93"},{"v":1788.3166666666668,"d":"1788.32"},{"v":1757.3333333333335,"d":"1757.33"},{"v":1729.716666666667,"d":"1729.72"},{"v":1846.9166666666667,"d":"1846.92"},{"v":1874.5333333333335,"d":"1874.53"},{"v":1905.5166666666667,"d":"1905.52"},1843.55,1784.95,19.3773]
[9,"AUBANK",1092.75,{"v":1098.6833333333334,"d":"1098.68"},{"v":1069.3666666666668,"d":"1069.37"},{"v":1045.9833333333333,"d":"1045.98"},{"v":1016.6666666666667,"d":"1016.67"},{"v":1122.0666666666668,"d":"1122.07"},{"v":1151.3833333333334,"d":"1151.38"},{"v":1174.7666666666669,"d":"1174.77"},1128,1075.3,4.55426]
[10,"AARTIIND",1227.9,{"v":1222.2,"d":"1222.20"},{"v":1213.7,"d":"1213.70"},{"v":1199.5,"d":"1199.50"},{"v":1191,"d":"1191.00"},{"v":1236.4,"d":"1236.40"},{"v":1244.9,"d":"1244.90"},{"v":1259.1000000000001,"d":"1259.10"},1230.7,1208,2.60347]
[11,"ABBOTINDIA",14700.7,{"v":14634.9,"d":"14634.90"},{"v":14530.8,"d":"14530.80"},{"v":14360.9,"d":"14360.90"},{"v":14256.8,"d":"14256.80"},{"v":14804.8,"d":"14804.80"},{"v":14908.900000000001,"d":"14908.90"},{"v":15078.8,"d":"15078.80"},14739,14465,0.23617]
{"$rows_left_out":227}
{"sheet":"MidCap Intra","index":3,"n_rows":537,"n_cols":13,"rows_kept":537,"merged":[[0,0,0,1],[8,0,9,0],[8,1,9,1],[8,2,9,2],[8,3,9,3],[8,4,8,6],[8,7,8,9]]}
[]
[]
[]
[]
[{"$nulls":11},"Back To Main Page"]
["FOR INTRA DAY TRADING",{"$nulls":9},{"$f":"Main!B10","v":"2021-02-17"}]
[null,null," "]
[]
["Sr.no","Scrip","CLOSE RATE","Pivot Point","Supports",null,null,"Resistances"]
[null,null,"Point",null,"S1","S2","S3","R1","R2","R3","HIGH","LOW","Total Trade Quanity in Lakhs"]
[1,"3MINDIA",{"$f":"VLOOKUP($B11,[1]EQ!$A$1:$L$2000,6,0)","v":21298.05},{"$f":"(C11+K11+L11)/3","v":{"v":21211.016666666666,"d":"21211.02"}},{"$f":"+(D11*2)-K11","v":{"v":20922.033333333333,"d":"20922.03"}},{"$f":"+D11-K11+L11","v":{"v":20546.016666666666,"d":"20546.02"}},{"$f":"L11-2*(K11-D11)","v":{"v":20257.033333333333,"d":"20257.03"}},{"$f":"(D11*2)-L11","v":{"v":21587.033333333333,"d":"21587.03"}},{"$f":"+D11+K11-L11","v":{"v":21876.016666666663,"d":"21876.02"}},{"$f":"K11+2*(D11-L11)","v":{"v":22252.033333333333,"d":"22252.03"}},{"$f":"VLOOKUP($B11,[1]EQ!$A$1:$L$2000,4,0)","v":21500},{"$f":"VLOOKUP($B11,[1]EQ!$A$1:$L$2000,5,0)","v":20835},{"$f":"(VLOOKUP($B11,[1]EQ!$A$1:$L$2000,9,0)/100000)","v":0.16907}]
[2,"ABB",{"$f":"VLOOKUP($B12,[1]EQ!$A$1:$L$2000,6,0)","v":1500.5},{"v":1496.5,"d":"1496.50"},{"v":1478,"d":"1478.00"},{"v":1455.5,"d":"1455.50"},{"v":1437,"d":"1437.00"},{"v":1519,"d":"1519.00"},{"v":1537.5,"d":"1537.50"},{"v":1560,"d":"1560.00"},{"$f":"VLOOKUP($B12,[1]EQ!$A$1:$L$2000,4,0)","v":1515},{"$f":"VLOOKUP($B12,[1]EQ!$A$1:$L$2000,5,0)","v":1474},{"$f":"(VLOOKUP($B12,[1]EQ!$A$1:$L$2000,9,0)/100000)","v":1.70927}]
[3,"POWERINDIA",{"$f":"VLOOKUP($B13,[1]EQ!$A$1:$L$2000,6,0)","v":1343.15},{"v":1351.0833333333333,"d":"1351.08"},{"v":1323.0666666666666,"d":"1323.07"},{"v":1302.9833333333333,"d":"1302.98"},{"v":1274.9666666666667,"d":"1274.97"},{"v":1371.1666666666665,"d":"1371.17"},{"v":1399.1833333333334,"d":"1399.18"},{"v":1419.2666666666664,"d":"1419.27"},{"$f":"VLOOKUP($B13,[1]EQ!$A$1:$L$2000,4,0)","v":1379.1},{"$f":"VLOOKUP($B13,[1]EQ!$A$1:$L$2000,5,0)","v":1331},{"$f":"(VLOOKUP($B13,[1]EQ!$A$1:$L$2000,9,0)/100000)","v":0.18664}]
[4,"ACC",{"$f":"VLOOKUP($B14,[1]EQ!$A$1:$L$2000,6,0)","v":1819.3},{"v":1815.9333333333334,"d":"1815.93"},{"v":1788.3166666666668,"d":"1788.32"},{"v":1757.3333333333335,"d":"1757.33"},{"v":1729.716666666667,"d":"1729.72"},{"v":1846.9166666666667,"d":"1846.92"},{"v":1874.5333333333335,"d":"1874.53"},{"v":1905.5166666666667,"d":"1905.52"},{"$f":"VLOOKUP($B14,[1]EQ!$A$1:$L$2000,4,0)","v":1843.55},{"$f":"VLOOKUP($B14,[1]EQ!$A$1:$L$2000,5,0)","v":1784.95},{"$f":"(VLOOKUP($B14,[1]EQ!$A$1:$L$2000,9,0)/100000)","v":19.3773}]
[5,"AIAENG",{"$f":"VLOOKUP($B15,[1]EQ!$A$1:$L$2000,6,0)","v":1949.9},{"v":1961.0833333333333,"d":"1961.08"},{"v":1930.8666666666666,"d":"1930.87"},{"v":1911.8333333333333,"d":"1911.83"},{"v":1881.6166666666666,"d":"1881.62"},{"v":1980.1166666666666,"d":"1980.12"},{"v":2010.3333333333333,"d":"2010.33"},{"v":2029.3666666666666,"d":"2029.37"},{"$f":"VLOOKUP($B15,[1]EQ!$A$1:$L$2000,4,0)","v":1991.3},{"$f":"VLOOKUP($B15,[1]EQ!$A$1:$L$2000,5,0)","v":1942.05},{"$f":"(VLOOKUP($B15,[1]EQ!$A$1:$L$2000,9,0)/100000)","v":0.39348}]
[6,"APLAPOLLO",{"$f":"VLOOKUP($B16,[1]EQ!$A$1:$L$2000,6,0)","v":958.1},{"v":970.6999999999999,"d":"970.70"},{"v":942.4999999999999,"d":"942.50"},{"v":926.9,"d":"926.90"},{"v":898.6999999999999,"d":"898.70"},{"v":986.2999999999998,"d":"986.30"},{"v":1014.4999999999999,"d":"1014.50"},{"v":1030.1,"d":"1030.10"},{"$f":"VLOOKUP($B16,[1]EQ!$A$1:$L$2000,4,0)","v":998.9},{"$f":"VLOOKUP($B16,[1]EQ!$A$1:$L$2000,5,0)","v":955.1},{"$f":"(VLOOKUP($B16,[1]EQ!$A$1:$L$2000,9,0)/100000)","v":8.11679}]
[7,"AUBANK",{"$f":"VLOOKUP($B17,[1]EQ!$A$1:$L$2000,6,0)","v":1092.75},{"v":1098.6833333333334,"d":"1098.68"},{"v":1069.3666666666668,"d":"1069.37"},{"v":1045.9833333333333,"d":"1045.98"},{"v":1016.6666666666667,"d":"1016.67"},{"v":1122.0666666666668,"d":"1122.07"},{"v":1151.3833333333334,"d":"1151.38"},{"v":1174.7666666666669,"d":"1174.77"},{"$f":"VLOOKUP($B17,[1]EQ!$A$1:$L$2000,4,0)","v":1128},{"$f":"VLOOKUP($B17,[1]EQ!$A$1:$L$2000,5,0)","v":1075.3},{"$f":"(VLOOKUP($B17,[1]EQ!$A$1:$L$2000,9,0)/100000)","v":4.55426}]
[8,"AARTIDRUGS",{"$f":"VLOOKUP($B18,[1]EQ!$A$1:$L$2000,6,0)","v":668.75},{"v":665.5166666666667,"d":"665.52"},{"v":645.0333333333333,"d":"645.03"},{"v":621.3166666666666,"d":"621.32"},{"v":600.8333333333333,"d":"600.83"},{"v":689.2333333333333,"d":"689.23"},{"v":709.7166666666667,"d":"709.72"},{"v":733.4333333333334,"d":"733.43"},{"$f":"VLOOKUP($B18,[1]EQ!$A$1:$L$2000,4,0)","v":686},{"$f":"VLOOKUP($B18,[1]EQ!$A$1:$L$2000,5,0)","v":641.8},{"$f":"(VLOOKUP($B18,[1]EQ!$A$1:$L$2000,9,0)/100000)","v":9.20307}]
[9,"AARTIIND",{"$f":"VLOOKUP($B19,[1]EQ!$A$1:$L$2000,6,0)","v":1227.9},{"v":1222.2,"d":"1222.20"},{"v":1213.7,"d":"1213.70"},{"v":1199.5,"d":"1199.50"},{"v":1191,"d":"1191.00"},{"v":1236.4,"d":"1236.40"},{"v":1244.9,"d":"1244.90"},{"v":1259.1000000000001,"d":"1259.10"},{"$f":"VLOOKUP($B19,[1]EQ!$A$1:$L$2000,4,0)","v":1230.7},{"$f":"VLOOKUP($B19,[1]EQ!$A$1:$L$2000,5,0)","v":1208},{"$f":"(VLOOKUP($B19,[1]EQ!$A$1:$L$2000,9,0)/100000)","v":2.60347}]
[10,"AAVAS",{"$f":"VLOOKUP($B20,[1]EQ!$A$1:$L$2000,6,0)","v":2212.9},{"v":2222.933333333333,"d":"2222.93"},{"v":2183.866666666666,"d":"2183.87"},{"v":2154.833333333333,"d":"2154.83"},{"v":2115.766666666666,"d":"2115.77"},{"v":2251.966666666666,"d":"2251.97"},{"v":2291.0333333333324,"d":"2291.03"},{"v":2320.0666666666657,"d":"2320.07"},{"$f":"VLOOKUP($B20,[1]EQ!$A$1:$L$2000,4,0)","v":2262},{"$f":"VLOOKUP($B20,[1]EQ!$A$1:$L$2000,5,0)","v":2193.9},{"$f":"(VLOOKUP($B20,[1]EQ!$A$1:$L$2000,9,0)/100000)","v":0.7203}]
{"$rows_left_out":518}
{"sheet":"Bulk Deals","index":4,"n_rows":71,"n_cols":8,"rows_kept":71,"merged":[[4,0,4,1],[4,2,4,3],[6,1,6,2]]}
[" "]
[]
[]
[]
[]
[{"$nulls":4},"Back To Main Page"]
["Subject :","BULK DEAL",null,{"$f":"Main!B10","v":"2021-02-17"}]
[]
["Date","Scrip code","Scrip Name","Client Name","Buy / Sell","Quantity Traded","Trade Price / Wt.Avg.trade price","Exchange  "]
["2021-02-16",512165,"ABANSENT","SK GROWTH FUND PRIVATE LIMITED","BUY",{"v":78308,"d":"78,308"},117,"BSE"]
["2021-02-16",512165,"ABANSENT","PROGYAN CONSTRUCTION AND ENGINEERS PRIVATE LIMITED","SELL",{"v":92400,"d":"92,400"},118.24,"BSE"]
["2021-02-16",533758,"APLAPOLLO","APL INFRASTRUCTURE PRIVATE LIMITED","SELL",{"v":3000000,"d":"3,000,000"},965.15,"BSE"]
["2021-02-16",533758,"APLAPOLLO","SMALLCAP WORLD FUND INC","BUY",{"v":859193,"d":"859,193"},965,"BSE"]
["2021-02-16",537069,"ARNOLD","INT INFRASTURCTURE PRIVATE LIMITED","BUY",{"v":159900,"d":"159,900"},27.22,"BSE"]
["2021-02-16",537069,"ARNOLD","PRASHANT PRAKASH NILAWAR","SELL",{"v":157048,"d":"157,048"},27.22,"BSE"]
["2021-02-16",542176,"ARYAN","ZUBER TRADING LLP","BUY",{"v":104600,"d":"104,600"},6.3,"BSE"]
["2021-02-16",542176,"ARYAN","LAXMI CHAND B SHAH","SELL",{"v":98100,"d":"98,100"},6.3,"BSE"]
["2021-02-16",539884,"DARSHANORNA","DILIP RAMANLAL DOSHI","BUY",{"v":51826,"d":"51,826"},14.05,"BSE"]
["2021-02-16",521216,"DHANROTO","MISAL SINGH KHUNDIA","BUY",{"v":20000,"d":"20,000"},25.7,"BSE"]
["2021-02-16",532951,"GSS","SKYVEIL TRADE SOLUTIONS LLP","BUY",{"v":90844,"d":"90,844"},54.32,"BSE"]
{"$rows_left_out":52}
{"sheet":"Call Tracker (Equity & F&O)","index":5,"n_rows":275,"n_cols":18,"rows_kept":275,"merged":[[66,0,67,0],[66,1,67,1],[66,9,67,9],[66,12,67,12],[66,13,67,13],[66,14,67,14],[66,15,67,15]]}
[]
[]
[]
[]
[{"$nulls":12},"Back To Main Page"]
["Retail Research Technical Calls & Fundamental Performance Report for the month of February-2021"]
[{"$nulls":12},{"$f":"Main!B10","v":"2021-02-17"}]
[null,"Positional  Call"]
["Sr.no","Date",null,"Company","Rec","Rec Price","Stop Loss***","Call Closed At","Target","Remark","Profit / Loss per Share","All charges","Net Gain / Loss  %","Status","Closed Date"]
[1,"2020-12-10",null,"IRCTC","Buy",1427.5,1330,1535,"1550-1600","Profit of Rs.107.5/-",{"$f":"H10-F10","v":107.5},{"$f":"(F10*-0.8)/100","v":-11.42},{"$f":"(K10+L10)/F10","v":{"v":0.06730647985989492,"d":"6.73%"}},"Successful","2021-02-04",null,null,"H"]
[2,"2021-01-05",null,"BRITANNIA","Buy",3540,3295,{"$f":"(3682.5+3520)/2","v":3601.25},"3900-4000","Profit of Rs.61.25/-",{"$f":"H11-F11","v":61.25},{"$f":"(F11*-0.8)/100","v":-28.32},{"$f":"(K11+L11)/F11","v":{"v":0.00930225988700565,"d":"0.93%"}},"Successful","2021-02-01",null,null,"H"]
[3,"2021-02-02",null,"JKCEMENT","Buy",2197.5,2070,2357.5,"2400-2450","Profit of Rs.160/-",160,{"$f":"(F12*-0.8)/100","v":-17.58},{"$f":"(K12+L12)/F12","v":{"v":0.06481001137656428,"d":"6.48%"}},"Successful","2020-02-08",null,null,"H"]
[4,"2021-02-02",null,"HINDUNILVR","Buy","2235-2245",2090,null,"2500-2550","Open",{"$nulls":7},"H"]
[5,"2021-02-04",null,"PIIND","Buy",2190,1995,2330,2500,"Profit of Rs.140/-",{"$f":"H14-F14","v":140},{"$f":"(F14*-0.07)/100","v":{"v":-1.5330000000000001,"d":"-1.53"}},{"$f":"(K14+L14)/F14","v":{"v":0.06322694063926941,"d":"6.32%"}},"Successful","2020-02-04",null,null,"H"]
[6,"2021-02-09",null,"IRCTC","Buy",1597.5,1514,1702.5,"1750-1800","Profit of Rs.105/-",105,{"$f":"(F15*-0.8)/100","v":-12.78},{"v":0.05772769953051643,"d":"5.77%"},"Successful","2020-02-12",null,null,"H"]
[7,"2021-02-09",null,"PIIND","Buy","2200-2210",2070,null,"2400-2500","Open",{"$nulls":7},"H"]
[]
[]
[]
[]
{"$rows_left_out":237}