{"text_format":"3","workbook":"xlsx","n_sheets":6,"sheets":["Main","Future Intra","Cash Intra","MidCap Intra","Bulk Deals","Call Tracker (Equity & F&O)"],"not_rendered":{"images":2,"defined_names":2},"read":"whole","date_system":"1900"}

{"sheet":"Main","index":0,"n_rows":27,"n_cols":11,"rows_kept":27}
[null,"                                                                                                 "]
{"$rows_empty":8}
[null,"2021-12-15"]
[]
[null,"Sheet No.","Template Name","Summary"]
[null,1,"Future Intra","For Intraday trading in F&O segment"]
[null,2,"Cash Intra","For Intraday trading in cash market segment"]
[null,3,"Mid-cap Intra","For Intraday trading in Mid-cap stocks"]
[null,4,"Bulk Deals","Reveals Bulk Deals carried on NSE & BSE"]
[null,5,"Call Tracker"]
{"$rows_empty":9}
[{"$nulls":10},"`"]

{"sheet":"Future Intra","index":1,"n_rows":225,"n_cols":16,"rows_kept":225,"merged":[[8,0,9,0],[8,1,9,1],[8,2,9,2],[8,3,9,3],[8,6,8,8],[8,9,8,11]]}
[]
[]
[]
[]
[{"$nulls":12},"Back to Main Page"]
["FOR INTRA DAY TRADING",{"$nulls":10},{"$f":"Main!B10","v":"2021-12-15"}]
[]
[]
["Sr.no","Sector","Scrip","Expiry Date","CLOSE RATE","Pivot Point","Supports",null,null,"Resistances"]
[{"$nulls":4},"Point","Point","S1","S2","S3","R1","R2","R3","HIGH","LOW","OI","% Change in OI"]
[1,"Index","BANKNIFTY","2021-12-30",{"v":37042.5,"d":"37042.50"},{"v":36963.816666666666,"d":"36963.82"},{"v":36727.63333333333,"d":"36727.63"},{"v":36412.76666666666,"d":"36412.77"},{"v":36176.58333333333,"d":"36176.58"},{"v":37278.683333333334,"d":"37278.68"},{"v":37514.86666666667,"d":"37514.87"},{"v":37829.73333333334,"d":"37829.73"},37200,36648.95,2409025,{"v":1.6944219214536686E-3,"d":"0.17%"}]
[2,"Index","NIFTY","2021-12-30",17355.05,{"v":17336.350000000002,"d":"17336.35"},{"v":17248.700000000004,"d":"17248.70"},{"v":17142.350000000002,"d":"17142.35"},{"v":17054.700000000004,"d":"17054.70"},{"v":17442.700000000004,"d":"17442.70"},{"v":17530.350000000006,"d":"17530.35"},{"v":17636.700000000004,"d":"17636.70"},17424,17230,12947200,{"v":0.08555066928820267,"d":"8.56%"}]
[3,"Index","FINNIFTY","2021-12-28",18002.95,{"v":17946.399999999998,"d":"17946.40"},{"v":17856.599999999995,"d":"17856.60"},{"v":17710.249999999996,"d":"17710.25"},{"v":17620.449999999993,"d":"17620.45"},{"v":18092.749999999996,"d":"18092.75"},18182.55,{"v":18328.899999999998,"d":"18328.90"},18036.2,17800.05,600,{"v":0.25,"d":"25.00%"}]
[4,"Chemical","AARTIIND","2021-12-30",992.35,{"v":999.0333333333334,"d":"999.03"},{"v":981.6166666666668,"d":"981.62"},{"v":970.8833333333333,"d":"970.88"},{"v":953.4666666666667,"d":"953.47"},{"v":1009.7666666666669,"d":"1009.77"},{"v":1027.1833333333336,"d":"1027.18"},{"v":1037.916666666667,"d":"1037.92"},1016.45,988.3,2538100,{"v":1.3413816230717639E-3,"d":"0.13%"}]
[5,"Pharma","ABBOTINDIA","2021-12-30",{"v":18351.5,"d":"18351.50"},{"v":18351.483333333334,"d":"18351.48"},{"v":18155.016666666666,"d":"18155.02"},{"v":17958.533333333333,"d":"17958.53"},{"v":17762.066666666666,"d":"17762.07"},{"v":18547.966666666667,"d":"18547.97"},{"v":18744.433333333334,"d":"18744.43"},{"v":18940.916666666668,"d":"18940.92"},18547.95,18155,35525,{"v":0.03571428571428571,"d":"3.57%"}]
[6,"Textile","ABFRL","2021-12-30",{"v":284.7,"d":"284.70"},{"v":280.5833333333333,"d":"280.58"},{"v":269.6166666666666,"d":"269.62"},{"v":254.5333333333333,"d":"254.53"},{"v":243.5666666666666,"d":"243.57"},{"v":295.66666666666663,"d":"295.67"},{"v":306.6333333333333,"d":"306.63"},{"v":321.71666666666664,"d":"321.72"},291.55,265.5,10358400,{"v":0.07617504051863858,"d":"7.62%"}]
[7,"Cement","ACC","2021-12-30",2323.95,{"v":2311.9,"d":"2311.90"},{"v":2293.8,"d":"2293.80"},2263.65,2245.55,2342.05,{"v":2360.1499999999996,"d":"2360.15"},{"v":2390.3,"d":"2390.30"},2330,2281.75,2036250,{"v":-0.01784637646207645,"d":"-1.78%"}]
[8,"Others","ADANIENT","2021-12-30",{"v":1723.8,"d":"1723.80"},{"v":1715.0666666666668,"d":"1715.07"},{"v":1696.1333333333337,"d":"1696.13"},{"v":1668.466666666667,"d":"1668.47"},{"v":1649.5333333333338,"d":"1649.53"},{"v":1742.7333333333336,"d":"1742.73"},{"v":1761.6666666666665,"d":"1761.67"},{"v":1789.3333333333335,"d":"1789.33"},1734,1687.4,20860500,{"v":-1.1252633595096725E-3,"d":"-0.11%"}]
[9,"Others","ADANIPORTS","2021-12-30",765.85,{"v":762.1833333333334,"d":"762.18"},{"v":756.6166666666668,"d":"756.62"},{"v":747.3833333333334,"d":"747.38"},{"v":741.8166666666668,"d":"741.82"},{"v":771.4166666666667,"d":"771.42"},{"v":776.9833333333333,"d":"776.98"},{"v":786.2166666666667,"d":"786.22"},767.75,752.95,89577500,{"v":-1.4213254556602196E-3,"d":"-0.14%"}]
[10,"Pharma","ALKEM","2021-12-30",{"v":3475.9,"d":"3475.90"},{"v":3469.183333333333,"d":"3469.18"},{"v":3446.366666666666,"d":"3446.37"},{"v":3416.833333333333,"d":"3416.83"},{"v":3394.016666666666,"d":"3394.02"},{"v":3498.716666666666,"d":"3498.72"},{"v":3521.5333333333324,"d":"3521.53"},{"v":3551.0666666666657,"d":"3551.07"},3492,3439.65,421600,{"v":-0.021809744779582366,"d":"-2.18%"}]
{"$rows_left_out":199}
{"sheet":"Cash Intra","index":2,"n_rows":246,"n_cols":13,"rows_kept":246,"merged":[[7,0,8,0],[7,1,8,1],[7,2,8,2],[7,3,8,3],[7,4,7,6],[7,7,7,9]]}
[]
[]
[]
[]
[{"$nulls":12},"Back to Main Page"]
["FOR INTRA DAY TRADING",{"$nulls":9},{"$f":"Main!B10","v":"2021-12-15"}]
[]
["Sr.no",null,"CLOSE RATE","Pivot Point","Supports",null,null,"Resistances"]
[{"$nulls":4},"S1","S2","S3","R1","R2","R3","HIGH","LOW","Total Trade Quanity in Lakhs"]
[1,"Nifty 50",17324.9,{"v":17308.96666666667,"d":"17308.97"},{"v":17241.73333333334,"d":"17241.73"},{"v":17158.56666666667,"d":"17158.57"},{"v":17091.33333333334,"d":"17091.33"},{"v":17392.133333333342,"d":"17392.13"},{"v":17459.366666666672,"d":"17459.37"},{"v":17542.533333333344,"d":"17542.53"},17376.2,17225.8]
[2,"Nifty Bank",36893.95,{"v":36826.13333333333,"d":"36826.13"},{"v":36613.21666666666,"d":"36613.22"},{"v":36332.48333333333,"d":"36332.48"},{"v":36119.56666666666,"d":"36119.57"},{"v":37106.86666666666,"d":"37106.87"},{"v":37319.78333333333,"d":"37319.78"},{"v":37600.51666666666,"d":"37600.52"},37039.05,36545.4]
[3,"Nifty CPSE",2315.7,{"v":2305.9833333333336,"d":"2305.98"},{"v":2291.566666666667,"d":"2291.57"},{"v":2267.4333333333334,"d":"2267.43"},{"v":2253.016666666667,"d":"2253.02"},{"v":2330.1166666666672,"d":"2330.12"},{"v":2344.5333333333333,"d":"2344.53"},{"v":2368.6666666666674,"d":"2368.67"},2320.4,2281.85]
[4,"Nifty Infra",5030.5,{"v":5025.766666666666,"d":"5025.77"},{"v":5004.533333333333,"d":"5004.53"},{"v":4978.566666666667,"d":"4978.57"},{"v":4957.333333333333,"d":"4957.33"},{"v":5051.733333333333,"d":"5051.73"},{"v":5072.966666666666,"d":"5072.97"},{"v":5098.9333333333325,"d":"5098.93"},5047,4999.8]
[5,"Nifty IT",36102.55,{"v":35997.48333333334,"d":"35997.48"},{"v":35742.91666666667,"d":"35742.92"},{"v":35383.28333333333,"d":"35383.28"},{"v":35128.71666666667,"d":"35128.72"},{"v":36357.116666666676,"d":"36357.12"},{"v":36611.68333333334,"d":"36611.68"},{"v":36971.31666666668,"d":"36971.32"},36252.05,35637.85]
[6,"Nifty PSE",3956.5,{"v":3943.9166666666665,"d":"3943.92"},{"v":3925.183333333333,"d":"3925.18"},{"v":3893.8666666666663,"d":"3893.87"},{"v":3875.1333333333328,"d":"3875.13"},{"v":3975.233333333333,"d":"3975.23"},{"v":3993.9666666666667,"d":"3993.97"},{"v":4025.2833333333333,"d":"4025.28"},3962.65,3912.6]
[7,"Nifty Midcap 50",8593.15,{"v":8575.433333333332,"d":"8575.43"},{"v":8536.966666666665,"d":"8536.97"},{"v":8480.783333333333,"d":"8480.78"},{"v":8442.316666666666,"d":"8442.32"},{"v":8631.616666666665,"d":"8631.62"},{"v":8670.083333333332,"d":"8670.08"},{"v":8726.266666666665,"d":"8726.27"},8613.9,8519.25]
[8,"ACC",2320.15,{"v":2306.3,"d":"2306.30"},{"v":2286.3,"d":"2286.30"},2252.45,2232.45,{"v":2340.1500000000005,"d":"2340.15"},{"v":2360.1500000000005,"d":"2360.15"},{"v":2394.000000000001,"d":"2394.00"},2326.3,2272.45,4.0805]
[9,"AUBANK",1168.9,{"v":1167.8,"d":"1167.80"},{"v":1151.1,"d":"1151.10"},{"v":1133.3,"d":"1133.30"},{"v":1116.6,"d":"1116.60"},{"v":1185.6,"d":"1185.60"},{"v":1202.3000000000002,"d":"1202.30"},{"v":1220.1,"d":"1220.10"},1184.5,1150,6.84112]
[10,"AARTIIND",988.45,{"v":996.1333333333333,"d":"996.13"},{"v":977.4666666666667,"d":"977.47"},{"v":966.4833333333333,"d":"966.48"},{"v":947.8166666666667,"d":"947.82"},{"v":1007.1166666666667,"d":"1007.12"},{"v":1025.7833333333333,"d":"1025.78"},{"v":1036.7666666666667,"d":"1036.77"},1014.8,985.15,6.95765]
[11,"ADANIENT",1720.1,{"v":1710.3333333333333,"d":"1710.33"},{"v":1692.7666666666664,"d":"1692.77"},{"v":1665.4333333333332,"d":"1665.43"},{"v":1647.8666666666663,"d":"1647.87"},{"v":1737.6666666666665,"d":"1737.67"},{"v":1755.2333333333336,"d":"1755.23"},{"v":1782.5666666666666,"d":"1782.57"},1727.9,1683,11.98653]
{"$rows_left_out":227}
{"sheet":"MidCap Intra","index":3,"n_rows":533,"n_cols":13,"rows_kept":533,"merged":[[0,0,0,1],[8,0,9,0],[8,1,9,1],[8,2,9,2],[8,3,9,3],[8,4,8,6],[8,7,8,9]]}
[]
[]
[]
[]
[{"$nulls":11},"Back To Main Page"]
["FOR INTRA DAY TRADING",{"$nulls":9},{"$f":"Main!B10","v":"2021-12-15"}]
[null,null," "]
[]
["Sr.no","Scrip","CLOSE RATE","Pivot Point","Supports",null,null,"Resistances"]
[{"$nulls":4},"S1","S2","S3","R1","R2","R3","HIGH","LOW","Total Trade Quanity in Lakhs"]
[1,"3MINDIA",24777.5,{"v":24902.333333333332,"d":"24902.33"},{"v":24575.216666666664,"d":"24575.22"},{"v":24372.93333333333,"d":"24372.93"},{"v":24045.816666666662,"d":"24045.82"},{"v":25104.616666666665,"d":"25104.62"},{"v":25431.733333333334,"d":"25431.73"},{"v":25634.016666666666,"d":"25634.02"},25229.45,24700.05,0.01153]
[2,"AARTIDRUGS",565.1,{"v":571.0333333333334,"d":"571.03"},{"v":552.2666666666669,"d":"552.27"},{"v":539.4333333333335,"d":"539.43"},{"v":520.666666666667,"d":"520.67"},{"v":583.8666666666668,"d":"583.87"},{"v":602.6333333333334,"d":"602.63"},{"v":615.4666666666667,"d":"615.47"},589.8,558.2,2.56449]
[3,"AARTIIND",988.45,{"v":996.1333333333333,"d":"996.13"},{"v":977.4666666666667,"d":"977.47"},{"v":966.4833333333333,"d":"966.48"},{"v":947.8166666666667,"d":"947.82"},{"v":1007.1166666666667,"d":"1007.12"},{"v":1025.7833333333333,"d":"1025.78"},{"v":1036.7666666666667,"d":"1036.77"},1014.8,985.15,6.95765]
[4,"AAVAS",2555.4,{"v":2573.5,"d":"2573.50"},{"v":2511.9,"d":"2511.90"},{"v":2468.4,"d":"2468.40"},{"v":2406.8,"d":"2406.80"},{"v":2617,"d":"2617.00"},{"v":2678.6000000000004,"d":"2678.60"},{"v":2722.1,"d":"2722.10"},2635.1,2530,1.24985]
[5,"ABB",2272.55,{"v":2284.1,"d":"2284.10"},{"v":2248.5,"d":"2248.50"},{"v":2224.4500000000003,"d":"2224.45"},{"v":2188.8500000000004,"d":"2188.85"},{"v":2308.1499999999996,"d":"2308.15"},{"v":2343.749999999999,"d":"2343.75"},{"v":2367.7999999999993,"d":"2367.80"},2319.7,2260.05,0.71628]
[6,"ABBOTINDIA",18273.75,18269.75,{"v":18069,"d":"18069.00"},17864.25,{"v":17663.5,"d":"17663.50"},{"v":18474.5,"d":"18474.50"},18675.25,{"v":18880,"d":"18880.00"},18470.5,18065,0.1873]
[7,"ABCAPITAL",121.9,{"v":122.56666666666668,"d":"122.57"},{"v":120.23333333333335,"d":"120.23"},{"v":118.56666666666668,"d":"118.57"},{"v":116.23333333333335,"d":"116.23"},{"v":124.23333333333335,"d":"124.23"},{"v":126.56666666666669,"d":"126.57"},{"v":128.23333333333335,"d":"128.23"},124.9,120.9,46.21461]
[8,"ABFRL",283.35,279.55,{"v":268.20000000000005,"d":"268.20"},253.05,{"v":241.70000000000005,"d":"241.70"},{"v":294.70000000000005,"d":"294.70"},{"v":306.05000000000007,"d":"306.05"},{"v":321.20000000000005,"d":"321.20"},290.9,264.4,182.37309]
[9,"ACC",2320.15,{"v":2306.3,"d":"2306.30"},{"v":2286.3,"d":"2286.30"},2252.45,2232.45,{"v":2340.1500000000005,"d":"2340.15"},{"v":2360.1500000000005,"d":"2360.15"},{"v":2394.000000000001,"d":"2394.00"},2326.3,2272.45,4.0805]
[10,"ADANIENT",1720.1,{"v":1710.3333333333333,"d":"1710.33"},{"v":1692.7666666666664,"d":"1692.77"},{"v":1665.4333333333332,"d":"1665.43"},{"v":1647.8666666666663,"d":"1647.87"},{"v":1737.6666666666665,"d":"1737.67"},{"v":1755.2333333333336,"d":"1755.23"},{"v":1782.5666666666666,"d":"1782.57"},1727.9,1683,11.98653]
{"$rows_left_out":508}
{"sheet":"Bulk Deals","index":4,"n_rows":193,"n_cols":8,"rows_kept":193,"merged":[[4,0,4,1],[4,2,4,3],[6,1,6,2]]}
[" "]
[]
[]
[]
[]
[{"$nulls":4},"Back To Main Page"]
["Subject :","BULK DEAL",null,{"$f":"Main!B10","v":"2021-12-15"}]
[]
["Date","Scrip code","Scrip Name","Client Name","Buy / Sell","Quantity Traded","Trade Price / Wt.Avg.trade price","Exchange  "]
["2021-12-14",540146,"ACML","INVICTUS STOCK RESEARCH PRIVATE LIMITED","SELL",{"v":100000,"d":"100,000"},47.75,"BSE"]
["2021-12-14",540923,"AML","SUSHIL KUMAR JAIN HUF","SELL",{"v":54000,"d":"54,000"},5.8,"BSE"]
["2021-12-14",540923,"AML","ASHISH NAHATA","BUY",{"v":54000,"d":"54,000"},5.8,"BSE"]
["2021-12-14",530109,"ANUPAM","MANSUKH VALJI BORICHA","SELL",{"v":1350000,"d":"1,350,000"},3.31,"BSE"]
["2021-12-14",519532,"ASIANTNE","PUSHPA BHAJU","SELL",{"v":95000,"d":"95,000"},32.55,"BSE"]
["2021-12-14",514272,"BHILSPIN","FASHION SUITINGS PVT LTD","SELL",{"v":42000,"d":"42,000"},21.38,"BSE"]
["2021-12-14",530249,"BRIDGESE","ALPHA LEON ENTERPRISES LLP","SELL",{"v":33019,"d":"33,019"},44.62,"BSE"]
["2021-12-14",535267,"COMFINCAP","PARASRAMPURIA INFRASTRUCTURE LLP .","BUY",722,69.63,"BSE"]
["2021-12-14",535267,"COMFINCAP","PARASRAMPURIA INFRASTRUCTURE LLP .","SELL",{"v":59522,"d":"59,522"},70.42,"BSE"]
["2021-12-14",512379,"CRESSAN","TANGO COMMOSALES LLP","SELL",{"v":3589284,"d":"3,589,284"},6.26,"BSE"]
["2021-12-14",524752,"DECIPHER","RATNESHKUMARPRAVAKER","SELL",{"v":83036,"d":"83,036"},79.45,"BSE"]
{"$rows_left_out":174}
{"sheet":"Call Tracker (Equity & F&O)","index":5,"n_rows":293,"n_cols":18,"rows_kept":293}
[]
[]
[]
[]
[{"$nulls":12},"Back To Main Page"]
["Retail Research Technical Calls & Fundamental Performance Report for the month of Dec-2021"]
[{"$nulls":12},{"$f":"Main!B10","v":"2021-12-15"}]
[null,"Positional  Call"]
["Sr.no","Date",null,"Company","Rec","Rec Price","Stop Loss***","Call Closed At","Target","Remark","Profit / Loss per Share","All charges","Net Gain / Loss  %","Status","Closed Date","Market Closing Price"]
[1,"2021-10-05",null,"HDFCLIFE","Buy",720,660,{"v":675,"d":"675.00"},"820-850","Loss of Rs.42.5-",{"$f":"H10-F10","v":-45},{"$f":"(F10*-0.7)/100","v":{"v":-5.039999999999999,"d":"-5.04"}},{"$f":"(K10+L10)/F10","v":{"v":-0.06949999999999999,"d":"-6.95%"}},"Unsuccessful","2021-12-13",null,null,"H"]
[2,"2021-10-26",null,"ICICIGI","Buy","1480-1500",1395,null,"1600-1700","Open",{"$nulls":5},{"$f":"VLOOKUP(D11,'MidCap Intra'!B29:C522,2,0)","v":1434.95},null,"H"]
[3,"2021-11-25",null,"IEX","Buy",772.5,730,{"v":730,"d":"730.00"},"820-860","Loss of Rs.42.5-",{"$f":"H12-F12","v":-42.5},{"$f":"(F12*-0.7)/100","v":{"v":-5.4075,"d":"-5.41"}},{"$f":"(K12+L12)/F12","v":{"v":-0.06201618122977346,"d":"-6.20%"}},"Unsuccessful","2021-12-01",null,null,"H"]
[4,"2021-11-25",null,"IPCALAB","Buy",2065,1950,{"v":2155,"d":"2,155.00"},"2200-2250","Part Profit of Rs.90/-",{"$f":"H13-F13","v":90},{"$f":"(F13*-0.7)/100","v":{"v":-14.455,"d":"-14.46"}},{"$f":"(K13+L13)/F13","v":{"v":0.036583535108958835,"d":"3.66%"}},"Successful","2021-11-30",null,null,"H"]
[5,"2021-11-26",null,"SUPREMEIND","Buy",2160,2030,{"v":2290,"d":"2,290.00"},"2400-2500","Profit of Rs.130/-",{"$f":"H14-F14","v":130},{"$f":"(F14*-0.7)/100","v":-15.12},{"$f":"(K14+L14)/F14","v":{"v":0.05318518518518518,"d":"5.32%"}},"Successful","2021-12-01",null,null,"H"]
[6,"2021-11-26",null,"BEL","Buy",201,189,{"v":213.5,"d":"213.50"},"214-224","Profit of Rs.12.50/-",12.5,{"$f":"(F15*-0.7)/100","v":{"v":-1.4069999999999998,"d":"-1.41"}},{"v":0.05518905472636816,"d":"5.52%"},"Successful","2021-12-07",null,null,"H"]
[7,"2021-12-01",null,"VTL","Buy",1970,1845,{"v":2115,"d":"2,115.00"},"2100-2200","Profit of Rs.12.50/-",{"$f":"H16-F16","v":145},{"$f":"(F16*-0.7)/100","v":-13.79},{"$f":"(K16+L16)/F16","v":{"v":0.06660406091370559,"d":"6.66%"}},"Successful","2021-12-14",null,null,"H"]
[8,"2021-12-02",null,"CROMPTON","Buy","435-440",414,null,"465-475","Open",{"$nulls":5},{"$f":"VLOOKUP(D17,'MidCap Intra'!B42:C535,2,0)","v":415.85},null,"H"]
[9,"2021-12-02",null,"IOC","Buy","118-120",109,null,"130-135","Open",{"$nulls":5},{"$f":"VLOOKUP(D18,'MidCap Intra'!B43:C536,2,0)","v":117.9},null,"H"]
[10,"2021-12-13",null,"INDUSTOWER","Buy","270-274",255,null,"295-315","Open",{"$nulls":5},{"$f":"VLOOKUP(D19,'MidCap Intra'!B44:C537,2,0)","v":266.15}]
[11,"2021-12-14",null,"HDFCLIFE","Buy","663-668",635,null,"700-730","Open",{"$nulls":5},{"$f":"VLOOKUP(D20,'MidCap Intra'!B45:C538,2,0)","v":669.5}]
{"$rows_left_out":245}