{"text_format":"3","workbook":"xlsx","n_sheets":6,"sheets":["Main","Future Intra","Cash Intra","MidCap Intra","Bulk Deals","Call Tracker (Equity & F&O)"],"not_rendered":{"images":2,"defined_names":2},"read":"whole","date_system":"1900"}

{"sheet":"Main","index":0,"n_rows":27,"n_cols":11,"rows_kept":27}
[null,"                                                                                                 "]
{"$rows_empty":8}
[null,"2022-03-14"]
[]
[null,"Sheet No.","Template Name","Summary"]
[null,1,"Future Intra","For Intraday trading in F&O segment"]
[null,2,"Cash Intra","For Intraday trading in cash market segment"]
[null,3,"Mid-cap Intra","For Intraday trading in Mid-cap stocks"]
[null,4,"Bulk Deals","Reveals Bulk Deals carried on NSE & BSE"]
[null,5,"Call Tracker"]
{"$rows_empty":9}
[{"$nulls":10},"`"]

{"sheet":"Future Intra","index":1,"n_rows":240,"n_cols":16,"rows_kept":240,"merged":[[8,0,9,0],[8,1,9,1],[8,2,9,2],[8,3,9,3],[8,6,8,8],[8,9,8,11]]}
[]
[]
[]
[]
[{"$nulls":12},"Back to Main Page"]
["FOR INTRA DAY TRADING",{"$nulls":10},{"$f":"Main!B10","v":"2022-03-14"}]
[]
[]
["Sr.no","Sector","Scrip","Expiry Date","CLOSE RATE","Pivot Point","Supports",null,null,"Resistances"]
[{"$nulls":4},"Point","Point","S1","S2","S3","R1","R2","R3","HIGH","LOW","OI","% Change in OI"]
[1,"Index","NIFTY","2022-03-31",16647.75,{"v":16610.2,"d":"16610.20"},{"v":16512.600000000002,"d":"16512.60"},16377.45,{"v":16279.850000000002,"d":"16279.85"},{"v":16745.350000000002,"d":"16745.35"},16842.95,{"v":16978.100000000002,"d":"16978.10"},16707.8,16475.05,17252600,{"v":0.039206828216387477,"d":"3.92%"}]
[2,"Index","BANKNIFTY","2022-03-31",34595.75,{"v":34561.666666666664,"d":"34561.67"},{"v":34187.33333333333,"d":"34187.33"},{"v":33778.916666666664,"d":"33778.92"},{"v":33404.58333333333,"d":"33404.58"},{"v":34970.08333333333,"d":"34970.08"},{"v":35344.41666666666,"d":"35344.42"},{"v":35752.83333333333,"d":"35752.83"},34936,34153.25,6256675,{"v":0.08060483853557227,"d":"8.06%"}]
[3,"Index","FINNIFTY","2022-03-29",{"v":16177.8,"d":"16177.80"},{"v":16182.050000000001,"d":"16182.05"},{"v":16023.600000000002,"d":"16023.60"},{"v":15869.400000000001,"d":"15869.40"},{"v":15710.950000000003,"d":"15710.95"},{"v":16336.250000000002,"d":"16336.25"},{"v":16494.700000000004,"d":"16494.70"},{"v":16648.9,"d":"16648.90"},16340.5,16027.85,4840,{"v":0.34444444444444444,"d":"34.44%"}]
[4,"Index","MIDCPNIFTY","2022-03-29",{"v":6900,"d":"6900.00"},{"v":6883.366666666666,"d":"6883.37"},{"v":6866.733333333332,"d":"6866.73"},{"v":6833.466666666666,"d":"6833.47"},{"v":6816.833333333332,"d":"6816.83"},{"v":6916.633333333331,"d":"6916.63"},{"v":6933.266666666665,"d":"6933.27"},{"v":6966.533333333331,"d":"6966.53"},6900,6850.1,2325,{"v":0.2916666666666667,"d":"29.17%"}]
[5,"Chemical","AARTIIND","2022-03-31",849.55,{"v":839.6166666666667,"d":"839.62"},{"v":827.3333333333334,"d":"827.33"},{"v":805.1166666666667,"d":"805.12"},{"v":792.8333333333334,"d":"792.83"},{"v":861.8333333333334,"d":"861.83"},{"v":874.1166666666667,"d":"874.12"},{"v":896.3333333333334,"d":"896.33"},851.9,817.4,2876400,{"v":0.01958421211208195,"d":"1.96%"}]
[6,"Capital_Goods","ABB","2022-03-31",{"v":2129.1,"d":"2129.10"},{"v":2136.9666666666667,"d":"2136.97"},{"v":2103.6833333333334,"d":"2103.68"},{"v":2078.266666666667,"d":"2078.27"},{"v":2044.9833333333336,"d":"2044.98"},{"v":2162.383333333333,"d":"2162.38"},{"v":2195.666666666667,"d":"2195.67"},{"v":2221.083333333333,"d":"2221.08"},2170.25,2111.55,217000,{"v":-0.08823529411764706,"d":"-8.82%"}]
[7,"Pharma","ABBOTINDIA","2022-03-31",{"v":17311.3,"d":"17311.30"},{"v":17386.566666666666,"d":"17386.57"},{"v":17129.73333333333,"d":"17129.73"},{"v":16948.166666666664,"d":"16948.17"},{"v":16691.33333333333,"d":"16691.33"},{"v":17568.13333333333,"d":"17568.13"},{"v":17824.966666666667,"d":"17824.97"},{"v":18006.533333333333,"d":"18006.53"},17643.4,17205,35275,{"v":0.06010518407212622,"d":"6.01%"}]
[8,"Others","ABCAPITAL","2022-03-31",{"v":103.8,"d":"103.80"},{"v":103.94999999999999,"d":"103.95"},{"v":103.04999999999998,"d":"103.05"},{"v":102.3,"d":"102.30"},{"v":101.39999999999999,"d":"101.40"},{"v":104.69999999999997,"d":"104.70"},{"v":105.59999999999998,"d":"105.60"},{"v":106.34999999999997,"d":"106.35"},104.85,103.2,16429600,{"v":6.7403612833647885E-3,"d":"0.67%"}]
[9,"Textile","ABFRL","2022-03-31",280.25,{"v":279.46666666666664,"d":"279.47"},{"v":275.7833333333333,"d":"275.78"},{"v":271.31666666666666,"d":"271.32"},{"v":267.6333333333333,"d":"267.63"},{"v":283.9333333333333,"d":"283.93"},{"v":287.61666666666656,"d":"287.62"},{"v":292.08333333333326,"d":"292.08"},283.15,275,12617800,{"v":0.028177966101694915,"d":"2.82%"}]
[10,"Cement","ACC","2022-03-31",2051.45,{"v":2048.1166666666663,"d":"2048.12"},{"v":2028.3833333333328,"d":"2028.38"},{"v":2005.3166666666664,"d":"2005.32"},{"v":1985.5833333333328,"d":"1985.58"},{"v":2071.1833333333325,"d":"2071.18"},{"v":2090.916666666666,"d":"2090.92"},{"v":2113.9833333333327,"d":"2113.98"},2067.85,2025.05,2335250,{"v":0.006139595002154244,"d":"0.61%"}]
{"$rows_left_out":211}
{"sheet":"Cash Intra","index":2,"n_rows":246,"n_cols":13,"rows_kept":246,"merged":[[7,0,8,0],[7,1,8,1],[7,2,8,2],[7,3,8,3],[7,4,7,6],[7,7,7,9]]}
[]
[]
[]
[]
[{"$nulls":12},"Back to Main Page"]
["FOR INTRA DAY TRADING",{"$nulls":9},{"$f":"Main!B10","v":"2022-03-14"}]
[]
["Sr.no",null,"CLOSE RATE","Pivot Point","Supports",null,null,"Resistances"]
[{"$nulls":4},"S1","S2","S3","R1","R2","R3","HIGH","LOW","Total Trade Quanity in Lakhs"]
[1,"Nifty 50",16630.45,{"v":16598.583333333336,"d":"16598.58"},{"v":16502.76666666667,"d":"16502.77"},{"v":16375.083333333336,"d":"16375.08"},{"v":16279.26666666667,"d":"16279.27"},{"v":16726.26666666667,"d":"16726.27"},{"v":16822.083333333336,"d":"16822.08"},{"v":16949.76666666667,"d":"16949.77"},16694.4,16470.9]
[2,"Nifty Bank",34546.25,{"v":34506.86666666667,"d":"34506.87"},{"v":34133.683333333334,"d":"34133.68"},{"v":33721.11666666667,"d":"33721.12"},{"v":33347.933333333334,"d":"33347.93"},{"v":34919.433333333334,"d":"34919.43"},{"v":35292.61666666667,"d":"35292.62"},{"v":35705.183333333334,"d":"35705.18"},34880.05,34094.3]
[3,"Nifty CPSE",2520.3,{"v":2512,"d":"2512.00"},{"v":2500.4,"d":"2500.40"},{"v":2480.5,"d":"2480.50"},{"v":2468.9,"d":"2468.90"},{"v":2531.9,"d":"2531.90"},{"v":2543.5000000000005,"d":"2543.50"},{"v":2563.4,"d":"2563.40"},2523.6,2492.1]
[4,"Nifty Infra",4797.45,{"v":4782,"d":"4782.00"},{"v":4763.3,"d":"4763.30"},{"v":4729.150000000001,"d":"4729.15"},{"v":4710.450000000001,"d":"4710.45"},4816.15,4834.85,{"v":4868.999999999999,"d":"4869.00"},4800.7,4747.85]
[5,"Nifty IT",35348.7,{"v":35325.049999999996,"d":"35325.05"},{"v":35171.74999999999,"d":"35171.75"},{"v":34994.799999999996,"d":"34994.80"},{"v":34841.49999999999,"d":"34841.50"},{"v":35501.99999999999,"d":"35502.00"},{"v":35655.299999999996,"d":"35655.30"},{"v":35832.24999999999,"d":"35832.25"},35478.35,35148.1]
[6,"Nifty PSE",4093.3,{"v":4076.566666666667,"d":"4076.57"},{"v":4054.1833333333343,"d":"4054.18"},{"v":4015.066666666667,"d":"4015.07"},{"v":3992.6833333333343,"d":"3992.68"},{"v":4115.683333333334,"d":"4115.68"},{"v":4138.066666666667,"d":"4138.07"},{"v":4177.183333333334,"d":"4177.18"},4098.95,4037.45]
[7,"Nifty Midcap 50",7778.25,7744.75,7701.35,{"v":7624.450000000001,"d":"7624.45"},{"v":7581.050000000001,"d":"7581.05"},7821.65,{"v":7865.049999999999,"d":"7865.05"},{"v":7941.949999999999,"d":"7941.95"},7788.15,7667.85]
[8,"ACC",2041.9,{"v":2039.9166666666667,"d":"2039.92"},{"v":2017.9833333333336,"d":"2017.98"},{"v":1994.0666666666668,"d":"1994.07"},{"v":1972.1333333333337,"d":"1972.13"},{"v":2063.8333333333335,"d":"2063.83"},{"v":2085.7666666666664,"d":"2085.77"},{"v":2109.6833333333334,"d":"2109.68"},2061.85,2016,3.7213]
[9,"AUBANK",1193.05,{"v":1178.3666666666668,"d":"1178.37"},{"v":1160.7333333333336,"d":"1160.73"},{"v":1128.4166666666667,"d":"1128.42"},{"v":1110.7833333333335,"d":"1110.78"},{"v":1210.6833333333336,"d":"1210.68"},{"v":1228.3166666666668,"d":"1228.32"},{"v":1260.6333333333337,"d":"1260.63"},1196,1146.05,12.65589]
[10,"AARTIIND",845.2,{"v":837.0666666666666,"d":"837.07"},{"v":826.1333333333332,"d":"826.13"},{"v":807.0666666666666,"d":"807.07"},{"v":796.1333333333332,"d":"796.13"},{"v":856.1333333333332,"d":"856.13"},{"v":867.0666666666666,"d":"867.07"},{"v":886.1333333333332,"d":"886.13"},848,818,9.51265]
[11,"ADANIENT",1734.1,{"v":1737.4333333333334,"d":"1737.43"},{"v":1717.8666666666668,"d":"1717.87"},{"v":1701.6333333333334,"d":"1701.63"},{"v":1682.0666666666668,"d":"1682.07"},{"v":1753.6666666666667,"d":"1753.67"},{"v":1773.2333333333333,"d":"1773.23"},{"v":1789.4666666666667,"d":"1789.47"},1757,1721.2,13.54129]
{"$rows_left_out":227}
{"sheet":"MidCap Intra","index":3,"n_rows":531,"n_cols":13,"rows_kept":531,"merged":[[0,0,0,1],[8,0,9,0],[8,1,9,1],[8,2,9,2],[8,3,9,3],[8,4,8,6],[8,7,8,9]]}
[]
[]
[]
[]
[{"$nulls":11},"Back To Main Page"]
["FOR INTRA DAY TRADING",{"$nulls":9},{"$f":"Main!B10","v":"2022-03-14"}]
[null,null," "]
[]
["Sr.no","Scrip","CLOSE RATE","Pivot Point","Supports",null,null,"Resistances"]
[{"$nulls":4},"S1","S2","S3","R1","R2","R3","HIGH","LOW","Total Trade Quanity in Lakhs"]
[1,"3MINDIA",19897.4,{"v":19958.533333333336,"d":"19958.53"},{"v":19818.91666666667,"d":"19818.92"},{"v":19740.433333333334,"d":"19740.43"},{"v":19600.81666666667,"d":"19600.82"},{"v":20037.016666666674,"d":"20037.02"},{"v":20176.633333333335,"d":"20176.63"},{"v":20255.116666666676,"d":"20255.12"},20098.15,19880.05,0.0539]
[2,"AARTIDRUGS",466.2,{"v":465.93333333333334,"d":"465.93"},{"v":460.4666666666667,"d":"460.47"},{"v":454.73333333333335,"d":"454.73"},{"v":449.2666666666667,"d":"449.27"},{"v":471.6666666666667,"d":"471.67"},{"v":477.13333333333327,"d":"477.13"},{"v":482.8666666666667,"d":"482.87"},471.4,460.2,0.87424]
[3,"AARTIIND",845.2,{"v":837.0666666666666,"d":"837.07"},{"v":826.1333333333332,"d":"826.13"},{"v":807.0666666666666,"d":"807.07"},{"v":796.1333333333332,"d":"796.13"},{"v":856.1333333333332,"d":"856.13"},{"v":867.0666666666666,"d":"867.07"},{"v":886.1333333333332,"d":"886.13"},848,818,9.51265]
[4,"AAVAS",2546.15,{"v":2552.7166666666667,"d":"2552.72"},{"v":2519.4333333333334,"d":"2519.43"},{"v":2492.7166666666667,"d":"2492.72"},{"v":2459.4333333333334,"d":"2459.43"},{"v":2579.4333333333334,"d":"2579.43"},{"v":2612.716666666667,"d":"2612.72"},{"v":2639.4333333333334,"d":"2639.43"},2586,2526,0.94762]
[5,"ABB",2119.95,{"v":2134.9666666666667,"d":"2134.97"},{"v":2094.9833333333336,"d":"2094.98"},{"v":2070.016666666667,"d":"2070.02"},{"v":2030.0333333333338,"d":"2030.03"},{"v":2159.9333333333334,"d":"2159.93"},{"v":2199.916666666666,"d":"2199.92"},{"v":2224.883333333333,"d":"2224.88"},2174.95,2110,0.78426]
[6,"ABBOTINDIA",17268.65,17347.45,{"v":17045.2,"d":"17045.20"},16821.75,{"v":16519.5,"d":"16519.50"},{"v":17570.9,"d":"17570.90"},17873.15,{"v":18096.600000000002,"d":"18096.60"},17649.7,17124,0.25377]
[7,"ABCAPITAL",103.45,{"v":103.63333333333333,"d":"103.63"},{"v":102.81666666666665,"d":"102.82"},{"v":102.18333333333332,"d":"102.18"},{"v":101.36666666666665,"d":"101.37"},{"v":104.26666666666665,"d":"104.27"},{"v":105.08333333333331,"d":"105.08"},{"v":105.71666666666665,"d":"105.72"},104.45,103,20.84612]
[8,"ABFRL",279.35,{"v":276.6666666666667,"d":"276.67"},{"v":271.3833333333334,"d":"271.38"},{"v":263.4166666666667,"d":"263.42"},{"v":258.1333333333334,"d":"258.13"},{"v":284.6333333333334,"d":"284.63"},{"v":289.9166666666667,"d":"289.92"},{"v":297.8833333333334,"d":"297.88"},281.95,268.7,12.20006]
[9,"ACC",2041.9,{"v":2039.9166666666667,"d":"2039.92"},{"v":2017.9833333333336,"d":"2017.98"},{"v":1994.0666666666668,"d":"1994.07"},{"v":1972.1333333333337,"d":"1972.13"},{"v":2063.8333333333335,"d":"2063.83"},{"v":2085.7666666666664,"d":"2085.77"},{"v":2109.6833333333334,"d":"2109.68"},2061.85,2016,3.7213]
[10,"ADANIENT",1734.1,{"v":1737.4333333333334,"d":"1737.43"},{"v":1717.8666666666668,"d":"1717.87"},{"v":1701.6333333333334,"d":"1701.63"},{"v":1682.0666666666668,"d":"1682.07"},{"v":1753.6666666666667,"d":"1753.67"},{"v":1773.2333333333333,"d":"1773.23"},{"v":1789.4666666666667,"d":"1789.47"},1757,1721.2,13.54129]
{"$rows_left_out":512}
{"sheet":"Bulk Deals","index":4,"n_rows":110,"n_cols":8,"rows_kept":110,"merged":[[4,0,4,1],[4,2,4,3],[6,1,6,2]]}
[" "]
[]
[]
[]
[]
[{"$nulls":4},"Back To Main Page"]
["Subject :","BULK DEAL",null,{"$f":"Main!B10","v":"2022-03-14"}]
[]
["Date","Scrip code","Scrip Name","Client Name","Buy / Sell","Quantity Traded","Trade Price / Wt.Avg.trade price","Exchange  "]
["2022-03-11",542579,"AGOL","AFFLUENCE GEMS PRIVATELIMITED","SELL",{"v":184984,"d":"184,984"},72.17,"BSE"]
["2022-03-11",537492,"AGRIMONY","SHRI RUSHABH ASHWIN CHOKSI","BUY",{"v":120000,"d":"120,000"},12.25,"BSE"]
["2022-03-11",537492,"AGRIMONY","SHRI RUSHABH ASHWIN CHOKSI","SELL",{"v":120000,"d":"120,000"},12.32,"BSE"]
["2022-03-11",531752,"BIOGEN","TOPGAIN FINANCE PRIVATE LIMITED","BUY",{"v":177474,"d":"177,474"},1.61,"BSE"]
["2022-03-11",531752,"BIOGEN","TOPGAIN FINANCE PRIVATE LIMITED","SELL",{"v":3700000,"d":"3,700,000"},1.53,"BSE"]
["2022-03-11",539546,"BNL","PUJA BAJORIA","BUY",{"v":50000,"d":"50,000"},7.8,"BSE"]
["2022-03-11",539546,"BNL","SUNITA AGARWAL","SELL",{"v":42123,"d":"42,123"},7.8,"BSE"]
["2022-03-11",539546,"BNL","GITA DEVI SODHANI","SELL",{"v":40000,"d":"40,000"},7.36,"BSE"]
["2022-03-11",526731,"BRIGHTBR","ARCH FINANCE LIMITED","BUY",{"v":32642,"d":"32,642"},162.14,"BSE"]
["2022-03-11",526731,"BRIGHTBR","NISHU FINLEASE PVT. LTD.","SELL",{"v":32520,"d":"32,520"},162.15,"BSE"]
["2022-03-11",540681,"CHOTHANI","SUJIT RAMDEV DAS","SELL",{"v":30000,"d":"30,000"},16.36,"BSE"]
{"$rows_left_out":91}
{"sheet":"Call Tracker (Equity & F&O)","index":5,"n_rows":321,"n_cols":18,"rows_kept":321}
[]
[]
[]
[]
[{"$nulls":12},"Back To Main Page"]
["Retail Research Technical Calls & Fundamental Performance Report for the month of Mar-2022"]
[{"$nulls":12},{"$f":"Main!B10","v":"2022-03-14"}]
[null,"Positional  Call"]
["Sr.no","Date",null,"Company","Rec","Rec Price","Stop Loss***","Call Closed At","Target","Remark","Profit / Loss per Share","All charges","Net Gain / Loss  %","Status","Closed Date","Market Closing Price"]
[1,"2022-01-21",null,"HCLTECH","Buy",1160,1090,{"v":1205,"d":"1,205.00"},"1250-1300","Part profit of Rs.45/-",{"$f":"H10-F10","v":45},{"$f":"(F10*-0.7)/100","v":-8.12},{"$f":"(K10+L10)/F10","v":{"v":0.031793103448275864,"d":"3.18%"}},"Successful","2022-03-11",null,null,"H"]
[2,"2022-01-25",null,"TRENT","Buy",1069,995,{"v":1132.5,"d":"1,132.50"},"1150-1200","Profit of Rs.63.5/-",{"$f":"H11-F11","v":63.5},{"$f":"(F11*-0.7)/100","v":{"v":-7.483,"d":"-7.48"}},{"$f":"(K11+L11)/F11","v":{"v":0.05240130963517306,"d":"5.24%"}},"Successful","2022-03-03",null,null,"H"]
[3,"2022-02-11",null,"CARBORUNIV","Buy",847.5,798,{"v":798,"d":"798.00"},"920-960","Loss of Rs.49.5/-",{"$f":"H12-F12","v":-49.5},{"$f":"(F12*-0.7)/100","v":{"v":-5.9325,"d":"-5.93"}},{"$f":"(K12+L12)/F12","v":{"v":-0.06540707964601769,"d":"-6.54%"}},"Unsuccessful","2022-03-03",null,null,"H"]
[4,"2022-02-28",null,"REDINGTON","Buy",148,138,{"v":156,"d":"156.00"},"160-170","Profit of Rs.8/-",{"$f":"H13-F13","v":8},{"$f":"(F13*-0.4)/100","v":{"v":-0.5920000000000001,"d":"-0.59"}},{"$f":"(K13+L13)/F13","v":{"v":0.050054054054054054,"d":"5.01%"}},"Successful","2022-03-03",null,null,"H"]
[5,"2022-02-28",null,"HDFC","Buy",2360,2230,{"v":2230,"d":"2,230.00"},"2500-2600","Loss of Rs.130/-",-130,{"$f":"(F14*-0.7)/100","v":-16.52},{"v":-0.06208474576271187,"d":"-6.21%"},"Unsuccessful","2022-03-04",null,null,"H"]
[6,"2022-02-28",null,"ICICIBANK","Buy",715,675,{"$f":"(675+738.5)/2","v":706.75},"750-780","Loss of Rs.8.25/-",{"$f":"H15-F15","v":-8.25},{"$f":"(F15*-0.4)/100","v":-2.86},{"$f":"(K15+L15)/F15","v":{"v":-0.015538461538461537,"d":"-1.55%"}},"Unsuccessful","2022-03-08",null,null,"H"]
[7,"2022-02-28",null,"AARTIIND","Buy",925,860,{"v":860,"d":"860.00"},"1000-1050","Loss of Rs.65/-",-65,{"$f":"(F16*-0.7)/100","v":{"v":-6.475,"d":"-6.48"}},{"v":-0.07727027027027027,"d":"-7.73%"},"Unsuccessful","2022-03-04",null,null,"H"]
[8,"2022-03-02",null,"BHARTIARTL","Buy",669,618,{"v":696,"d":"696.00"},"740-780","Part profit of Rs.27/-",27,{"$f":"(F17*-0.7)/100","v":{"v":-4.683,"d":"-4.68"}},{"v":0.03335874439461883,"d":"3.34%"},"Successful","2022-03-09",{"$f":"VLOOKUP(D17,'MidCap Intra'!B13:C568,2,0)","v":694.85},null,"H"]
[9,"2022-03-03",null,"ACC","Buy","1990-2005",1870,null,"2150-2250","Open",{"$nulls":5},{"$f":"VLOOKUP(D18,'MidCap Intra'!B14:C569,2,0)","v":2041.9},null,"H"]
[10,"2022-03-07",null,"TRENT","Buy",1070,990,{"v":1132.5,"d":"1,132.50"},"1140-1200","Profit of Rs.62.5/-",{"$f":"H19-F19","v":62.5},{"$f":"(F19*-0.7)/100","v":-7.49},{"$f":"(K19+L19)/F19","v":{"v":0.05141121495327103,"d":"5.14%"}},"Successful","2022-03-09",null,null,"H"]
[11,"2022-03-07",null,"REDINGTON","Buy",146.5,135,{"v":153.5,"d":"153.50"},"160-170","Part profit of Rs.7/-",7,{"$f":"(F20*-0.7)/100","v":{"v":-1.0255,"d":"-1.03"}},{"v":0.040781569965870304,"d":"4.08%"},"Successful","2022-03-10",{"$f":"VLOOKUP(D20,'MidCap Intra'!B16:C571,2,0)","v":149},null,"H"]
{"$rows_left_out":284}