{"text_format":"3","workbook":"xlsx","n_sheets":6,"sheets":["Main","Future Intra","Cash Intra","MidCap Intra","Bulk Deals","Call Tracker (Equity & F&O)"],"not_rendered":{"images":2,"defined_names":2},"read":"whole","date_system":"1900"}

{"sheet":"Main","index":0,"n_rows":27,"n_cols":11,"rows_kept":27}
[null,"                                                                                                 "]
{"$rows_empty":8}
[null,"2022-02-11"]
[]
[null,"Sheet No.","Template Name","Summary"]
[null,1,"Future Intra","For Intraday trading in F&O segment"]
[null,2,"Cash Intra","For Intraday trading in cash market segment"]
[null,3,"Mid-cap Intra","For Intraday trading in Mid-cap stocks"]
[null,4,"Bulk Deals","Reveals Bulk Deals carried on NSE & BSE"]
[null,5,"Call Tracker"]
{"$rows_empty":9}
[{"$nulls":10},"`"]

{"sheet":"Future Intra","index":1,"n_rows":240,"n_cols":16,"rows_kept":240,"merged":[[8,0,9,0],[8,1,9,1],[8,2,9,2],[8,3,9,3],[8,6,8,8],[8,9,8,11]]}
[]
[]
[]
[]
[{"$nulls":12},"Back to Main Page"]
["FOR INTRA DAY TRADING",{"$nulls":10},{"$f":"Main!B10","v":"2022-02-11"}]
[]
[]
["Sr.no","Sector","Scrip","Expiry Date","CLOSE RATE","Pivot Point","Supports",null,null,"Resistances"]
[{"$nulls":4},"Point","Point","S1","S2","S3","R1","R2","R3","HIGH","LOW","OI","% Change in OI"]
[1,"Index","NIFTY","2022-02-24",17617.65,{"v":17569.383333333335,"d":"17569.38"},{"v":17488.76666666667,"d":"17488.77"},{"v":17359.883333333335,"d":"17359.88"},{"v":17279.26666666667,"d":"17279.27"},{"v":17698.26666666667,"d":"17698.27"},{"v":17778.88333333333,"d":"17778.88"},{"v":17907.76666666667,"d":"17907.77"},17650,17440.5,10844450,{"v":-2.8091954022988505E-3,"d":"-0.28%"}]
[2,"Index","BANKNIFTY","2022-02-24",{"v":39054,"d":"39054.00"},38966.95,{"v":38678.99999999999,"d":"38679.00"},{"v":38303.99999999999,"d":"38304.00"},{"v":38016.04999999999,"d":"38016.05"},39341.95,{"v":39629.90000000001,"d":"39629.90"},{"v":40004.9,"d":"40004.90"},39254.9,38591.95,2145800,{"v":0.0331371345345996,"d":"3.31%"}]
[3,"Index","FINNIFTY","2022-02-22",18116.85,{"v":18079.016666666666,"d":"18079.02"},{"v":17918.033333333333,"d":"17918.03"},{"v":17719.216666666667,"d":"17719.22"},{"v":17558.233333333334,"d":"17558.23"},{"v":18277.833333333332,"d":"18277.83"},{"v":18438.816666666662,"d":"18438.82"},{"v":18637.63333333333,"d":"18637.63"},18240,17880.2,2800,{"v":0.20689655172413793,"d":"20.69%"}]
[4,"Index","MIDCPNIFTY","2022-02-28",7761.55,{"v":7697.616666666666,"d":"7697.62"},{"v":7633.683333333332,"d":"7633.68"},{"v":7505.816666666666,"d":"7505.82"},{"v":7441.883333333331,"d":"7441.88"},{"v":7825.483333333332,"d":"7825.48"},{"v":7889.416666666666,"d":"7889.42"},{"v":8017.283333333332,"d":"8017.28"},7761.55,7569.75,3075,{"v":0.24242424242424243,"d":"24.24%"}]
[5,"Chemical","AARTIIND","2022-02-28",1021.05,{"v":1018.4166666666666,"d":"1018.42"},{"v":1011.0833333333333,"d":"1011.08"},{"v":1001.1166666666667,"d":"1001.12"},{"v":993.7833333333333,"d":"993.78"},{"v":1028.3833333333332,"d":"1028.38"},{"v":1035.7166666666665,"d":"1035.72"},{"v":1045.6833333333332,"d":"1045.68"},1025.75,1008.45,2955450,{"v":-0.06532258064516129,"d":"-6.53%"}]
[6,"Pharma","ABBOTINDIA","2022-02-24",{"v":16653.8,"d":"16653.80"},{"v":16584.86666666667,"d":"16584.87"},{"v":16319.733333333337,"d":"16319.73"},{"v":15985.666666666668,"d":"15985.67"},{"v":15720.533333333336,"d":"15720.53"},{"v":16918.933333333338,"d":"16918.93"},{"v":17184.06666666667,"d":"17184.07"},{"v":17518.13333333334,"d":"17518.13"},16850,16250.8,76425,{"v":-0.05297397769516728,"d":"-5.30%"}]
[7,"Others","ABCAPITAL","2022-02-24",{"v":121,"d":"121.00"},{"v":120.66666666666667,"d":"120.67"},{"v":118.93333333333334,"d":"118.93"},{"v":116.86666666666666,"d":"116.87"},{"v":115.13333333333333,"d":"115.13"},{"v":122.73333333333335,"d":"122.73"},{"v":124.46666666666667,"d":"124.47"},{"v":126.53333333333336,"d":"126.53"},122.4,118.6,17604400,{"v":0.014709611970580776,"d":"1.47%"}]
[8,"Textile","ABFRL","2022-02-24",{"v":296.7,"d":"296.70"},{"v":297.73333333333335,"d":"297.73"},{"v":293.4666666666667,"d":"293.47"},{"v":290.23333333333335,"d":"290.23"},{"v":285.9666666666667,"d":"285.97"},{"v":300.9666666666667,"d":"300.97"},{"v":305.23333333333335,"d":"305.23"},{"v":308.4666666666667,"d":"308.47"},302,294.5,14463800,{"v":-0.022319859402460458,"d":"-2.23%"}]
[9,"Cement","ACC","2022-02-24",2305.35,{"v":2299.1666666666665,"d":"2299.17"},{"v":2272.333333333333,"d":"2272.33"},{"v":2239.3166666666666,"d":"2239.32"},{"v":2212.483333333333,"d":"2212.48"},{"v":2332.183333333333,"d":"2332.18"},{"v":2359.016666666666,"d":"2359.02"},{"v":2392.033333333333,"d":"2392.03"},2326,2266.15,2278250,{"v":-0.13118505100581562,"d":"-13.12%"}]
[10,"Others","ADANIENT","2022-02-24",1790.55,{"v":1791.2,"d":"1791.20"},{"v":1770.4,"d":"1770.40"},1750.25,1729.45,{"v":1811.3500000000001,"d":"1811.35"},{"v":1832.1499999999999,"d":"1832.15"},{"v":1852.3000000000002,"d":"1852.30"},1812,1771.05,21487500,{"v":0.014278970970025963,"d":"1.43%"}]
{"$rows_left_out":209}
{"sheet":"Cash Intra","index":2,"n_rows":246,"n_cols":13,"rows_kept":246,"merged":[[7,0,8,0],[7,1,8,1],[7,2,8,2],[7,3,8,3],[7,4,7,6],[7,7,7,9]]}
[]
[]
[]
[]
[{"$nulls":12},"Back to Main Page"]
["FOR INTRA DAY TRADING",{"$nulls":9},{"$f":"Main!B10","v":"2022-02-11"}]
[]
["Sr.no",null,"CLOSE RATE","Pivot Point","Supports",null,null,"Resistances"]
[{"$nulls":4},"S1","S2","S3","R1","R2","R3","HIGH","LOW","Total Trade Quanity in Lakhs"]
[1,"Nifty 50",17605.85,{"v":17557.483333333334,"d":"17557.48"},{"v":17475.516666666666,"d":"17475.52"},{"v":17345.183333333334,"d":"17345.18"},{"v":17263.216666666667,"d":"17263.22"},{"v":17687.816666666666,"d":"17687.82"},{"v":17769.783333333333,"d":"17769.78"},{"v":17900.116666666665,"d":"17900.12"},17639.45,17427.15]
[2,"Nifty Bank",39010.95,{"v":38909.38333333333,"d":"38909.38"},{"v":38621.566666666666,"d":"38621.57"},{"v":38232.183333333334,"d":"38232.18"},{"v":37944.36666666667,"d":"37944.37"},{"v":39298.76666666666,"d":"39298.77"},{"v":39586.58333333333,"d":"39586.58"},{"v":39975.96666666666,"d":"39975.97"},39197.2,38520]
[3,"Nifty CPSE",2484.6,{"v":2479.3,"d":"2479.30"},{"v":2467.6000000000004,"d":"2467.60"},{"v":2450.6000000000004,"d":"2450.60"},{"v":2438.9000000000005,"d":"2438.90"},{"v":2496.3,"d":"2496.30"},{"v":2508,"d":"2508.00"},{"v":2525,"d":"2525.00"},2491,2462.3]
[4,"Nifty Infra",5048.75,{"v":5039.650000000001,"d":"5039.65"},{"v":5021.100000000001,"d":"5021.10"},{"v":4993.450000000001,"d":"4993.45"},{"v":4974.9000000000015,"d":"4974.90"},{"v":5067.300000000001,"d":"5067.30"},5085.85,{"v":5113.500000000001,"d":"5113.50"},5058.2,5012]
[5,"Nifty IT",35341.85,{"v":35238.816666666666,"d":"35238.82"},{"v":35097.78333333333,"d":"35097.78"},{"v":34853.71666666667,"d":"34853.72"},{"v":34712.683333333334,"d":"34712.68"},{"v":35482.88333333333,"d":"35482.88"},{"v":35623.91666666666,"d":"35623.92"},{"v":35867.98333333333,"d":"35867.98"},35379.85,34994.75]
[6,"Nifty PSE",4102.05,4098.95,{"v":4083.5999999999995,"d":"4083.60"},{"v":4065.1499999999996,"d":"4065.15"},{"v":4049.7999999999993,"d":"4049.80"},{"v":4117.4,"d":"4117.40"},4132.75,{"v":4151.2,"d":"4151.20"},4114.3,4080.5]
[7,"Nifty Midcap 50",8392.85,{"v":8379.666666666666,"d":"8379.67"},{"v":8336.533333333333,"d":"8336.53"},{"v":8280.216666666667,"d":"8280.22"},{"v":8237.083333333334,"d":"8237.08"},{"v":8435.983333333332,"d":"8435.98"},{"v":8479.116666666667,"d":"8479.12"},{"v":8535.43333333333,"d":"8535.43"},8422.8,8323.35]
[8,"ACC",2303.55,{"v":2297.7833333333333,"d":"2297.78"},{"v":2270.7666666666664,"d":"2270.77"},{"v":2237.983333333333,"d":"2237.98"},{"v":2210.9666666666662,"d":"2210.97"},{"v":2330.5666666666666,"d":"2330.57"},{"v":2357.583333333334,"d":"2357.58"},{"v":2390.366666666667,"d":"2390.37"},2324.8,2265,8.76424]
[9,"AUBANK",1377.95,{"v":1372.9333333333334,"d":"1372.93"},{"v":1362.0166666666669,"d":"1362.02"},{"v":1346.0833333333335,"d":"1346.08"},{"v":1335.166666666667,"d":"1335.17"},{"v":1388.8666666666668,"d":"1388.87"},{"v":1399.7833333333333,"d":"1399.78"},{"v":1415.7166666666667,"d":"1415.72"},1383.85,1357,7.54309]
[10,"AARTIIND",1022.2,{"v":1019.5666666666666,"d":"1019.57"},{"v":1012.1333333333332,"d":"1012.13"},{"v":1002.0666666666666,"d":"1002.07"},{"v":994.6333333333332,"d":"994.63"},{"v":1029.6333333333332,"d":"1029.63"},{"v":1037.0666666666666,"d":"1037.07"},{"v":1047.1333333333332,"d":"1047.13"},1027,1009.5,7.00879]
[11,"ADANIENT",1786.1,{"v":1787.0333333333335,"d":"1787.03"},{"v":1765.066666666667,"d":"1765.07"},{"v":1744.0333333333335,"d":"1744.03"},{"v":1722.066666666667,"d":"1722.07"},{"v":1808.066666666667,"d":"1808.07"},{"v":1830.0333333333338,"d":"1830.03"},{"v":1851.066666666667,"d":"1851.07"},1809,1766,17.47943]
{"$rows_left_out":227}
{"sheet":"MidCap Intra","index":3,"n_rows":533,"n_cols":13,"rows_kept":533,"merged":[[0,0,0,1],[8,0,9,0],[8,1,9,1],[8,2,9,2],[8,3,9,3],[8,4,8,6],[8,7,8,9]]}
[]
[]
[]
[]
[{"$nulls":11},"Back To Main Page"]
["FOR INTRA DAY TRADING",{"$nulls":9},{"$f":"Main!B10","v":"2022-02-11"}]
[null,null," "]
[]
["Sr.no","Scrip","CLOSE RATE","Pivot Point","Supports",null,null,"Resistances"]
[{"$nulls":4},"S1","S2","S3","R1","R2","R3","HIGH","LOW","Total Trade Quanity in Lakhs"]
[1,"3MINDIA",23767.95,{"v":23923.849999999995,"d":"23923.85"},{"v":23500.69999999999,"d":"23500.70"},{"v":23233.449999999993,"d":"23233.45"},{"v":22810.29999999999,"d":"22810.30"},{"v":24191.09999999999,"d":"24191.10"},{"v":24614.249999999993,"d":"24614.25"},{"v":24881.499999999993,"d":"24881.50"},24347,23656.6,0.02447]
[2,"AARTIDRUGS",525.15,{"v":525.5,"d":"525.50"},522.05,{"v":518.9499999999999,"d":"518.95"},{"v":515.4999999999999,"d":"515.50"},{"v":528.6,"d":"528.60"},{"v":532.0500000000001,"d":"532.05"},{"v":535.1500000000001,"d":"535.15"},528.95,522.4,0.93492]
[3,"AARTIIND",1022.2,{"v":1019.5666666666666,"d":"1019.57"},{"v":1012.1333333333332,"d":"1012.13"},{"v":1002.0666666666666,"d":"1002.07"},{"v":994.6333333333332,"d":"994.63"},{"v":1029.6333333333332,"d":"1029.63"},{"v":1037.0666666666666,"d":"1037.07"},{"v":1047.1333333333332,"d":"1047.13"},1027,1009.5,7.00879]
[4,"AAVAS",3099,{"v":3074.566666666667,"d":"3074.57"},{"v":3009.4333333333343,"d":"3009.43"},{"v":2919.8666666666672,"d":"2919.87"},{"v":2854.7333333333345,"d":"2854.73"},{"v":3164.133333333334,"d":"3164.13"},{"v":3229.2666666666664,"d":"3229.27"},{"v":3318.833333333334,"d":"3318.83"},3139.7,2985,2.68592]
[5,"ABB",2238,{"v":2256.2999999999997,"d":"2256.30"},{"v":2192.6999999999994,"d":"2192.70"},{"v":2147.3999999999996,"d":"2147.40"},{"v":2083.7999999999993,"d":"2083.80"},{"v":2301.5999999999995,"d":"2301.60"},{"v":2365.2,"d":"2365.20"},{"v":2410.4999999999995,"d":"2410.50"},2319.9,2211,3.69714]
[6,"ABBOTINDIA",16615,{"v":16576.683333333334,"d":"16576.68"},{"v":16253.366666666669,"d":"16253.37"},{"v":15891.733333333334,"d":"15891.73"},{"v":15568.416666666668,"d":"15568.42"},{"v":16938.31666666667,"d":"16938.32"},{"v":17261.633333333335,"d":"17261.63"},{"v":17623.26666666667,"d":"17623.27"},16900,16215.05,0.72856]
[7,"ABCAPITAL",120.45,{"v":120.2,"d":"120.20"},{"v":118.55000000000001,"d":"118.55"},116.65,{"v":115.00000000000001,"d":"115.00"},{"v":122.10000000000001,"d":"122.10"},{"v":123.75000000000001,"d":"123.75"},125.65,121.85,118.3,30.37306]
[8,"ABFRL",295.6,{"v":296.8666666666667,"d":"296.87"},{"v":292.33333333333337,"d":"292.33"},{"v":289.0666666666667,"d":"289.07"},{"v":284.5333333333334,"d":"284.53"},{"v":300.1333333333333,"d":"300.13"},{"v":304.66666666666663,"d":"304.67"},{"v":307.9333333333333,"d":"307.93"},301.4,293.6,25.14519]
[9,"ACC",2303.55,{"v":2297.7833333333333,"d":"2297.78"},{"v":2270.7666666666664,"d":"2270.77"},{"v":2237.983333333333,"d":"2237.98"},{"v":2210.9666666666662,"d":"2210.97"},{"v":2330.5666666666666,"d":"2330.57"},{"v":2357.583333333334,"d":"2357.58"},{"v":2390.366666666667,"d":"2390.37"},2324.8,2265,8.76424]
[10,"ADANIENT",1786.1,{"v":1787.0333333333335,"d":"1787.03"},{"v":1765.066666666667,"d":"1765.07"},{"v":1744.0333333333335,"d":"1744.03"},{"v":1722.066666666667,"d":"1722.07"},{"v":1808.066666666667,"d":"1808.07"},{"v":1830.0333333333338,"d":"1830.03"},{"v":1851.066666666667,"d":"1851.07"},1809,1766,17.47943]
{"$rows_left_out":508}
{"sheet":"Bulk Deals","index":4,"n_rows":117,"n_cols":8,"rows_kept":117,"merged":[[4,0,4,1],[4,2,4,3],[6,1,6,2]]}
[" "]
[]
[]
[]
[]
[{"$nulls":4},"Back To Main Page"]
["Subject :","BULK DEAL",null,{"$f":"Main!B10","v":"2022-02-11"}]
[]
["Date","Scrip code","Scrip Name","Client Name","Buy / Sell","Quantity Traded","Trade Price / Wt.Avg.trade price","Exchange  "]
["2022-02-10",539621,"BCLENTERPR","SANDHYA SINGH GAHLOUT","BUY",{"v":30000,"d":"30,000"},55.5,"BSE"]
["2022-02-10",539621,"BCLENTERPR","SANDHIL CONSULTANCY SERVICES PRIVATE LIMITED .","SELL",{"v":32500,"d":"32,500"},61.3,"BSE"]
["2022-02-10",543209,"BILLWIN","ZYANA STOCKS AND COMMODITIES","BUY",{"v":21000,"d":"21,000"},29.26,"BSE"]
["2022-02-10",543209,"BILLWIN","SHERWOOD SECURITIES PVT LTD","BUY",{"v":3000,"d":"3,000"},27.25,"BSE"]
["2022-02-10",543209,"BILLWIN","SHERWOOD SECURITIES PVT LTD","SELL",{"v":12000,"d":"12,000"},28.68,"BSE"]
["2022-02-10",543172,"COSPOWER","JAGADEESHATUKURI","BUY",{"v":8000,"d":"8,000"},56,"BSE"]
["2022-02-10",539405,"DITCO","SANTOSH JINDAL","SELL",{"v":20000,"d":"20,000"},19.4,"BSE"]
["2022-02-10",539405,"DITCO","SAN FINANCIAL SERVICES LLP","SELL",{"v":20000,"d":"20,000"},19.4,"BSE"]
["2022-02-10",539405,"DITCO","MANISHA VIVEK MEHTA","BUY",{"v":34403,"d":"34,403"},19.4,"BSE"]
["2022-02-10",523277,"GVFILM","R SATHIAMURTHI","BUY",{"v":15600754,"d":"15,600,754"},1.25,"BSE"]
["2022-02-10",523277,"GVFILM","ALPHA LEON ENTERPRISES LLP","SELL",{"v":6500000,"d":"6,500,000"},1.23,"BSE"]
{"$rows_left_out":98}
{"sheet":"Call Tracker (Equity & F&O)","index":5,"n_rows":283,"n_cols":18,"rows_kept":283,"merged":[[55,0,56,0],[55,1,56,1],[55,9,56,9],[55,12,56,12],[55,13,56,13],[55,14,56,14],[55,15,56,15],[69,0,70,0],[69,1,70,1],[69,9,70,9],[69,12,70,12],[69,13,70,13],[69,14,70,14],[69,15,70,15],[74,0,75,0],[74,1,75,1],[74,9,75,9],[74,12,75,12],[74,13,75,13],[74,14,75,14],[74,15,75,15]]}
[]
[]
[]
[]
[{"$nulls":12},"Back To Main Page"]
["Retail Research Technical Calls & Fundamental Performance Report for the month of Feb-2022"]
[{"$nulls":12},{"$f":"Main!B10","v":"2022-02-11"}]
[null,"Positional  Call"]
["Sr.no","Date",null,"Company","Rec","Rec Price","Stop Loss***","Call Closed At","Target","Remark","Profit / Loss per Share","All charges","Net Gain / Loss  %","Status","Closed Date","Market Closing Price"]
[1,"2022-01-21",null,"HCLTECH","Buy","1150-1170",1090,null,"1250-1300","Open",{"$nulls":5},{"$f":"VLOOKUP(D10,'MidCap Intra'!B55:C548,2,0)","v":1190.35},null,"H"]
[2,"2022-01-21",null,"TCS","Buy","3770-3780",3590,null,"4000-4100","Open",{"$nulls":5},{"$f":"VLOOKUP(D11,'MidCap Intra'!B56:C549,2,0)","v":3770.35},null,"H"]
[3,"2022-01-25",null,"TATACOMM","Buy",1255,1190,{"v":1327.5,"d":"1,327.50"},"1350-1400","Profit of Rs.72.5/-",{"$f":"H12-F12","v":72.5},{"$f":"(F12*-0.7)/100","v":{"v":-8.785,"d":"-8.79"}},{"$f":"(K12+L12)/F12","v":{"v":0.05076892430278885,"d":"5.08%"}},"Successful","2022-02-03",null,null,"H"]
[4,"2022-01-25",null,"HDFC","Buy",2500,2340,{"v":2595,"d":"2,595.00"},"2700-2800","Profit of Rs.95/-",{"$f":"H13-F13","v":95},{"$f":"(F13*-0.7)/100","v":{"v":-17.5,"d":"-17.50"}},{"$f":"(K13+L13)/F13","v":{"v":0.031,"d":"3.10%"}},"Successful","2022-02-01",null,null,"H"]
[5,"2022-01-25",null,"CARBORUNIV","Buy",855,815,{"v":905,"d":"905.00"},"900-930","Profit of Rs.50/-",{"$f":"H14-F14","v":50},{"$f":"(F14*-0.7)/100","v":{"v":-5.985,"d":"-5.99"}},{"$f":"(K14+L14)/F14","v":{"v":0.05147953216374269,"d":"5.15%"}},"Successful","2022-02-04",null,null,"H"]
[6,"2022-01-25",null,"TRENT","Buy","1060-1080",995,null,"1150-1200","Open",{"$nulls":5},{"$f":"VLOOKUP(D15,'MidCap Intra'!B62:C555,2,0)","v":1075.6},null,"H"]
[7,"2022-01-27",null,"SRF","Buy",2360,2200,{"v":2505,"d":"2,505.00"},"2550-2650","Profit of Rs.145/-",{"$f":"H16-F16","v":145},{"$f":"(F16*-0.7)/100","v":-16.52},{"$f":"(K16+L16)/F16","v":{"v":0.05444067796610169,"d":"5.44%"}},"Successful","2022-02-07",null,null,"N"]
[8,"2022-01-28",null,"INDIGO","Buy",1860,1695,{"v":1900,"d":"1,900.00"},"2050-2150","Profit of Rs.40/-",40,-13.02,{"v":0.014505376344086022,"d":"1.45%"},"Successful","2022-02-01",null,null,"H"]
[9,"2022-02-03",null,"APOLLOTYRE","Buy","222-225",210,null,"240-250","Open",{"$nulls":5},{"$f":"VLOOKUP(D18,'MidCap Intra'!B1:C558,2,0)","v":226.65},null,"N"]
[10,"2022-02-07",null,"SUMICHEM","Buy","410-415",387,null,"440-460","Open",{"$nulls":5},{"$f":"VLOOKUP(D19,'MidCap Intra'!B2:C559,2,0)","v":410.7},null,"H"]
[11,"2022-02-09",null,"REDINGTON","Buy",162.5,149,{"v":177,"d":"177.00"},"180-190","Profit of Rs.14.5/-",{"$f":"H20-F20","v":14.5},{"$f":"(F20*-0.7)/100","v":{"v":-1.1375,"d":"-1.14"}},{"$f":"(K20+L20)/F20","v":{"v":0.08223076923076923,"d":"8.22%"}},"Successful","2022-02-10",null,null,"H"]
{"$rows_left_out":252}