{"text_format":"3","workbook":"xlsx","n_sheets":6,"sheets":["Main","Future Intra","Cash Intra","MidCap Intra","Bulk Deals","Call Tracker (Equity & F&O)"],"not_rendered":{"images":4,"defined_names":2},"read":"whole","date_system":"1900"}

{"sheet":"Main","index":0,"n_rows":27,"n_cols":11,"rows_kept":27}
[null,"                                                                                                 "]
{"$rows_empty":8}
[null,"2021-10-08"]
[]
[null,"Sheet No.","Template Name","Summary"]
[null,1,"Future Intra","For Intraday trading in F&O segment"]
[null,2,"Cash Intra","For Intraday trading in cash market segment"]
[null,3,"Mid-cap Intra","For Intraday trading in Mid-cap stocks"]
[null,4,"Bulk Deals","Reveals Bulk Deals carried on NSE & BSE"]
[null,5,"Call Tracker"]
{"$rows_empty":9}
[{"$nulls":10},"`"]

{"sheet":"Future Intra","index":1,"n_rows":218,"n_cols":16,"rows_kept":218,"merged":[[8,0,9,0],[8,1,9,1],[8,2,9,2],[8,3,9,3],[8,6,8,8],[8,9,8,11]]}
[]
[]
[]
[]
[{"$nulls":12},"Back to Main Page"]
["FOR INTRA DAY TRADING",{"$nulls":10},{"$f":"Main!B10","v":"2021-10-08"}]
[]
[]
["Sr.no","Sector","Scrip","Expiry Date","CLOSE RATE","Pivot Point","Supports",null,null,"Resistances"]
[{"$nulls":4},"Point","Point","S1","S2","S3","R1","R2","R3","HIGH","LOW","OI","% Change in OI"]
[1,"Index","BANKNIFTY","2021-10-28",{"v":37886.3,"d":"37886.30"},{"v":37901.43333333334,"d":"37901.43"},{"v":37752.96666666668,"d":"37752.97"},{"v":37619.63333333334,"d":"37619.63"},{"v":37471.16666666668,"d":"37471.17"},{"v":38034.766666666685,"d":"38034.77"},{"v":38183.233333333344,"d":"38183.23"},{"v":38316.56666666669,"d":"38316.57"},38049.9,37768.1,1840300,{"v":-0.0877975637260369,"d":"-8.78%"}]
[2,"Index","NIFTY","2021-10-28",17808.15,{"v":17815.100000000002,"d":"17815.10"},{"v":17746.200000000004,"d":"17746.20"},{"v":17684.250000000004,"d":"17684.25"},{"v":17615.350000000006,"d":"17615.35"},{"v":17877.050000000003,"d":"17877.05"},{"v":17945.950000000004,"d":"17945.95"},{"v":18007.9,"d":"18007.90"},17884,17753.15,13115850,{"v":-0.038088916920910584,"d":"-3.81%"}]
[3,"Index","FINNIFTY","2021-10-28",{"v":18381,"d":"18381.00"},{"v":18413.149999999998,"d":"18413.15"},{"v":18334.849999999995,"d":"18334.85"},{"v":18288.699999999997,"d":"18288.70"},{"v":18210.399999999994,"d":"18210.40"},{"v":18459.299999999996,"d":"18459.30"},{"v":18537.6,"d":"18537.60"},{"v":18583.749999999996,"d":"18583.75"},18491.45,18367,2160,{"v":-0.03571428571428571,"d":"-3.57%"}]
[4,"Chemical","AARTIIND","2021-10-28",1085.35,{"v":1091.7333333333333,"d":"1091.73"},{"v":1063.4666666666667,"d":"1063.47"},{"v":1041.5833333333333,"d":"1041.58"},{"v":1013.3166666666666,"d":"1013.32"},{"v":1113.6166666666668,"d":"1113.62"},{"v":1141.8833333333337,"d":"1141.88"},{"v":1163.7666666666669,"d":"1163.77"},1120,1069.85,3189200,{"v":0.006977992485238862,"d":"0.70%"}]
[5,"Pharma","ABBOTINDIA","2021-10-28",{"v":21809.9,"d":"21809.90"},{"v":22115.533333333336,"d":"22115.53"},{"v":21420.41666666667,"d":"21420.42"},{"v":21030.933333333334,"d":"21030.93"},{"v":20335.81666666667,"d":"20335.82"},{"v":22505.016666666674,"d":"22505.02"},{"v":23200.133333333335,"d":"23200.13"},{"v":23589.616666666676,"d":"23589.62"},22810.65,21726.05,29150,{"v":0.05045045045045045,"d":"5.05%"}]
[6,"Textile","ABFRL","2021-10-28",260.15,255.65,{"v":248.5,"d":"248.50"},236.85,{"v":229.7,"d":"229.70"},{"v":267.3,"d":"267.30"},{"v":274.45000000000005,"d":"274.45"},{"v":286.1,"d":"286.10"},262.8,244,9851400,{"v":0.032706459525756335,"d":"3.27%"}]
[7,"Cement","ACC","2021-10-28",{"v":2271.2,"d":"2271.20"},{"v":2257.766666666667,"d":"2257.77"},{"v":2233.4833333333336,"d":"2233.48"},{"v":2195.766666666667,"d":"2195.77"},{"v":2171.4833333333336,"d":"2171.48"},{"v":2295.4833333333336,"d":"2295.48"},{"v":2319.7666666666673,"d":"2319.77"},{"v":2357.4833333333336,"d":"2357.48"},2282.05,2220.05,2938000,{"v":-0.04393101204035145,"d":"-4.39%"}]
[8,"Others","ADANIENT","2021-10-28",{"v":1528.3,"d":"1528.30"},{"v":1522.3500000000001,"d":"1522.35"},{"v":1500.9500000000003,"d":"1500.95"},{"v":1473.6000000000001,"d":"1473.60"},{"v":1452.2000000000003,"d":"1452.20"},{"v":1549.7000000000003,"d":"1549.70"},{"v":1571.1000000000004,"d":"1571.10"},{"v":1598.4500000000003,"d":"1598.45"},1543.75,1495,25632000,{"v":-0.004543865781195386,"d":"-0.45%"}]
[9,"Others","ADANIPORTS","2021-10-28",737.65,{"v":730.6166666666667,"d":"730.62"},{"v":719.2833333333333,"d":"719.28"},{"v":700.9166666666666,"d":"700.92"},{"v":689.5833333333333,"d":"689.58"},{"v":748.9833333333333,"d":"748.98"},{"v":760.3166666666666,"d":"760.32"},{"v":778.6833333333334,"d":"778.68"},741.95,712.25,90098750,{"v":-0.006272920285659139,"d":"-0.63%"}]
[10,"Pharma","ALKEM","2021-10-28",{"v":3928.8,"d":"3928.80"},{"v":3949.2666666666664,"d":"3949.27"},{"v":3887.533333333333,"d":"3887.53"},{"v":3846.2666666666664,"d":"3846.27"},{"v":3784.533333333333,"d":"3784.53"},{"v":3990.533333333333,"d":"3990.53"},{"v":4052.2666666666664,"d":"4052.27"},{"v":4093.533333333333,"d":"4093.53"},4011,3908,476400,{"v":0.11569086651053864,"d":"11.57%"}]
{"$rows_left_out":191}
{"sheet":"Cash Intra","index":2,"n_rows":246,"n_cols":13,"rows_kept":246,"merged":[[7,0,8,0],[7,1,8,1],[7,2,8,2],[7,3,8,3],[7,4,7,6],[7,7,7,9]]}
[]
[]
[]
[]
[{"$nulls":12},"Back to Main Page"]
["FOR INTRA DAY TRADING",{"$nulls":9},{"$f":"Main!B10","v":"2021-10-08"}]
[]
["Sr.no",null,"CLOSE RATE","Pivot Point","Supports",null,null,"Resistances"]
[{"$nulls":4},"S1","S2","S3","R1","R2","R3","HIGH","LOW","Total Trade Quanity in Lakhs"]
[1,"Nifty 50",17790.35,{"v":17803.899999999998,"d":"17803.90"},{"v":17750.249999999996,"d":"17750.25"},{"v":17710.149999999998,"d":"17710.15"},{"v":17656.499999999996,"d":"17656.50"},{"v":17843.999999999996,"d":"17844.00"},{"v":17897.649999999998,"d":"17897.65"},{"v":17937.749999999996,"d":"17937.75"},17857.55,17763.8]
[2,"Nifty Bank",37753.2,{"v":37775.700000000004,"d":"37775.70"},{"v":37627.75000000001,"d":"37627.75"},{"v":37502.3,"d":"37502.30"},{"v":37354.350000000006,"d":"37354.35"},{"v":37901.15000000001,"d":"37901.15"},{"v":38049.100000000006,"d":"38049.10"},{"v":38174.55000000001,"d":"38174.55"},37923.65,37650.25]
[3,"Nifty CPSE",2420.4,{"v":2436.2,"d":"2436.20"},{"v":2400.3999999999996,"d":"2400.40"},{"v":2380.3999999999996,"d":"2380.40"},{"v":2344.5999999999995,"d":"2344.60"},{"v":2456.2,"d":"2456.20"},{"v":2492,"d":"2492.00"},{"v":2512,"d":"2512.00"},2472,2416.2]
[4,"Nifty Infra",5087.7,{"v":5097.316666666667,"d":"5097.32"},{"v":5074.683333333333,"d":"5074.68"},{"v":5061.666666666667,"d":"5061.67"},{"v":5039.033333333334,"d":"5039.03"},{"v":5110.333333333333,"d":"5110.33"},{"v":5132.966666666666,"d":"5132.97"},{"v":5145.983333333333,"d":"5145.98"},5119.95,5084.3]
[5,"Nifty IT",35703.85,{"v":35613.7,"d":"35613.70"},35323.45,34943.05,{"v":34652.8,"d":"34652.80"},{"v":35994.09999999999,"d":"35994.10"},{"v":36284.34999999999,"d":"36284.35"},{"v":36664.749999999985,"d":"36664.75"},35903.95,35233.3]
[6,"Nifty PSE",4224.4,{"v":4240.416666666667,"d":"4240.42"},{"v":4199.933333333334,"d":"4199.93"},{"v":4175.466666666667,"d":"4175.47"},{"v":4134.9833333333345,"d":"4134.98"},{"v":4264.883333333334,"d":"4264.88"},{"v":4305.366666666666,"d":"4305.37"},{"v":4329.833333333334,"d":"4329.83"},4280.9,4215.95]
[7,"Nifty Midcap 50",8553.45,8519.95,{"v":8464.300000000001,"d":"8464.30"},8375.15,{"v":8319.5,"d":"8319.50"},{"v":8609.100000000002,"d":"8609.10"},{"v":8664.750000000004,"d":"8664.75"},{"v":8753.900000000003,"d":"8753.90"},8575.6,8430.8]
[8,"ACC",2265.85,{"v":2252.3833333333337,"d":"2252.38"},{"v":2228.7666666666673,"d":"2228.77"},{"v":2191.683333333334,"d":"2191.68"},{"v":2168.0666666666675,"d":"2168.07"},{"v":2289.466666666667,"d":"2289.47"},{"v":2313.083333333333,"d":"2313.08"},{"v":2350.166666666667,"d":"2350.17"},2276,2215.3,3.18393]
[9,"AUBANK",1205.9,{"v":1208.9833333333333,"d":"1208.98"},{"v":1195.9166666666667,"d":"1195.92"},{"v":1185.9333333333334,"d":"1185.93"},{"v":1172.8666666666668,"d":"1172.87"},{"v":1218.9666666666667,"d":"1218.97"},{"v":1232.0333333333333,"d":"1232.03"},{"v":1242.0166666666667,"d":"1242.02"},1222.05,1199,8.1862]
[10,"AARTIIND",1080.7,{"v":1086.9166666666667,"d":"1086.92"},{"v":1058.8333333333335,"d":"1058.83"},{"v":1036.9666666666667,"d":"1036.97"},{"v":1008.8833333333334,"d":"1008.88"},{"v":1108.7833333333335,"d":"1108.78"},{"v":1136.866666666667,"d":"1136.87"},{"v":1158.7333333333336,"d":"1158.73"},1115,1065.05,18.18149]
[11,"ABBOTINDIA",21741.2,{"v":22073.333333333332,"d":"22073.33"},{"v":21277.866666666665,"d":"21277.87"},{"v":20814.533333333333,"d":"20814.53"},{"v":20019.066666666666,"d":"20019.07"},{"v":22536.666666666664,"d":"22536.67"},{"v":23332.13333333333,"d":"23332.13"},{"v":23795.466666666664,"d":"23795.47"},22868.8,21610,0.45763]
{"$rows_left_out":227}
{"sheet":"MidCap Intra","index":3,"n_rows":537,"n_cols":13,"rows_kept":537,"merged":[[0,0,0,1],[8,0,9,0],[8,1,9,1],[8,2,9,2],[8,3,9,3],[8,4,8,6],[8,7,8,9]]}
[]
[]
[]
[]
[{"$nulls":11},"Back To Main Page"]
["FOR INTRA DAY TRADING",{"$nulls":9},{"$f":"Main!B10","v":"2021-10-08"}]
[null,null," "]
[]
["Sr.no","Scrip","CLOSE RATE","Pivot Point","Supports",null,null,"Resistances"]
[{"$nulls":4},"S1","S2","S3","R1","R2","R3","HIGH","LOW","Total Trade Quanity in Lakhs"]
[1,"3MINDIA",25231.65,{"v":25260.600000000002,"d":"25260.60"},{"v":24821.200000000004,"d":"24821.20"},{"v":24410.750000000004,"d":"24410.75"},{"v":23971.350000000006,"d":"23971.35"},{"v":25671.050000000003,"d":"25671.05"},{"v":26110.450000000004,"d":"26110.45"},{"v":26520.9,"d":"26520.90"},25700,24850.15,0.03342]
[2,"ABB",1871.5,{"v":1877.5,"d":"1877.50"},{"v":1857,"d":"1857.00"},{"v":1842.5,"d":"1842.50"},{"v":1822,"d":"1822.00"},{"v":1892,"d":"1892.00"},{"v":1912.5,"d":"1912.50"},{"v":1927,"d":"1927.00"},1898,1863,0.64748]
[3,"POWERINDIA",2400.7,{"v":2404.5833333333335,"d":"2404.58"},{"v":2359.166666666667,"d":"2359.17"},{"v":2317.6333333333337,"d":"2317.63"},{"v":2272.216666666667,"d":"2272.22"},{"v":2446.116666666667,"d":"2446.12"},{"v":2491.5333333333338,"d":"2491.53"},{"v":2533.0666666666666,"d":"2533.07"},2450,2363.05,0.16107]
[4,"ACC",2265.85,{"v":2252.3833333333337,"d":"2252.38"},{"v":2228.7666666666673,"d":"2228.77"},{"v":2191.683333333334,"d":"2191.68"},{"v":2168.0666666666675,"d":"2168.07"},{"v":2289.466666666667,"d":"2289.47"},{"v":2313.083333333333,"d":"2313.08"},{"v":2350.166666666667,"d":"2350.17"},2276,2215.3,3.18393]
[5,"AIAENG",1883.1,{"v":1896.1500000000003,"d":"1896.15"},{"v":1863.1000000000006,"d":"1863.10"},{"v":1843.1000000000004,"d":"1843.10"},{"v":1810.0500000000006,"d":"1810.05"},{"v":1916.1500000000005,"d":"1916.15"},{"v":1949.2000000000003,"d":"1949.20"},{"v":1969.2000000000005,"d":"1969.20"},1929.2,1876.15,0.34056]
[6,"APLAPOLLO",857.05,{"v":848.3000000000001,"d":"848.30"},{"v":835.6000000000001,"d":"835.60"},{"v":814.1500000000001,"d":"814.15"},{"v":801.4500000000002,"d":"801.45"},{"v":869.7500000000001,"d":"869.75"},{"v":882.4500000000002,"d":"882.45"},{"v":903.9000000000001,"d":"903.90"},861,826.85,5.51501]
[7,"AUBANK",1205.9,{"v":1208.9833333333333,"d":"1208.98"},{"v":1195.9166666666667,"d":"1195.92"},{"v":1185.9333333333334,"d":"1185.93"},{"v":1172.8666666666668,"d":"1172.87"},{"v":1218.9666666666667,"d":"1218.97"},{"v":1232.0333333333333,"d":"1232.03"},{"v":1242.0166666666667,"d":"1242.02"},1222.05,1199,8.1862]
[8,"AARTIDRUGS",632.75,{"v":636.5833333333334,"d":"636.58"},{"v":628.1666666666667,"d":"628.17"},{"v":623.5833333333334,"d":"623.58"},{"v":615.1666666666667,"d":"615.17"},{"v":641.1666666666667,"d":"641.17"},{"v":649.5833333333335,"d":"649.58"},{"v":654.1666666666667,"d":"654.17"},645,632,1.54629]
[9,"AARTIIND",1080.7,{"v":1086.9166666666667,"d":"1086.92"},{"v":1058.8333333333335,"d":"1058.83"},{"v":1036.9666666666667,"d":"1036.97"},{"v":1008.8833333333334,"d":"1008.88"},{"v":1108.7833333333335,"d":"1108.78"},{"v":1136.866666666667,"d":"1136.87"},{"v":1158.7333333333336,"d":"1158.73"},1115,1065.05,18.18149]
[10,"AAVAS",2648.65,{"v":2651.4500000000003,"d":"2651.45"},{"v":2630.0000000000005,"d":"2630.00"},{"v":2611.3500000000004,"d":"2611.35"},{"v":2589.9000000000005,"d":"2589.90"},{"v":2670.1000000000004,"d":"2670.10"},2691.55,{"v":2710.2000000000003,"d":"2710.20"},2672.9,2632.8,0.39186]
{"$rows_left_out":518}
{"sheet":"Bulk Deals","index":4,"n_rows":101,"n_cols":8,"rows_kept":101,"merged":[[4,0,4,1],[4,2,4,3],[6,1,6,2]]}
[" "]
[]
[]
[]
[]
[{"$nulls":4},"Back To Main Page"]
["Subject :","BULK DEAL",null,{"$f":"Main!B10","v":"2021-10-08"}]
[]
["Date","Scrip code","Scrip Name","Client Name","Buy / Sell","Quantity Traded","Trade Price / Wt.Avg.trade price","Exchange  "]
["2021-10-07",540615,"7NR","BHATI SHANI","BUY",{"v":12003,"d":"12,003"},11.37,"BSE"]
["2021-10-07",540615,"7NR","BHATI SHANI","SELL",{"v":136050,"d":"136,050"},11.37,"BSE"]
["2021-10-07",540615,"7NR","SUNIL KUMAR CHORDIA","BUY",{"v":92875,"d":"92,875"},11.37,"BSE"]
["2021-10-07",538778,"AKASHDEEP","DANVIR SINGH","BUY",{"v":55970,"d":"55,970"},52.25,"BSE"]
["2021-10-07",538778,"AKASHDEEP","DANVIR SINGH","SELL",{"v":55970,"d":"55,970"},53.12,"BSE"]
["2021-10-07",538778,"AKASHDEEP","DHANANJAY MALIK","SELL",{"v":95000,"d":"95,000"},52.31,"BSE"]
["2021-10-07",531991,"AMRAAGRI","ABHINAV ANAND","BUY",{"v":738366,"d":"738,366"},0.41,"BSE"]
["2021-10-07",530109,"ANUPAM","MANSUKH VALJI BORICHA","SELL",{"v":1500000,"d":"1,500,000"},2.6,"BSE"]
["2021-10-07",531297,"ARTEFACT","CHANDAN TOTARAM SIDHWANI","SELL",{"v":61625,"d":"61,625"},45.54,"BSE"]
["2021-10-07",539032,"FRASER","SAMIRKUMAR SUMANLAL GANDHI","BUY",{"v":50000,"d":"50,000"},10.41,"BSE"]
["2021-10-07",540266,"GLCL","PRITI DEEPAK RATHI","SELL",{"v":19200,"d":"19,200"},32.59,"BSE"]
{"$rows_left_out":82}
{"sheet":"Call Tracker (Equity & F&O)","index":5,"n_rows":298,"n_cols":18,"rows_kept":298,"merged":[[68,0,69,0],[68,1,69,1],[68,12,69,12],[68,13,69,13],[68,14,69,14],[68,15,69,15],[77,0,78,0],[77,1,78,1],[77,9,78,9],[77,12,78,12],[77,13,78,13],[77,14,78,14],[77,15,78,15]]}
[]
[]
[]
[]
[{"$nulls":12},"Back To Main Page"]
["Retail Research Technical Calls & Fundamental Performance Report for the month of Oct-2021"]
[{"$nulls":12},{"$f":"Main!B10","v":"2021-10-08"}]
[null,"Positional  Call"]
["Sr.no","Date",null,"Company","Rec","Rec Price","Stop Loss***","Call Closed At","Target","Remark","Profit / Loss per Share","All charges","Net Gain / Loss  %","Status","Closed Date","Market Closing Price"]
[1,"2021-09-15",null,"AKZOINDIA","Buy",2195,2080,{"v":2295,"d":"2,295.00"},"2400-2500","Part Profit of Rs.100/-",{"$f":"H10-F10","v":100},{"$f":"(F10*-0.7)/100","v":{"v":-15.365,"d":"-15.37"}},{"$f":"(K10+L10)/F10","v":{"v":0.03855808656036447,"d":"3.86%"}},"Successful","2021-09-30",{"$f":"VLOOKUP(D10,'MidCap Intra'!B11:C511,2,0)","v":2237.25},null,"H"]
[2,"2021-09-21",null,"GLAXO","Buy","1500-1520",1395,null,"1680-1720","Open",{"$nulls":5},{"$f":"VLOOKUP(D11,'MidCap Intra'!B13:C513,2,0)","v":1483.5},null,"H"]
[3,"2021-09-24",null,"JKCEMENT","Buy",3130,2920,{"v":3320,"d":"3,320.00"},"3500-3600","Profit of Rs.190-/-",{"$f":"H12-F12","v":190},{"$f":"(F12*-0.7)/100","v":-21.91},{"$f":"(K12+L12)/F12","v":{"v":0.05370287539936102,"d":"5.37%"}},"Successful","2021-10-04",null,null,"H"]
[4,"2021-09-27",null,"IGL","Buy","525-530",495,null,"580-600","Open",{"$nulls":5},{"$f":"VLOOKUP(D13,'MidCap Intra'!B15:C515,2,0)","v":519.2},null,"H"]
[5,"2021-09-27",null,"CROMPTON","Buy",472.5,445,{"v":503,"d":"503.00"},530,"Profit of Rs.30.5/-",{"$f":"H14-F14","v":30.5},{"$f":"(F14*-0.7)/100","v":{"v":-3.3075,"d":"-3.31"}},{"$f":"(K14+L14)/F14","v":{"v":0.057550264550264546,"d":"5.76%"}},"Successful","2021-10-01",null,null,"H"]
[6,"2021-09-27",null,"DALBHARAT","Buy",2040,1895,{"v":2155,"d":"2,155.00"},"2300-2400","Part Profit of Rs.115/-",115,-14.28,{"v":0.049372549019607845,"d":"4.94%"},"Successful","2021-10-01",{"$f":"VLOOKUP(D15,'MidCap Intra'!B16:C516,2,0)","v":2093},null,"N"]
[7,"2021-09-27",null,"ENDURANCE","Buy","1570-1590",1490,null,"1750-1800","Open",{"$nulls":5},{"$f":"VLOOKUP(D16,'MidCap Intra'!B18:C518,2,0)","v":1605.45},null,"H"]
[8,"2021-09-29",null,"CAMS","Buy",3270,3140,{"v":3025,"d":"3,025.00"},"3600-3700","Loss of Rs.245/-",{"$f":"H17-F17","v":-245},{"$f":"(F17*-0.7)/100","v":-22.89},{"$f":"(K17+L17)/F17","v":{"v":-0.08192354740061161,"d":"-8.19%"}},"Unsuccessful","2021-10-01",null,null,"H"]
[9,"2021-09-29",null,"INDIACEM","Buy",191.5,178,{"v":204.5,"d":"204.50"},210,"Profit of Rs.13/-",{"$f":"H18-F18","v":13},{"$f":"(F18*-0.7)/100","v":{"v":-1.3404999999999998,"d":"-1.34"}},{"$f":"(K18+L18)/F18","v":{"v":0.060885117493472585,"d":"6.09%"}},"Successful","2021-10-01",null,null,"N"]
[10,"2021-10-04",null,"PIIND","Buy","3100-3140",2980,null,"3350-3400","Open",{"$nulls":5},{"$f":"VLOOKUP(D19,'MidCap Intra'!B21:C521,2,0)","v":3243.05},null,"H"]
[11,"2021-10-05",null,"HDFCLIFE","Buy","715-725",660,null,"820-850","Open",{"$nulls":5},{"$f":"VLOOKUP(D20,'MidCap Intra'!B22:C522,2,0)","v":725.35},null,"H"]
{"$rows_left_out":248}