{"text_format":"3","workbook":"xlsx","n_sheets":6,"sheets":["Main","Future Intra","Cash Intra","MidCap Intra","Bulk Deals","Call Tracker (Equity & F&O)"],"not_rendered":{"images":2,"defined_names":2},"read":"whole","date_system":"1900"}

{"sheet":"Main","index":0,"n_rows":27,"n_cols":11,"rows_kept":27}
[null,"                                                                                                 "]
{"$rows_empty":8}
[null,"2022-05-11"]
[]
[null,"Sheet No.","Template Name","Summary"]
[null,1,"Future Intra","For Intraday trading in F&O segment"]
[null,2,"Cash Intra","For Intraday trading in cash market segment"]
[null,3,"Mid-cap Intra","For Intraday trading in Mid-cap stocks"]
[null,4,"Bulk Deals","Reveals Bulk Deals carried on NSE & BSE"]
[null,5,"Call Tracker"]
{"$rows_empty":9}
[{"$nulls":10},"`"]

{"sheet":"Future Intra","index":1,"n_rows":239,"n_cols":16,"rows_kept":239,"merged":[[8,0,9,0],[8,1,9,1],[8,2,9,2],[8,3,9,3],[8,6,8,8],[8,9,8,11]]}
[]
[]
[]
[]
[{"$nulls":12},"Back to Main Page"]
["FOR INTRA DAY TRADING",{"$nulls":10},{"$f":"Main!B10","v":"2022-05-11"}]
[]
[]
["Sr.no","Sector","Scrip","Expiry Date","CLOSE RATE","Pivot Point","Supports",null,null,"Resistances"]
[{"$nulls":4},"Point","Point","S1","S2","S3","R1","R2","R3","HIGH","LOW","OI","% Change in OI"]
[1,"Index","NIFTY","2022-05-26",{"v":16247.1,"d":"16247.10"},16288.75,{"v":16167.349999999999,"d":"16167.35"},{"v":16087.599999999999,"d":"16087.60"},{"v":15966.199999999997,"d":"15966.20"},{"v":16368.5,"d":"16368.50"},{"v":16489.9,"d":"16489.90"},16569.65,16410.15,16209,12893700,{"v":-0.04964878789442262,"d":"-4.96%"}]
[2,"Index","BANKNIFTY","2022-05-26",{"v":34515.8,"d":"34515.80"},{"v":34516.933333333334,"d":"34516.93"},{"v":34216.86666666667,"d":"34216.87"},{"v":33917.933333333334,"d":"33917.93"},{"v":33617.86666666667,"d":"33617.87"},{"v":34815.86666666667,"d":"34815.87"},{"v":35115.933333333334,"d":"35115.93"},{"v":35414.86666666667,"d":"35414.87"},34817,34218,3591150,{"v":0.05618175802360207,"d":"5.62%"}]
[3,"Index","FINNIFTY","2022-05-31",15960.55,{"v":15976.533333333333,"d":"15976.53"},{"v":15855.066666666666,"d":"15855.07"},{"v":15749.583333333332,"d":"15749.58"},{"v":15628.116666666665,"d":"15628.12"},{"v":16082.016666666666,"d":"16082.02"},{"v":16203.483333333334,"d":"16203.48"},{"v":16308.966666666667,"d":"16308.97"},16098,15871.05,5680,{"v":0.04411764705882353,"d":"4.41%"}]
[4,"Index","MIDCPNIFTY","2022-05-31",{"v":6620,"d":"6620.00"},{"v":6606.716666666667,"d":"6606.72"},{"v":6513.383333333334,"d":"6513.38"},{"v":6406.766666666667,"d":"6406.77"},{"v":6313.433333333334,"d":"6313.43"},{"v":6713.333333333334,"d":"6713.33"},{"v":6806.666666666666,"d":"6806.67"},{"v":6913.283333333334,"d":"6913.28"},6700.05,6500.1,2100,{"v":0,"d":"0.00%"}]
[5,"Chemical","AARTIIND","2022-05-26",770.65,{"v":776.9333333333334,"d":"776.93"},{"v":760.7166666666668,"d":"760.72"},{"v":750.7833333333334,"d":"750.78"},{"v":734.5666666666668,"d":"734.57"},{"v":786.8666666666668,"d":"786.87"},{"v":803.0833333333335,"d":"803.08"},{"v":813.0166666666668,"d":"813.02"},793.15,767,3072750,{"v":0.010058675607711651,"d":"1.01%"}]
[6,"Capital_Goods","ABB","2022-05-26",2234.35,{"v":2209.4166666666665,"d":"2209.42"},{"v":2118.833333333333,"d":"2118.83"},{"v":2003.3166666666666,"d":"2003.32"},{"v":1912.7333333333331,"d":"1912.73"},{"v":2324.933333333333,"d":"2324.93"},{"v":2415.516666666666,"d":"2415.52"},{"v":2531.033333333333,"d":"2531.03"},2300,2093.9,415500,{"v":-0.09722976643128735,"d":"-9.72%"}]
[7,"Pharma","ABBOTINDIA","2022-05-26",{"v":16672,"d":"16672.00"},{"v":16716.116666666665,"d":"16716.12"},{"v":16432.23333333333,"d":"16432.23"},{"v":16192.466666666664,"d":"16192.47"},{"v":15908.583333333328,"d":"15908.58"},{"v":16955.88333333333,"d":"16955.88"},{"v":17239.76666666667,"d":"17239.77"},{"v":17479.533333333333,"d":"17479.53"},17000,16476.35,30165,{"v":-0.004126774513040607,"d":"-0.41%"}]
[8,"Others","ABCAPITAL","2022-05-26",104.25,{"v":105.26666666666667,"d":"105.27"},{"v":102.63333333333333,"d":"102.63"},{"v":101.01666666666667,"d":"101.02"},{"v":98.38333333333333,"d":"98.38"},{"v":106.88333333333333,"d":"106.88"},{"v":109.51666666666668,"d":"109.52"},{"v":111.13333333333333,"d":"111.13"},107.9,103.65,20785000,{"v":0.002005457157457312,"d":"0.20%"}]
[9,"Textile","ABFRL","2022-05-26",{"v":257.9,"d":"257.90"},{"v":260.93333333333334,"d":"260.93"},{"v":253.51666666666665,"d":"253.52"},{"v":249.13333333333333,"d":"249.13"},{"v":241.71666666666664,"d":"241.72"},{"v":265.31666666666666,"d":"265.32"},{"v":272.7333333333333,"d":"272.73"},{"v":277.1166666666667,"d":"277.12"},268.35,256.55,9760400,{"v":2.670940170940171E-3,"d":"0.27%"}]
[10,"Cement","ACC","2022-05-26",2200.75,{"v":2217.6,"d":"2217.60"},{"v":2177,"d":"2177.00"},2153.25,2112.65,2241.35,{"v":2281.9499999999994,"d":"2281.95"},{"v":2305.7,"d":"2305.70"},2258.2,2193.85,2477500,{"v":1.6171417020416413E-3,"d":"0.16%"}]
{"$rows_left_out":210}
{"sheet":"Cash Intra","index":2,"n_rows":246,"n_cols":13,"rows_kept":246,"merged":[[7,0,8,0],[7,1,8,1],[7,2,8,2],[7,3,8,3],[7,4,7,6],[7,7,7,9]]}
[]
[]
[]
[]
[{"$nulls":12},"Back to Main Page"]
["FOR INTRA DAY TRADING",{"$nulls":9},{"$f":"Main!B10","v":"2022-05-11"}]
[]
["Sr.no",null,"CLOSE RATE","Pivot Point","Supports",null,null,"Resistances"]
[{"$nulls":4},"S1","S2","S3","R1","R2","R3","HIGH","LOW","Total Trade Quanity in Lakhs"]
[1,"Nifty 50",16240.05,{"v":16280.633333333331,"d":"16280.63"},{"v":16156.716666666664,"d":"16156.72"},{"v":16073.383333333331,"d":"16073.38"},{"v":15949.466666666664,"d":"15949.47"},{"v":16363.966666666664,"d":"16363.97"},{"v":16487.88333333333,"d":"16487.88"},{"v":16571.216666666664,"d":"16571.22"},16404.55,16197.3]
[2,"Nifty Bank",34482.65,{"v":34480.41666666667,"d":"34480.42"},{"v":34179.03333333334,"d":"34179.03"},{"v":33875.41666666667,"d":"33875.42"},{"v":33574.03333333334,"d":"33574.03"},{"v":34784.03333333334,"d":"34784.03"},{"v":35085.41666666667,"d":"35085.42"},{"v":35389.03333333334,"d":"35389.03"},34781.8,34176.8]
[3,"Nifty CPSE",2584.1,{"v":2612.5,"d":"2612.50"},2543.85,{"v":2503.6,"d":"2503.60"},2434.95,2652.75,{"v":2721.3999999999996,"d":"2721.40"},2761.65,2681.15,2572.25]
[4,"Nifty Infra",4819.15,{"v":4841.383333333333,"d":"4841.38"},{"v":4779.516666666666,"d":"4779.52"},{"v":4739.883333333333,"d":"4739.88"},{"v":4678.016666666666,"d":"4678.02"},{"v":4881.016666666666,"d":"4881.02"},{"v":4942.883333333333,"d":"4942.88"},{"v":4982.516666666666,"d":"4982.52"},4903.25,4801.75]
[5,"Nifty IT",30427.2,30518.75,30251.55,{"v":30075.899999999998,"d":"30075.90"},{"v":29808.699999999997,"d":"29808.70"},{"v":30694.4,"d":"30694.40"},{"v":30961.6,"d":"30961.60"},{"v":31137.250000000004,"d":"31137.25"},30785.95,30343.1]
[6,"Nifty PSE",4100.2,4139.25,{"v":4044,"d":"4044.00"},{"v":3987.8,"d":"3987.80"},3892.55,4195.45,{"v":4290.7,"d":"4290.70"},{"v":4346.9,"d":"4346.90"},4234.5,4083.05]
[7,"Nifty Midcap 50",7533.65,{"v":7596.066666666666,"d":"7596.07"},{"v":7448.683333333332,"d":"7448.68"},{"v":7363.716666666666,"d":"7363.72"},{"v":7216.333333333332,"d":"7216.33"},{"v":7681.033333333331,"d":"7681.03"},{"v":7828.416666666666,"d":"7828.42"},{"v":7913.3833333333305,"d":"7913.38"},7743.45,7511.1]
[8,"ACC",2198.55,{"v":2210.9833333333336,"d":"2210.98"},{"v":2172.566666666667,"d":"2172.57"},{"v":2146.5833333333335,"d":"2146.58"},{"v":2108.166666666667,"d":"2108.17"},{"v":2236.966666666667,"d":"2236.97"},{"v":2275.383333333333,"d":"2275.38"},{"v":2301.3666666666672,"d":"2301.37"},2249.4,2185,3.65873]
[9,"AUBANK",1262.7,{"v":1273.2333333333333,"d":"1273.23"},{"v":1249.4666666666667,"d":"1249.47"},{"v":1236.2333333333333,"d":"1236.23"},{"v":1212.4666666666667,"d":"1212.47"},{"v":1286.4666666666667,"d":"1286.47"},{"v":1310.2333333333336,"d":"1310.23"},{"v":1323.4666666666667,"d":"1323.47"},1297,1260,10.67357]
[10,"AARTIIND",769,{"v":775.6333333333333,"d":"775.63"},{"v":759.5666666666666,"d":"759.57"},{"v":750.1333333333333,"d":"750.13"},{"v":734.0666666666666,"d":"734.07"},{"v":785.0666666666666,"d":"785.07"},{"v":801.1333333333334,"d":"801.13"},{"v":810.5666666666666,"d":"810.57"},791.7,766.2,6.3551]
[11,"ADANIENT",2109.5,{"v":2142.3333333333335,"d":"2142.33"},{"v":2064.666666666667,"d":"2064.67"},{"v":2019.8333333333335,"d":"2019.83"},{"v":1942.166666666667,"d":"1942.17"},{"v":2187.166666666667,"d":"2187.17"},{"v":2264.833333333334,"d":"2264.83"},{"v":2309.666666666667,"d":"2309.67"},2220,2097.5,14.71866]
{"$rows_left_out":227}
{"sheet":"MidCap Intra","index":3,"n_rows":530,"n_cols":13,"rows_kept":530,"merged":[[0,0,0,1],[8,0,9,0],[8,1,9,1],[8,2,9,2],[8,3,9,3],[8,4,8,6],[8,7,8,9]]}
[]
[]
[]
[]
[{"$nulls":11},"Back To Main Page"]
["FOR INTRA DAY TRADING",{"$nulls":9},{"$f":"Main!B10","v":"2022-05-11"}]
[null,null," "]
[]
["Sr.no","Scrip","CLOSE RATE","Pivot Point","Supports",null,null,"Resistances"]
[{"$nulls":4},"S1","S2","S3","R1","R2","R3","HIGH","LOW","Total Trade Quanity in Lakhs"]
[1,"3MINDIA",18106.35,{"v":18383.766666666666,"d":"18383.77"},{"v":17822.533333333333,"d":"17822.53"},{"v":17538.716666666667,"d":"17538.72"},{"v":16977.483333333334,"d":"16977.48"},{"v":18667.583333333332,"d":"18667.58"},{"v":19228.816666666662,"d":"19228.82"},{"v":19512.63333333333,"d":"19512.63"},18945,18099.95,0.05618]
[2,"AARTIDRUGS",426.35,{"v":431.2833333333333,"d":"431.28"},{"v":420.0666666666666,"d":"420.07"},{"v":413.7833333333333,"d":"413.78"},{"v":402.5666666666666,"d":"402.57"},{"v":437.5666666666666,"d":"437.57"},{"v":448.7833333333333,"d":"448.78"},{"v":455.0666666666666,"d":"455.07"},442.5,425,1.28428]
[3,"AARTIIND",769,{"v":775.6333333333333,"d":"775.63"},{"v":759.5666666666666,"d":"759.57"},{"v":750.1333333333333,"d":"750.13"},{"v":734.0666666666666,"d":"734.07"},{"v":785.0666666666666,"d":"785.07"},{"v":801.1333333333334,"d":"801.13"},{"v":810.5666666666666,"d":"810.57"},791.7,766.2,6.3551]
[4,"AAVAS",2306.9,{"v":2280.4666666666667,"d":"2280.47"},{"v":2180.9333333333334,"d":"2180.93"},{"v":2054.9666666666667,"d":"2054.97"},{"v":1955.4333333333334,"d":"1955.43"},{"v":2406.4333333333334,"d":"2406.43"},{"v":2505.966666666667,"d":"2505.97"},{"v":2631.9333333333334,"d":"2631.93"},2380,2154.5,1.4233]
[5,"ABB",2230.55,2204.65,{"v":2103.3,"d":"2103.30"},{"v":1976.0500000000002,"d":"1976.05"},{"v":1874.7000000000003,"d":"1874.70"},{"v":2331.9,"d":"2331.90"},{"v":2433.2499999999995,"d":"2433.25"},{"v":2560.5,"d":"2560.50"},2306,2077.4,4.95998]
[6,"ABBOTINDIA",16656.05,{"v":16701.850000000002,"d":"16701.85"},{"v":16405.700000000004,"d":"16405.70"},{"v":16155.350000000002,"d":"16155.35"},{"v":15859.200000000004,"d":"15859.20"},{"v":16952.200000000004,"d":"16952.20"},{"v":17248.350000000006,"d":"17248.35"},{"v":17498.700000000004,"d":"17498.70"},16998,16451.5,0.08385]
[7,"ABCAPITAL",104.15,{"v":105.03333333333335,"d":"105.03"},{"v":102.2166666666667,"d":"102.22"},{"v":100.28333333333335,"d":"100.28"},{"v":97.4666666666667,"d":"97.47"},{"v":106.9666666666667,"d":"106.97"},{"v":109.78333333333333,"d":"109.78"},{"v":111.7166666666667,"d":"111.72"},107.85,103.1,28.32463]
[8,"ABFRL",257.75,{"v":260.28333333333336,"d":"260.28"},{"v":252.4666666666667,"d":"252.47"},{"v":247.18333333333334,"d":"247.18"},{"v":239.36666666666667,"d":"239.37"},{"v":265.5666666666667,"d":"265.57"},{"v":273.38333333333344,"d":"273.38"},{"v":278.66666666666674,"d":"278.67"},268.1,255,12.74445]
[9,"ACC",2198.55,{"v":2210.9833333333336,"d":"2210.98"},{"v":2172.566666666667,"d":"2172.57"},{"v":2146.5833333333335,"d":"2146.58"},{"v":2108.166666666667,"d":"2108.17"},{"v":2236.966666666667,"d":"2236.97"},{"v":2275.383333333333,"d":"2275.38"},{"v":2301.3666666666672,"d":"2301.37"},2249.4,2185,3.65873]
[10,"ADANIENT",2109.5,{"v":2142.3333333333335,"d":"2142.33"},{"v":2064.666666666667,"d":"2064.67"},{"v":2019.8333333333335,"d":"2019.83"},{"v":1942.166666666667,"d":"1942.17"},{"v":2187.166666666667,"d":"2187.17"},{"v":2264.833333333334,"d":"2264.83"},{"v":2309.666666666667,"d":"2309.67"},2220,2097.5,14.71866]
{"$rows_left_out":511}
{"sheet":"Bulk Deals","index":4,"n_rows":79,"n_cols":8,"rows_kept":79,"merged":[[4,0,4,1],[4,2,4,3],[6,1,6,2]]}
[" "]
[]
[]
[]
[]
[{"$nulls":4},"Back To Main Page"]
["Subject :","BULK DEAL",null,{"$f":"Main!B10","v":"2022-05-11"}]
[]
["Date","Scrip code","Scrip Name","Client Name","Buy / Sell","Quantity Traded","Trade Price / Wt.Avg.trade price","Exchange  "]
["2022-05-10",538778,"AKASHDEEP","NAVEEN PAUL","SELL",{"v":65000,"d":"65,000"},47.4,"BSE"]
["2022-05-10",541865,"ASRL","MAHENDRA PRATAPSINH KHENGAR","BUY",{"v":119750,"d":"119,750"},101.4,"BSE"]
["2022-05-10",541865,"ASRL","DINESHBHAI BHANUSHANKAR PANDYA","SELL",{"v":612096,"d":"612,096"},101.83,"BSE"]
["2022-05-10",541865,"ASRL","KEBBEHALI PANCHILINGAIAHUMESH .","BUY",{"v":498500,"d":"498,500"},101.93,"BSE"]
["2022-05-10",539099,"ATHCON","DEEPALI CHETAN THAKKAR","SELL",{"v":40000,"d":"40,000"},15,"BSE"]
["2022-05-10",539621,"BCLENTERPR","YUGAL KISHORE RAMETRA","BUY",{"v":300000,"d":"300,000"},3.25,"BSE"]
["2022-05-10",531909,"CROISSANCE","BRIJESH PANKAJBHAI SHAH","BUY",{"v":350000,"d":"350,000"},4.13,"BSE"]
["2022-05-10",539559,"DDIL","KQUANT ENTERPRISES LLP","BUY",{"v":71067,"d":"71,067"},16,"BSE"]
["2022-05-10",543516,"DHYAANI","ABINASH PRAJAPATI","BUY",{"v":8000,"d":"8,000"},58.26,"BSE"]
["2022-05-10",523708,"EIMCOELECO","AKAAISH MECHATRONICS LTD","BUY",{"v":38500,"d":"38,500"},358,"BSE"]
["2022-05-10",523708,"EIMCOELECO","K B INVESTMENTS LIMITED","SELL",{"v":38500,"d":"38,500"},358,"BSE"]
{"$rows_left_out":60}
{"sheet":"Call Tracker (Equity & F&O)","index":5,"n_rows":277,"n_cols":18,"rows_kept":277}
[]
[]
[]
[]
[{"$nulls":12},"Back To Main Page"]
["Retail Research Technical Calls & Fundamental Performance Report for the month of May-2022"]
[{"$nulls":12},{"$f":"Main!B10","v":"2022-05-11"}]
[null,"Positional  Call"]
["Sr.no","Date",null,"Company","Rec","Rec Price","Stop Loss***","Call Closed At","Target","Remark","Profit / Loss per Share","All charges","Net Gain / Loss  %","Status","Closed Date","Market Closing Price"]
[1,"2022-03-21",null,"WHIRLPOOL","Buy",1640,1530,1675,"1800-1900","Profit of Rs.35/-",{"$f":"H10-F10","v":35},{"$f":"(F10*-0.7)/100","v":-11.48},{"$f":"(K10+L10)/F10","v":{"v":0.014341463414634147,"d":"1.43%"}},"Successful","2022-05-02",null,null,"H"]
[2,"2022-04-13",null,"CAMS","Buy",2595,2395,2395,"2800-2900","Loss of Rs.200/-",-200,{"v":-18.165,"d":"-18.17"},{"v":-0.08407129094412331,"d":"-8.41%"},"Unsuccessful","2022-05-09",null,null,"H"]
[3,"2022-04-19",null,"REDINGTON","Buy",158,149,149,"170-180","Loss of Rs.9/-",{"$f":"H12-F12","v":-9},{"$f":"(F12*-0.7)/100","v":{"v":-1.1059999999999999,"d":"-1.11"}},{"$f":"(K12+L12)/F12","v":{"v":-0.0639620253164557,"d":"-6.40%"}},"Unsuccessful","2022-05-05",null,null,"H"]
[4,"2022-04-20",null,"IRCTC","Buy",755,695,695,"830-900","Loss of Rs.60/-",{"$f":"H13-F13","v":-60},{"$f":"(F13*-0.7)/100","v":{"v":-5.285,"d":"-5.29"}},{"$f":"(K13+L13)/F13","v":{"v":-0.08647019867549668,"d":"-8.65%"}},"Unsuccessful","2022-05-10",null,null,"H"]
[5,"2022-05-09",null,"ICICIBANK","Buy","700-710",670,null,"750-780","Open",{"$nulls":5},{"$f":"VLOOKUP(D14,'MidCap Intra'!B29:C583,2,0)","v":711.3}]
[6,"2022-05-09",null,"REDINGTON","Buy","137-139",129,null,"150-155","Open",{"$nulls":5},{"$f":"VLOOKUP(D15,'MidCap Intra'!B30:C584,2,0)","v":135.95}]
[]
[]
[]
[]
["CLBS = Closing Basis ***"]
{"$rows_left_out":246}