{"text_format":"3","workbook":"xlsx","n_sheets":6,"sheets":["Main","Future Intra","Cash Intra","MidCap Intra","Bulk Deals","Call Tracker (Equity & F&O)"],"not_rendered":{"images":2,"defined_names":2},"read":"whole","date_system":"1900"}

{"sheet":"Main","index":0,"n_rows":27,"n_cols":11,"rows_kept":27}
[null,"                                                                                                 "]
{"$rows_empty":8}
[null,"2022-01-11"]
[]
[null,"Sheet No.","Template Name","Summary"]
[null,1,"Future Intra","For Intraday trading in F&O segment"]
[null,2,"Cash Intra","For Intraday trading in cash market segment"]
[null,3,"Mid-cap Intra","For Intraday trading in Mid-cap stocks"]
[null,4,"Bulk Deals","Reveals Bulk Deals carried on NSE & BSE"]
[null,5,"Call Tracker"]
{"$rows_empty":9}
[{"$nulls":10},"`"]

{"sheet":"Future Intra","index":1,"n_rows":240,"n_cols":16,"rows_kept":240,"merged":[[8,0,9,0],[8,1,9,1],[8,2,9,2],[8,3,9,3],[8,6,8,8],[8,9,8,11]]}
[]
[]
[]
[]
[{"$nulls":12},"Back to Main Page"]
["FOR INTRA DAY TRADING",{"$nulls":10},{"$f":"Main!B10","v":"2022-01-11"}]
[]
[]
["Sr.no","Sector","Scrip","Expiry Date","CLOSE RATE","Pivot Point","Supports",null,null,"Resistances"]
[{"$nulls":4},"Point","Point","S1","S2","S3","R1","R2","R3","HIGH","LOW","OI","% Change in OI"]
[1,"Index","BANKNIFTY","2022-01-27",38468.35,{"v":38329.5,"d":"38329.50"},{"v":38139,"d":"38139.00"},37809.65,37619.15,38658.85,38849.35,{"v":39178.7,"d":"39178.70"},38520,38000.15,2604450,{"v":0.07803429328311103,"d":"7.80%"}]
[2,"Index","NIFTY","2022-01-27",{"v":18048.2,"d":"18048.20"},{"v":18003.899999999998,"d":"18003.90"},{"v":17949.499999999996,"d":"17949.50"},{"v":17850.8,"d":"17850.80"},{"v":17796.399999999998,"d":"17796.40"},{"v":18102.599999999995,"d":"18102.60"},{"v":18156.999999999996,"d":"18157.00"},{"v":18255.699999999993,"d":"18255.70"},18058.3,17905.2,11819300,{"v":0.029022414340999222,"d":"2.90%"}]
[3,"Index","FINNIFTY","2022-01-25",{"v":18555.5,"d":"18555.50"},{"v":18504.416666666668,"d":"18504.42"},{"v":18418.933333333334,"d":"18418.93"},{"v":18282.366666666665,"d":"18282.37"},{"v":18196.88333333333,"d":"18196.88"},{"v":18640.983333333337,"d":"18640.98"},{"v":18726.466666666667,"d":"18726.47"},{"v":18863.03333333334,"d":"18863.03"},18589.9,18367.85,2680,{"v":0.45652173913043476,"d":"45.65%"}]
[4,"Chemical","AARTIIND","2022-01-27",1086.25,{"v":1068.6333333333334,"d":"1068.63"},{"v":1047.466666666667,"d":"1047.47"},{"v":1008.6833333333334,"d":"1008.68"},{"v":987.5166666666669,"d":"987.52"},{"v":1107.416666666667,"d":"1107.42"},{"v":1128.5833333333335,"d":"1128.58"},{"v":1167.366666666667,"d":"1167.37"},1089.8,1029.85,2335800,{"v":-0.04450625869262865,"d":"-4.45%"}]
[5,"Pharma","ABBOTINDIA","2022-01-27",{"v":18405.8,"d":"18405.80"},18461.95,{"v":18324.9,"d":"18324.90"},{"v":18244,"d":"18244.00"},18106.95,{"v":18542.850000000002,"d":"18542.85"},{"v":18679.899999999998,"d":"18679.90"},{"v":18760.800000000003,"d":"18760.80"},18599,18381.05,35375,{"v":0.04659763313609468,"d":"4.66%"}]
[6,"Others","ABCAPITAL","2022-01-27",{"v":133.1,"d":"133.10"},{"v":133.48333333333335,"d":"133.48"},{"v":131.9666666666667,"d":"131.97"},{"v":130.83333333333334,"d":"130.83"},{"v":129.3166666666667,"d":"129.32"},{"v":134.6166666666667,"d":"134.62"},{"v":136.13333333333335,"d":"136.13"},{"v":137.2666666666667,"d":"137.27"},135,132.35,12456400,{"v":0.028706395348837208,"d":"2.87%"}]
[7,"Textile","ABFRL","2022-01-27",{"v":294.1,"d":"294.10"},{"v":295.3666666666667,"d":"295.37"},{"v":291.8833333333333,"d":"291.88"},{"v":289.66666666666663,"d":"289.67"},{"v":286.1833333333333,"d":"286.18"},{"v":297.58333333333337,"d":"297.58"},{"v":301.0666666666667,"d":"301.07"},{"v":303.2833333333334,"d":"303.28"},298.85,293.15,11284000,{"v":9.225092250922509E-4,"d":"0.09%"}]
[8,"Cement","ACC","2022-01-27",{"v":2330.6,"d":"2330.60"},{"v":2317.1,"d":"2317.10"},{"v":2299.2,"d":"2299.20"},{"v":2267.7999999999997,"d":"2267.80"},{"v":2249.8999999999996,"d":"2249.90"},{"v":2348.5,"d":"2348.50"},{"v":2366.4000000000005,"d":"2366.40"},{"v":2397.8,"d":"2397.80"},2335,2285.7,2816750,{"v":0.03623654925043686,"d":"3.62%"}]
[9,"Others","ADANIENT","2022-01-27",1760.65,1747.05,{"v":1718.1,"d":"1718.10"},1675.55,{"v":1646.6,"d":"1646.60"},{"v":1789.6,"d":"1789.60"},{"v":1818.5500000000002,"d":"1818.55"},{"v":1861.1,"d":"1861.10"},1776,1704.5,21738500,{"v":0.011469383956821143,"d":"1.15%"}]
[10,"Others","ADANIPORTS","2022-01-27",{"v":742.6,"d":"742.60"},{"v":741.2333333333332,"d":"741.23"},{"v":737.4666666666665,"d":"737.47"},{"v":732.3333333333333,"d":"732.33"},{"v":728.5666666666665,"d":"728.57"},{"v":746.3666666666664,"d":"746.37"},{"v":750.1333333333331,"d":"750.13"},{"v":755.2666666666664,"d":"755.27"},745,736.1,88357500,{"v":1.9135093761959434E-3,"d":"0.19%"}]
{"$rows_left_out":208}
{"sheet":"Cash Intra","index":2,"n_rows":246,"n_cols":13,"rows_kept":246,"merged":[[7,0,8,0],[7,1,8,1],[7,2,8,2],[7,3,8,3],[7,4,7,6],[7,7,7,9]]}
[]
[]
[]
[]
[{"$nulls":12},"Back to Main Page"]
["FOR INTRA DAY TRADING",{"$nulls":9},{"$f":"Main!B10","v":"2022-01-11"}]
[]
["Sr.no",null,"CLOSE RATE","Pivot Point","Supports",null,null,"Resistances"]
[{"$nulls":4},"S1","S2","S3","R1","R2","R3","HIGH","LOW","Total Trade Quanity in Lakhs"]
[1,"Nifty 50",18003.3,{"v":17966.633333333335,"d":"17966.63"},{"v":17915.81666666667,"d":"17915.82"},{"v":17828.333333333336,"d":"17828.33"},{"v":17777.51666666667,"d":"17777.52"},{"v":18054.11666666667,"d":"18054.12"},{"v":18104.933333333334,"d":"18104.93"},{"v":18192.416666666668,"d":"18192.42"},18017.45,17879.15]
[2,"Nifty Bank",38347.9,{"v":38225.86666666667,"d":"38225.87"},{"v":38051.38333333334,"d":"38051.38"},{"v":37754.86666666667,"d":"37754.87"},{"v":37580.38333333334,"d":"37580.38"},{"v":38522.38333333334,"d":"38522.38"},{"v":38696.866666666676,"d":"38696.87"},{"v":38993.38333333334,"d":"38993.38"},38400.35,37929.35]
[3,"Nifty CPSE",2389.9,{"v":2387.2666666666664,"d":"2387.27"},{"v":2379.283333333333,"d":"2379.28"},{"v":2368.6666666666665,"d":"2368.67"},{"v":2360.683333333333,"d":"2360.68"},{"v":2397.8833333333328,"d":"2397.88"},{"v":2405.8666666666663,"d":"2405.87"},{"v":2416.4833333333327,"d":"2416.48"},2395.25,2376.65]
[4,"Nifty Infra",5133.4,{"v":5122.116666666667,"d":"5122.12"},{"v":5107.383333333333,"d":"5107.38"},{"v":5081.366666666667,"d":"5081.37"},{"v":5066.633333333333,"d":"5066.63"},{"v":5148.133333333333,"d":"5148.13"},{"v":5162.866666666667,"d":"5162.87"},{"v":5188.883333333333,"d":"5188.88"},5136.85,5096.1]
[5,"Nifty IT",38212.2,{"v":38275.13333333334,"d":"38275.13"},{"v":37928.366666666676,"d":"37928.37"},{"v":37644.53333333334,"d":"37644.53"},{"v":37297.76666666668,"d":"37297.77"},{"v":38558.966666666674,"d":"38558.97"},{"v":38905.73333333334,"d":"38905.73"},{"v":39189.56666666667,"d":"39189.57"},38621.9,37991.3]
[6,"Nifty PSE",4055,{"v":4046.6666666666665,"d":"4046.67"},{"v":4033.233333333333,"d":"4033.23"},{"v":4011.4666666666667,"d":"4011.47"},{"v":3998.0333333333333,"d":"3998.03"},{"v":4068.433333333333,"d":"4068.43"},{"v":4081.8666666666663,"d":"4081.87"},{"v":4103.633333333333,"d":"4103.63"},4060.1,4024.9]
[7,"Nifty Midcap 50",8726.2,{"v":8713.433333333334,"d":"8713.43"},{"v":8694.016666666668,"d":"8694.02"},{"v":8661.833333333334,"d":"8661.83"},{"v":8642.416666666668,"d":"8642.42"},{"v":8745.616666666669,"d":"8745.62"},{"v":8765.033333333333,"d":"8765.03"},{"v":8797.216666666669,"d":"8797.22"},8732.85,8681.25]
[8,"ACC",2320.15,{"v":2307.9,"d":"2307.90"},{"v":2290.8,"d":"2290.80"},{"v":2261.4500000000003,"d":"2261.45"},{"v":2244.3500000000004,"d":"2244.35"},2337.25,{"v":2354.3499999999995,"d":"2354.35"},{"v":2383.7,"d":"2383.70"},2325,2278.55,3.58989]
[9,"AUBANK",1234.35,{"v":1234.3333333333333,"d":"1234.33"},{"v":1222.1666666666665,"d":"1222.17"},{"v":1209.9833333333333,"d":"1209.98"},{"v":1197.8166666666666,"d":"1197.82"},{"v":1246.5166666666664,"d":"1246.52"},{"v":1258.683333333333,"d":"1258.68"},{"v":1270.8666666666663,"d":"1270.87"},1246.5,1222.15,17.14676]
[10,"AARTIIND",1085.15,{"v":1066.8333333333333,"d":"1066.83"},{"v":1045.3666666666666,"d":"1045.37"},{"v":1005.5833333333333,"d":"1005.58"},{"v":984.1166666666666,"d":"984.12"},{"v":1106.6166666666666,"d":"1106.62"},{"v":1128.0833333333333,"d":"1128.08"},{"v":1167.8666666666666,"d":"1167.87"},1088.3,1027.05,20.06629]
[11,"ADANIENT",1752.6,{"v":1739.2333333333333,"d":"1739.23"},{"v":1712.4666666666667,"d":"1712.47"},{"v":1672.3333333333333,"d":"1672.33"},{"v":1645.5666666666666,"d":"1645.57"},{"v":1779.3666666666668,"d":"1779.37"},{"v":1806.1333333333337,"d":"1806.13"},{"v":1846.2666666666669,"d":"1846.27"},1766,1699.1,16.70551]
{"$rows_left_out":227}
{"sheet":"MidCap Intra","index":3,"n_rows":533,"n_cols":13,"rows_kept":533,"merged":[[0,0,0,1],[8,0,9,0],[8,1,9,1],[8,2,9,2],[8,3,9,3],[8,4,8,6],[8,7,8,9]]}
[]
[]
[]
[]
[{"$nulls":11},"Back To Main Page"]
["FOR INTRA DAY TRADING",{"$nulls":9},{"$f":"Main!B10","v":"2022-01-11"}]
[null,null," "]
[]
["Sr.no","Scrip","CLOSE RATE","Pivot Point","Supports",null,null,"Resistances"]
[{"$nulls":4},"S1","S2","S3","R1","R2","R3","HIGH","LOW","Total Trade Quanity in Lakhs"]
[1,"3MINDIA",25564.55,{"v":25565.816666666666,"d":"25565.82"},{"v":25303.73333333333,"d":"25303.73"},{"v":25042.916666666664,"d":"25042.92"},{"v":24780.83333333333,"d":"24780.83"},{"v":25826.63333333333,"d":"25826.63"},{"v":26088.716666666667,"d":"26088.72"},{"v":26349.533333333333,"d":"26349.53"},25827.9,25305,0.0148]
[2,"AARTIDRUGS",529.15,{"v":527.0500000000001,"d":"527.05"},{"v":524.1000000000001,"d":"524.10"},{"v":519.0500000000001,"d":"519.05"},{"v":516.1000000000001,"d":"516.10"},{"v":532.1000000000001,"d":"532.10"},{"v":535.0500000000002,"d":"535.05"},{"v":540.1000000000001,"d":"540.10"},530,522,1.0463]
[3,"AARTIIND",1085.15,{"v":1066.8333333333333,"d":"1066.83"},{"v":1045.3666666666666,"d":"1045.37"},{"v":1005.5833333333333,"d":"1005.58"},{"v":984.1166666666666,"d":"984.12"},{"v":1106.6166666666666,"d":"1106.62"},{"v":1128.0833333333333,"d":"1128.08"},{"v":1167.8666666666666,"d":"1167.87"},1088.3,1027.05,20.06629]
[4,"AAVAS",2733.5,{"v":2766.316666666667,"d":"2766.32"},{"v":2680.1833333333343,"d":"2680.18"},{"v":2626.8666666666672,"d":"2626.87"},{"v":2540.7333333333345,"d":"2540.73"},{"v":2819.633333333334,"d":"2819.63"},{"v":2905.7666666666664,"d":"2905.77"},{"v":2959.083333333334,"d":"2959.08"},2852.45,2713,0.53522]
[5,"ABB",2280.9,{"v":2266.866666666667,"d":"2266.87"},{"v":2237.0333333333338,"d":"2237.03"},{"v":2193.166666666667,"d":"2193.17"},{"v":2163.333333333334,"d":"2163.33"},{"v":2310.7333333333336,"d":"2310.73"},{"v":2340.5666666666666,"d":"2340.57"},{"v":2384.4333333333334,"d":"2384.43"},2296.7,2223,2.89826]
[6,"ABBOTINDIA",18314.05,{"v":18387.683333333334,"d":"18387.68"},{"v":18226.36666666667,"d":"18226.37"},{"v":18138.683333333334,"d":"18138.68"},{"v":17977.36666666667,"d":"17977.37"},{"v":18475.36666666667,"d":"18475.37"},{"v":18636.683333333334,"d":"18636.68"},{"v":18724.36666666667,"d":"18724.37"},18549,18300,0.11833]
[7,"ABCAPITAL",132.45,{"v":132.76666666666665,"d":"132.77"},{"v":131.2833333333333,"d":"131.28"},{"v":130.11666666666665,"d":"130.12"},{"v":128.6333333333333,"d":"128.63"},{"v":133.9333333333333,"d":"133.93"},{"v":135.41666666666666,"d":"135.42"},{"v":136.58333333333331,"d":"136.58"},134.25,131.6,32.17357]
[8,"ABFRL",293.1,{"v":294.53333333333336,"d":"294.53"},{"v":290.7666666666667,"d":"290.77"},{"v":288.43333333333334,"d":"288.43"},{"v":284.6666666666667,"d":"284.67"},{"v":296.86666666666673,"d":"296.87"},{"v":300.6333333333334,"d":"300.63"},{"v":302.96666666666675,"d":"302.97"},298.3,292.2,28.6986]
[9,"ACC",2320.15,{"v":2307.9,"d":"2307.90"},{"v":2290.8,"d":"2290.80"},{"v":2261.4500000000003,"d":"2261.45"},{"v":2244.3500000000004,"d":"2244.35"},2337.25,{"v":2354.3499999999995,"d":"2354.35"},{"v":2383.7,"d":"2383.70"},2325,2278.55,3.58989]
[10,"ADANIENT",1752.6,{"v":1739.2333333333333,"d":"1739.23"},{"v":1712.4666666666667,"d":"1712.47"},{"v":1672.3333333333333,"d":"1672.33"},{"v":1645.5666666666666,"d":"1645.57"},{"v":1779.3666666666668,"d":"1779.37"},{"v":1806.1333333333337,"d":"1806.13"},{"v":1846.2666666666669,"d":"1846.27"},1766,1699.1,16.70551]
{"$rows_left_out":508}
{"sheet":"Bulk Deals","index":4,"n_rows":253,"n_cols":8,"rows_kept":253,"merged":[[4,0,4,1],[4,2,4,3],[6,1,6,2]]}
[" "]
[]
[]
[]
[]
[{"$nulls":4},"Back To Main Page"]
["Subject :","BULK DEAL",null,{"$f":"Main!B10","v":"2022-01-11"}]
[]
["Date","Scrip code","Scrip Name","Client Name","Buy / Sell","Quantity Traded","Trade Price / Wt.Avg.trade price","Exchange  "]
["2022-01-10",539506,"ADCON","PROFICIENT MERCHANDISE LIMITED","SELL",{"v":193854,"d":"193,854"},14.73,"BSE"]
["2022-01-10",539506,"ADCON","GCM CAPITAL ADVISORS LIMITED","BUY",{"v":200000,"d":"200,000"},14.73,"BSE"]
["2022-01-10",543377,"ADISHAKTI","NNM SECURITIES PVT LTD","BUY",{"v":30000,"d":"30,000"},9.97,"BSE"]
["2022-01-10",543377,"ADISHAKTI","NNM SECURITIES PVT LTD","SELL",{"v":30000,"d":"30,000"},9.87,"BSE"]
["2022-01-10",540697,"AMFL","KAPIL AGGARWAL","SELL",{"v":66050,"d":"66,050"},1.52,"BSE"]
["2022-01-10",530109,"ANUPAM","ALPHA LEON ENTERPRISES LLP","BUY",{"v":548686,"d":"548,686"},3.74,"BSE"]
["2022-01-10",530109,"ANUPAM","ALPHA LEON ENTERPRISES LLP","SELL",{"v":340081,"d":"340,081"},3.76,"BSE"]
["2022-01-10",530109,"ANUPAM","HANSRAJ SHIVJI GADA","SELL",{"v":1072000,"d":"1,072,000"},3.74,"BSE"]
["2022-01-10",530109,"ANUPAM","HEMLATA GADA","SELL",{"v":1092000,"d":"1,092,000"},3.74,"BSE"]
["2022-01-10",530109,"ANUPAM","JAYESH MALSI RITA","SELL",{"v":763659,"d":"763,659"},3.74,"BSE"]
["2022-01-10",530233,"AUROLAB","VIVEK MEHROTRA","SELL",{"v":41944,"d":"41,944"},140.97,"BSE"]
{"$rows_left_out":234}
{"sheet":"Call Tracker (Equity & F&O)","index":5,"n_rows":268,"n_cols":18,"rows_kept":268}
[]
[]
[]
[]
[{"$nulls":12},"Back To Main Page"]
["Retail Research Technical Calls & Fundamental Performance Report for the month of Jan-2022"]
[{"$nulls":12},{"$f":"Main!B10","v":"2022-01-11"}]
[null,"Positional  Call"]
["Sr.no","Date",null,"Company","Rec","Rec Price","Stop Loss***","Call Closed At","Target","Remark","Profit / Loss per Share","All charges","Net Gain / Loss  %","Status","Closed Date","Market Closing Price"]
[1,"2021-12-02",null,"CROMPTON","Buy","435-440",414,null,"465-475","Open",{"$nulls":5},{"$f":"VLOOKUP(D10,'MidCap Intra'!B42:C535,2,0)","v":445.05},null,"H"]
[2,"2021-12-02",null,"IOC","Buy","118-120",109,null,"130-135","Open",{"$nulls":5},{"$f":"VLOOKUP(D11,'MidCap Intra'!B43:C536,2,0)","v":119.7},null,"H"]
[3,"2021-12-14",null,"HDFCLIFE","Buy","663-668",635,null,"700-730","Open",{"$nulls":5},{"$f":"VLOOKUP(D12,'MidCap Intra'!B45:C538,2,0)","v":662.95},null,"H"]
[4,"2021-12-17",null,"BEL","Buy",201.5,188,{"v":214.5,"d":"214.50"},"220-230","Profit of Rs.13/-",{"$f":"H13-F13","v":13},{"$f":"(F13*-0.7)/100","v":{"v":-1.4104999999999999,"d":"-1.41"}},{"$f":"(K13+L13)/F13","v":{"v":0.05751612903225807,"d":"5.75%"}},"Successful","2021-01-04",{"$f":"VLOOKUP(D13,'MidCap Intra'!B46:C539,2,0)","v":210.85},null,"H"]
[5,"2021-12-17",null,"ICICIBANK","Buy",730,687,{"v":774,"d":"774.00"},"780-820","Profit of Rs.44/-",44,{"v":-5.109999999999999,"d":"-5.11"},{"v":0.05327397260273973,"d":"5.33%"},"Successful","2021-01-04",{"$f":"VLOOKUP(D14,'MidCap Intra'!B47:C540,2,0)","v":810.75},null,"H"]
[6,"2021-12-22",null,"ACC","Buy",2140,1995,{"v":2280,"d":"2,280.00"},"2350-2450","Profit of Rs.140/-",{"$f":"H15-F15","v":140},{"$f":"(F15*-0.7)/100","v":-14.98},{"$f":"(K15+L15)/F15","v":{"v":0.05842056074766355,"d":"5.84%"}},"Successful","2021-01-07",{"$f":"VLOOKUP(D15,'MidCap Intra'!B2:C541,2,0)","v":2320.15},null,"H"]
[7,"2021-12-27",null,"SUPREMEIND","Buy","2200-2230",2035,null,"2400-2500","Open",{"$nulls":5},{"$f":"VLOOKUP(D16,'MidCap Intra'!B12:M512,2,0)","v":2198.35},null,"H"]
[8,"2021-12-29",null,"ROUTE","Buy",1730,1640,{"v":1810,"d":"1,810.00"},"1900-2000","Part Profit of Rs.80/-",{"$f":"H17-F17","v":80},{"$f":"(F17*-0.7)/100","v":-12.11},{"$f":"(K17+L17)/F17","v":{"v":0.03924277456647399,"d":"3.92%"}},"Successful","2021-12-31",{"$f":"VLOOKUP(D17,'MidCap Intra'!B50:C543,2,0)","v":1813.25},null,"H"]
[9,"2021-12-31",null,"PIIND","Buy",2980,2790,{"v":3105,"d":"3,105.00"},"3200-3400","Part Profit of Rs.125/-",{"$f":"H18-F18","v":125},{"$f":"(F18*-0.7)/100","v":-20.86},{"$f":"(K18+L18)/F18","v":{"v":0.03494630872483222,"d":"3.49%"}},"Successful","2022-01-03",{"$f":"VLOOKUP(D18,'MidCap Intra'!B51:C544,2,0)","v":2887.35},null,"H"]
[10,"2022-01-10",null,"IBREALEST ","Buy","169-171",160,null,"185-190","Open",{"$nulls":7},"N"]
[]
{"$rows_left_out":237}