{"text_format":"3","workbook":"xlsx","n_sheets":6,"sheets":["Main","Future Intra","Cash Intra","MidCap Intra","Bulk Deals","Call Tracker (Equity & F&O)"],"not_rendered":{"images":2,"defined_names":2},"read":"whole","date_system":"1900"}

{"sheet":"Main","index":0,"n_rows":27,"n_cols":11,"rows_kept":27}
[null,"                                                                                                 "]
{"$rows_empty":8}
[null,"2022-03-08"]
[]
[null,"Sheet No.","Template Name","Summary"]
[null,1,"Future Intra","For Intraday trading in F&O segment"]
[null,2,"Cash Intra","For Intraday trading in cash market segment"]
[null,3,"Mid-cap Intra","For Intraday trading in Mid-cap stocks"]
[null,4,"Bulk Deals","Reveals Bulk Deals carried on NSE & BSE"]
[null,5,"Call Tracker"]
{"$rows_empty":9}
[{"$nulls":10},"`"]

{"sheet":"Future Intra","index":1,"n_rows":240,"n_cols":16,"rows_kept":240,"merged":[[8,0,9,0],[8,1,9,1],[8,2,9,2],[8,3,9,3],[8,6,8,8],[8,9,8,11]]}
[]
[]
[]
[]
[{"$nulls":12},"Back to Main Page"]
["FOR INTRA DAY TRADING",{"$nulls":10},{"$f":"Main!B10","v":"2022-03-08"}]
[]
[]
["Sr.no","Sector","Scrip","Expiry Date","CLOSE RATE","Pivot Point","Supports",null,null,"Resistances"]
[{"$nulls":4},"Point","Point","S1","S2","S3","R1","R2","R3","HIGH","LOW","OI","% Change in OI"]
[1,"Index","NIFTY","2022-03-31",{"v":15872.2,"d":"15872.20"},{"v":15847.150000000001,"d":"15847.15"},{"v":15736.200000000003,"d":"15736.20"},{"v":15600.2,"d":"15600.20"},{"v":15489.250000000002,"d":"15489.25"},{"v":15983.150000000003,"d":"15983.15"},{"v":16094.1,"d":"16094.10"},{"v":16230.100000000004,"d":"16230.10"},15958.1,15711.15,16272250,{"v":0.00631099182446723,"d":"0.63%"}]
[2,"Index","BANKNIFTY","2022-03-31",{"v":32975.4,"d":"32975.40"},{"v":33034.53333333333,"d":"33034.53"},{"v":32391.066666666666,"d":"32391.07"},{"v":31806.733333333334,"d":"31806.73"},{"v":31163.266666666666,"d":"31163.27"},{"v":33618.86666666667,"d":"33618.87"},{"v":34262.33333333333,"d":"34262.33"},{"v":34846.666666666664,"d":"34846.67"},33678,32450.2,4863375,{"v":0.11783093622327313,"d":"11.78%"}]
[3,"Index","FINNIFTY","2022-03-29",15432.85,{"v":15417.683333333334,"d":"15417.68"},{"v":15274.366666666669,"d":"15274.37"},{"v":15115.883333333335,"d":"15115.88"},{"v":14972.56666666667,"d":"14972.57"},{"v":15576.166666666668,"d":"15576.17"},{"v":15719.483333333334,"d":"15719.48"},{"v":15877.966666666667,"d":"15877.97"},15561,15259.2,4720,{"v":0.26881720430107525,"d":"26.88%"}]
[4,"Index","MIDCPNIFTY","2022-03-29",{"v":6600,"d":"6600.00"},{"v":6564.966666666667,"d":"6564.97"},{"v":6385.183333333334,"d":"6385.18"},{"v":6170.366666666667,"d":"6170.37"},{"v":5990.583333333334,"d":"5990.58"},{"v":6779.783333333335,"d":"6779.78"},{"v":6959.5666666666675,"d":"6959.57"},{"v":7174.383333333335,"d":"7174.38"},6744.75,6350.15,2100,{"v":0.07692307692307693,"d":"7.69%"}]
[5,"Chemical","AARTIIND","2022-03-31",{"v":807.4,"d":"807.40"},{"v":805.4666666666666,"d":"805.47"},{"v":791.4833333333331,"d":"791.48"},{"v":775.5666666666665,"d":"775.57"},{"v":761.583333333333,"d":"761.58"},{"v":821.3833333333332,"d":"821.38"},{"v":835.3666666666666,"d":"835.37"},{"v":851.2833333333333,"d":"851.28"},819.45,789.55,2512600,{"v":-0.025708635464733027,"d":"-2.57%"}]
[6,"Capital_Goods","ABB","2022-03-31",{"v":2106.1,"d":"2106.10"},{"v":2112,"d":"2112.00"},2074.15,{"v":2042.2000000000003,"d":"2042.20"},{"v":2004.3500000000004,"d":"2004.35"},2143.95,{"v":2181.8,"d":"2181.80"},{"v":2213.7499999999995,"d":"2213.75"},2149.85,2080.05,338000,{"v":0.007451564828614009,"d":"0.75%"}]
[7,"Pharma","ABBOTINDIA","2022-03-31",{"v":17435.2,"d":"17435.20"},{"v":17335.3,"d":"17335.30"},17152.55,{"v":16869.9,"d":"16869.90"},16687.15,{"v":17617.949999999997,"d":"17617.95"},{"v":17800.699999999997,"d":"17800.70"},{"v":18083.349999999995,"d":"18083.35"},17518.05,17052.65,32175,{"v":-0.04948301329394387,"d":"-4.95%"}]
[8,"Others","ABCAPITAL","2022-03-31",98.65,{"v":98.71666666666665,"d":"98.72"},{"v":96.83333333333331,"d":"96.83"},{"v":95.01666666666667,"d":"95.02"},{"v":93.13333333333333,"d":"93.13"},{"v":100.5333333333333,"d":"100.53"},{"v":102.41666666666666,"d":"102.42"},{"v":104.23333333333329,"d":"104.23"},100.6,96.9,15989600,{"v":-2.4704913532802636E-3,"d":"-0.25%"}]
[9,"Textile","ABFRL","2022-03-31",{"v":261.5,"d":"261.50"},{"v":258.9,"d":"258.90"},{"v":254.24999999999994,"d":"254.25"},{"v":246.99999999999997,"d":"247.00"},{"v":242.34999999999994,"d":"242.35"},266.15,{"v":270.80000000000007,"d":"270.80"},{"v":278.04999999999995,"d":"278.05"},263.55,251.65,12792000,{"v":-0.007263922518159807,"d":"-0.73%"}]
[10,"Cement","ACC","2022-03-31",{"v":1949.3,"d":"1949.30"},{"v":1940.6999999999998,"d":"1940.70"},{"v":1911.5499999999997,"d":"1911.55"},{"v":1873.8,"d":"1873.80"},{"v":1844.6499999999999,"d":"1844.65"},{"v":1978.4499999999996,"d":"1978.45"},{"v":2007.5999999999997,"d":"2007.60"},{"v":2045.3499999999995,"d":"2045.35"},1969.85,1902.95,2217000,{"v":-0.012142141027069177,"d":"-1.21%"}]
{"$rows_left_out":211}
{"sheet":"Cash Intra","index":2,"n_rows":246,"n_cols":13,"rows_kept":246,"merged":[[7,0,8,0],[7,1,8,1],[7,2,8,2],[7,3,8,3],[7,4,7,6],[7,7,7,9]]}
[]
[]
[]
[]
[{"$nulls":12},"Back to Main Page"]
["FOR INTRA DAY TRADING",{"$nulls":9},{"$f":"Main!B10","v":"2022-03-08"}]
[]
["Sr.no",null,"CLOSE RATE","Pivot Point","Supports",null,null,"Resistances"]
[{"$nulls":4},"S1","S2","S3","R1","R2","R3","HIGH","LOW","Total Trade Quanity in Lakhs"]
[1,"Nifty 50",15863.15,{"v":15839.733333333332,"d":"15839.73"},{"v":15734.866666666663,"d":"15734.87"},{"v":15606.583333333332,"d":"15606.58"},{"v":15501.716666666664,"d":"15501.72"},{"v":15968.016666666663,"d":"15968.02"},{"v":16072.883333333331,"d":"16072.88"},{"v":16201.166666666662,"d":"16201.17"},15944.6,15711.45]
[2,"Nifty Bank",32871.25,32930.35,{"v":32317.399999999994,"d":"32317.40"},{"v":31763.549999999996,"d":"31763.55"},{"v":31150.59999999999,"d":"31150.60"},{"v":33484.2,"d":"33484.20"},{"v":34097.149999999994,"d":"34097.15"},{"v":34651,"d":"34651.00"},33543.3,32376.5]
[3,"Nifty CPSE",2560.8,{"v":2530.5166666666664,"d":"2530.52"},{"v":2493.933333333333,"d":"2493.93"},{"v":2427.0666666666666,"d":"2427.07"},{"v":2390.483333333333,"d":"2390.48"},{"v":2597.3833333333328,"d":"2597.38"},{"v":2633.9666666666667,"d":"2633.97"},{"v":2700.8333333333326,"d":"2700.83"},2567.1,2463.65]
[4,"Nifty Infra",4578.5,4561.25,{"v":4531,"d":"4531.00"},{"v":4483.5,"d":"4483.50"},4453.25,4608.75,{"v":4639,"d":"4639.00"},{"v":4686.5,"d":"4686.50"},4591.5,4513.75]
[5,"Nifty IT",34135.9,{"v":34023.61666666667,"d":"34023.62"},{"v":33611.63333333334,"d":"33611.63"},{"v":33087.36666666667,"d":"33087.37"},{"v":32675.38333333334,"d":"32675.38"},{"v":34547.88333333334,"d":"34547.88"},{"v":34959.866666666676,"d":"34959.87"},{"v":35484.13333333334,"d":"35484.13"},34435.6,33499.35]
[6,"Nifty PSE",4065.65,{"v":4034.0333333333333,"d":"4034.03"},{"v":3994.2166666666667,"d":"3994.22"},{"v":3922.7833333333333,"d":"3922.78"},{"v":3882.9666666666667,"d":"3882.97"},{"v":4105.466666666667,"d":"4105.47"},{"v":4145.283333333333,"d":"4145.28"},{"v":4216.716666666667,"d":"4216.72"},4073.85,3962.6]
[7,"Nifty Midcap 50",7386.35,{"v":7359.783333333334,"d":"7359.78"},{"v":7303.266666666667,"d":"7303.27"},{"v":7220.183333333333,"d":"7220.18"},{"v":7163.666666666667,"d":"7163.67"},{"v":7442.866666666668,"d":"7442.87"},{"v":7499.383333333334,"d":"7499.38"},{"v":7582.466666666668,"d":"7582.47"},7416.3,7276.7]
[8,"ACC",1950.15,{"v":1942.7166666666665,"d":"1942.72"},{"v":1907.433333333333,"d":"1907.43"},{"v":1864.7166666666665,"d":"1864.72"},{"v":1829.433333333333,"d":"1829.43"},{"v":1985.433333333333,"d":"1985.43"},{"v":2020.7166666666662,"d":"2020.72"},{"v":2063.433333333333,"d":"2063.43"},1978,1900,5.36549]
[9,"AUBANK",1064.9,{"v":1071.5666666666668,"d":"1071.57"},{"v":1045.1833333333336,"d":"1045.18"},{"v":1025.4666666666667,"d":"1025.47"},{"v":999.0833333333335,"d":"999.08"},{"v":1091.2833333333338,"d":"1091.28"},{"v":1117.666666666667,"d":"1117.67"},{"v":1137.383333333334,"d":"1137.38"},1097.95,1051.85,16.26925]
[10,"AARTIIND",804.85,{"v":801.7833333333334,"d":"801.78"},{"v":785.6166666666668,"d":"785.62"},{"v":766.3833333333333,"d":"766.38"},{"v":750.2166666666667,"d":"750.22"},{"v":821.0166666666669,"d":"821.02"},{"v":837.1833333333336,"d":"837.18"},{"v":856.416666666667,"d":"856.42"},817.95,782.55,10.30588]
[11,"ADANIENT",1564.05,{"v":1565.1166666666668,"d":"1565.12"},{"v":1538.2333333333336,"d":"1538.23"},{"v":1512.4166666666667,"d":"1512.42"},{"v":1485.5333333333335,"d":"1485.53"},{"v":1590.9333333333336,"d":"1590.93"},{"v":1617.8166666666668,"d":"1617.82"},{"v":1643.6333333333337,"d":"1643.63"},1592,1539.3,15.08821]
{"$rows_left_out":227}
{"sheet":"MidCap Intra","index":3,"n_rows":531,"n_cols":13,"rows_kept":531,"merged":[[0,0,0,1],[8,0,9,0],[8,1,9,1],[8,2,9,2],[8,3,9,3],[8,4,8,6],[8,7,8,9]]}
[]
[]
[]
[]
[{"$nulls":11},"Back To Main Page"]
["FOR INTRA DAY TRADING",{"$nulls":9},{"$f":"Main!B10","v":"2022-03-08"}]
[null,null," "]
[]
["Sr.no","Scrip","CLOSE RATE","Pivot Point","Supports",null,null,"Resistances"]
[{"$nulls":4},"S1","S2","S3","R1","R2","R3","HIGH","LOW","Total Trade Quanity in Lakhs"]
[1,"3MINDIA",19925.95,{"v":19908.433333333334,"d":"19908.43"},{"v":19617.51666666667,"d":"19617.52"},{"v":19309.083333333336,"d":"19309.08"},{"v":19018.16666666667,"d":"19018.17"},{"v":20216.86666666667,"d":"20216.87"},{"v":20507.783333333333,"d":"20507.78"},{"v":20816.216666666667,"d":"20816.22"},20199.35,19600,0.15772]
[2,"AARTIDRUGS",441.8,{"v":441.3833333333334,"d":"441.38"},{"v":437.76666666666677,"d":"437.77"},{"v":433.7333333333334,"d":"433.73"},{"v":430.1166666666668,"d":"430.12"},{"v":445.41666666666674,"d":"445.42"},{"v":449.0333333333334,"d":"449.03"},{"v":453.0666666666667,"d":"453.07"},445,437.35,1.41782]
[3,"AARTIIND",804.85,{"v":801.7833333333334,"d":"801.78"},{"v":785.6166666666668,"d":"785.62"},{"v":766.3833333333333,"d":"766.38"},{"v":750.2166666666667,"d":"750.22"},{"v":821.0166666666669,"d":"821.02"},{"v":837.1833333333336,"d":"837.18"},{"v":856.416666666667,"d":"856.42"},817.95,782.55,10.30588]
[4,"AAVAS",2600.15,{"v":2556.6833333333334,"d":"2556.68"},{"v":2451.2166666666667,"d":"2451.22"},{"v":2302.2833333333333,"d":"2302.28"},{"v":2196.8166666666666,"d":"2196.82"},{"v":2705.616666666667,"d":"2705.62"},{"v":2811.083333333334,"d":"2811.08"},{"v":2960.016666666667,"d":"2960.02"},2662.15,2407.75,2.60192]
[5,"ABB",2108.95,2112.65,{"v":2076.5,"d":"2076.50"},{"v":2044.0499999999997,"d":"2044.05"},{"v":2007.8999999999996,"d":"2007.90"},{"v":2145.1000000000004,"d":"2145.10"},{"v":2181.250000000001,"d":"2181.25"},{"v":2213.7000000000007,"d":"2213.70"},2148.8,2080.2,1.39363]
[6,"ABBOTINDIA",17415.3,{"v":17321.833333333332,"d":"17321.83"},{"v":17093.716666666664,"d":"17093.72"},{"v":16772.13333333333,"d":"16772.13"},{"v":16544.016666666663,"d":"16544.02"},{"v":17643.416666666664,"d":"17643.42"},{"v":17871.533333333333,"d":"17871.53"},{"v":18193.116666666665,"d":"18193.12"},17549.95,17000.25,0.23513]
[7,"ABCAPITAL",98.6,{"v":98.73333333333333,"d":"98.73"},{"v":96.71666666666667,"d":"96.72"},{"v":94.83333333333333,"d":"94.83"},{"v":92.81666666666666,"d":"92.82"},{"v":100.61666666666667,"d":"100.62"},{"v":102.63333333333335,"d":"102.63"},{"v":104.51666666666668,"d":"104.52"},100.75,96.85,53.63013]
[8,"ABFRL",261.35,{"v":259.1166666666667,"d":"259.12"},{"v":254.23333333333335,"d":"254.23"},{"v":247.11666666666667,"d":"247.12"},{"v":242.23333333333335,"d":"242.23"},{"v":266.23333333333335,"d":"266.23"},{"v":271.1166666666667,"d":"271.12"},{"v":278.23333333333335,"d":"278.23"},264,252,24.74598]
[9,"ACC",1950.15,{"v":1942.7166666666665,"d":"1942.72"},{"v":1907.433333333333,"d":"1907.43"},{"v":1864.7166666666665,"d":"1864.72"},{"v":1829.433333333333,"d":"1829.43"},{"v":1985.433333333333,"d":"1985.43"},{"v":2020.7166666666662,"d":"2020.72"},{"v":2063.433333333333,"d":"2063.43"},1978,1900,5.36549]
[10,"ADANIENT",1564.05,{"v":1565.1166666666668,"d":"1565.12"},{"v":1538.2333333333336,"d":"1538.23"},{"v":1512.4166666666667,"d":"1512.42"},{"v":1485.5333333333335,"d":"1485.53"},{"v":1590.9333333333336,"d":"1590.93"},{"v":1617.8166666666668,"d":"1617.82"},{"v":1643.6333333333337,"d":"1643.63"},1592,1539.3,15.08821]
{"$rows_left_out":512}
{"sheet":"Bulk Deals","index":4,"n_rows":100,"n_cols":8,"rows_kept":100,"merged":[[4,0,4,1],[4,2,4,3],[6,1,6,2]]}
[" "]
[]
[]
[]
[]
[{"$nulls":4},"Back To Main Page"]
["Subject :","BULK DEAL",null,{"$f":"Main!B10","v":"2022-03-08"}]
[]
["Date","Scrip code","Scrip Name","Client Name","Buy / Sell","Quantity Traded","Trade Price / Wt.Avg.trade price","Exchange  "]
["2022-03-07",540615,"7NR","H S SHAH","BUY",{"v":130904,"d":"130,904"},20.88,"BSE"]
["2022-03-07",540615,"7NR","H S SHAH","SELL",{"v":9104,"d":"9,104"},20.95,"BSE"]
["2022-03-07",540615,"7NR","VIKRAMKUMAR KARANRAJ SAKARIA HUF","BUY",{"v":66200,"d":"66,200"},20.55,"BSE"]
["2022-03-07",540615,"7NR","VIKRAMKUMAR KARANRAJ SAKARIA HUF","SELL",{"v":31200,"d":"31,200"},20.96,"BSE"]
["2022-03-07",540615,"7NR","NNM SECURITIES PVT LTD","SELL",{"v":74000,"d":"74,000"},21,"BSE"]
["2022-03-07",539661,"ACEMEN","RAJ DEVANGBHAI PATEL","BUY",{"v":1228,"d":"1,228"},39.92,"BSE"]
["2022-03-07",539661,"ACEMEN","RAJ DEVANGBHAI PATEL","SELL",{"v":17451,"d":"17,451"},39.96,"BSE"]
["2022-03-07",539661,"ACEMEN","URVASHI UMESHBHAI PATEL","BUY",{"v":17000,"d":"17,000"},39.91,"BSE"]
["2022-03-07",537492,"AGRIMONY","RAJ DEVRAJBHAI PATEL","SELL",{"v":60000,"d":"60,000"},10.59,"BSE"]
["2022-03-07",537492,"AGRIMONY","DIPTI MUKUND JARIWALA","SELL",{"v":60000,"d":"60,000"},12.07,"BSE"]
["2022-03-07",537492,"AGRIMONY","VIVEK DHANJIBHAI KALATHIYA","SELL",{"v":120000,"d":"120,000"},11.95,"BSE"]
{"$rows_left_out":81}
{"sheet":"Call Tracker (Equity & F&O)","index":5,"n_rows":281,"n_cols":18,"rows_kept":281}
[]
[]
[]
[]
[{"$nulls":12},"Back To Main Page"]
["Retail Research Technical Calls & Fundamental Performance Report for the month of Mar-2022"]
[{"$nulls":12},{"$f":"Main!B10","v":"2022-03-08"}]
[null,"Positional  Call"]
["Sr.no","Date",null,"Company","Rec","Rec Price","Stop Loss***","Call Closed At","Target","Remark","Profit / Loss per Share","All charges","Net Gain / Loss  %","Status","Closed Date","Market Closing Price"]
[1,"2022-01-21",null,"HCLTECH","Buy","1150-1170",1090,null,"1250-1300","Open",{"$nulls":5},{"$f":"VLOOKUP(D10,'MidCap Intra'!B55:C546,2,0)","v":1154.2},null,"H"]
[2,"2022-01-25",null,"TRENT","Buy",1069,995,{"v":1132.5,"d":"1,132.50"},"1150-1200","Profit of Rs.63.5/-",{"$f":"H11-F11","v":63.5},{"$f":"(F11*-0.7)/100","v":{"v":-7.483,"d":"-7.48"}},{"$f":"(K11+L11)/F11","v":{"v":0.05240130963517306,"d":"5.24%"}},"Successful","2022-03-03",null,null,"H"]
[3,"2022-02-11",null,"CARBORUNIV","Buy",847.5,798,{"v":798,"d":"798.00"},"920-960","Loss of Rs.49.5/-",{"$f":"H12-F12","v":-49.5},{"$f":"(F12*-0.7)/100","v":{"v":-5.9325,"d":"-5.93"}},{"$f":"(K12+L12)/F12","v":{"v":-0.06540707964601769,"d":"-6.54%"}},"Unsuccessful","2022-03-03",null,null,"H"]
[4,"2022-02-28",null,"REDINGTON","Buy",148,138,{"v":156,"d":"156.00"},"160-170","Profit of Rs.8/-",{"$f":"H13-F13","v":8},{"$f":"(F13*-0.4)/100","v":{"v":-0.5920000000000001,"d":"-0.59"}},{"$f":"(K13+L13)/F13","v":{"v":0.050054054054054054,"d":"5.01%"}},"Successful","2022-03-03"]
[5,"2022-02-28",null,"HDFC","Buy",2360,2230,{"v":2230,"d":"2,230.00"},"2500-2600","Loss of Rs.130/-",-130,{"$f":"(F14*-0.7)/100","v":-16.52},{"v":-0.06208474576271187,"d":"-6.21%"},"Unsuccessful","2022-03-04"]
[6,"2022-02-28",null,"ICICIBANK","Buy",715,675,{"$f":"(675+738.5)/2","v":706.75},"750-780","Loss of Rs.8.25/-",{"$f":"H15-F15","v":-8.25},{"$f":"(F15*-0.4)/100","v":-2.86},{"$f":"(K15+L15)/F15","v":{"v":-0.015538461538461537,"d":"-1.55%"}},"Unsuccessful","2022-03-08",{"$f":"VLOOKUP(D15,'MidCap Intra'!B11:C566,2,0)","v":653.75}]
[7,"2022-02-28",null,"AARTIIND","Buy",925,860,{"v":860,"d":"860.00"},"1000-1050","Loss of Rs.65/-",-65,{"$f":"(F16*-0.7)/100","v":{"v":-6.475,"d":"-6.48"}},{"v":-0.07727027027027027,"d":"-7.73%"},"Unsuccessful","2022-03-04"]
[8,"2022-03-02",null,"BHARTIARTL","Buy","666-672",618,null,"740-780","Open",{"$nulls":5},{"$f":"VLOOKUP(D17,'MidCap Intra'!B13:C568,2,0)","v":675.4}]
[9,"2022-03-03",null,"ACC","Buy","1990-2005",1870,null,"2150-2250","Open",{"$nulls":5},{"$f":"VLOOKUP(D18,'MidCap Intra'!B14:C569,2,0)","v":1950.15}]
[10,"2022-03-07",null,"TRENT","Buy","1065-1075",990,null,"1140-1200","Open",{"$nulls":5},{"$f":"VLOOKUP(D19,'MidCap Intra'!B15:C570,2,0)","v":1064.2}]
[11,"2022-03-07",null,"RELIANCE","Buy","2270-2290",2170,null,"2450-2550","Open",{"$nulls":5},{"$f":"VLOOKUP(D20,'MidCap Intra'!B16:C571,2,0)","v":2239.55}]
{"$rows_left_out":250}