{"text_format":"3","workbook":"xlsx","n_sheets":6,"sheets":["Main","Future Intra","Cash Intra","MidCap Intra","Bulk Deals","Call Tracker (Equity & F&O)"],"not_rendered":{"images":2,"defined_names":2},"read":"whole","date_system":"1900"}

{"sheet":"Main","index":0,"n_rows":27,"n_cols":11,"rows_kept":27}
[null,"                                                                                                 "]
{"$rows_empty":8}
[null,"2022-01-05"]
[]
[null,"Sheet No.","Template Name","Summary"]
[null,1,"Future Intra","For Intraday trading in F&O segment"]
[null,2,"Cash Intra","For Intraday trading in cash market segment"]
[null,3,"Mid-cap Intra","For Intraday trading in Mid-cap stocks"]
[null,4,"Bulk Deals","Reveals Bulk Deals carried on NSE & BSE"]
[null,5,"Call Tracker"]
{"$rows_empty":9}
[{"$nulls":10},"`"]

{"sheet":"Future Intra","index":1,"n_rows":240,"n_cols":16,"rows_kept":240,"merged":[[8,0,9,0],[8,1,9,1],[8,2,9,2],[8,3,9,3],[8,6,8,8],[8,9,8,11]]}
[]
[]
[]
[]
[{"$nulls":12},"Back to Main Page"]
["FOR INTRA DAY TRADING",{"$nulls":10},{"$f":"Main!B10","v":"2022-01-05"}]
[]
[]
["Sr.no","Sector","Scrip","Expiry Date","CLOSE RATE","Pivot Point","Supports",null,null,"Resistances"]
[{"$nulls":4},"Point","Point","S1","S2","S3","R1","R2","R3","HIGH","LOW","OI","% Change in OI"]
[1,"Index","BANKNIFTY","2022-01-27",36977.35,{"v":36830.950000000004,"d":"36830.95"},{"v":36638.50000000001,"d":"36638.50"},36299.65,{"v":36107.200000000004,"d":"36107.20"},{"v":37169.80000000001,"d":"37169.80"},{"v":37362.25000000001,"d":"37362.25"},{"v":37701.10000000001,"d":"37701.10"},37023.4,36492.1,2324675,{"v":-0.08849678968779101,"d":"-8.85%"}]
[2,"Index","NIFTY","2022-01-27",17846.75,{"v":17783.31666666667,"d":"17783.32"},{"v":17695.83333333334,"d":"17695.83"},{"v":17544.91666666667,"d":"17544.92"},{"v":17457.43333333334,"d":"17457.43"},{"v":17934.233333333337,"d":"17934.23"},{"v":18021.716666666667,"d":"18021.72"},{"v":18172.633333333335,"d":"18172.63"},17870.8,17632.4,11483850,{"v":-0.005714359926752295,"d":"-0.57%"}]
[3,"Index","FINNIFTY","2022-01-25",18022.05,{"v":17960.350000000002,"d":"17960.35"},{"v":17886.700000000004,"d":"17886.70"},{"v":17751.350000000002,"d":"17751.35"},{"v":17677.700000000004,"d":"17677.70"},{"v":18095.700000000004,"d":"18095.70"},{"v":18169.350000000006,"d":"18169.35"},{"v":18304.700000000004,"d":"18304.70"},18034,17825,1680,{"v":-0.20754716981132076,"d":"-20.75%"}]
[4,"Chemical","AARTIIND","2022-01-27",{"v":997.2,"d":"997.20"},{"v":1004.1999999999999,"d":"1004.20"},978.55,{"v":959.9,"d":"959.90"},934.25,{"v":1022.8499999999999,"d":"1022.85"},{"v":1048.4999999999998,"d":"1048.50"},{"v":1067.1499999999999,"d":"1067.15"},1029.85,985.55,2368100,{"v":0.12293430068520758,"d":"12.29%"}]
[5,"Pharma","ABBOTINDIA","2022-01-27",{"v":19090.9,"d":"19090.90"},{"v":19195.433333333334,"d":"19195.43"},{"v":18895.466666666667,"d":"18895.47"},{"v":18700.033333333333,"d":"18700.03"},{"v":18400.066666666666,"d":"18400.07"},{"v":19390.86666666667,"d":"19390.87"},{"v":19690.833333333336,"d":"19690.83"},{"v":19886.26666666667,"d":"19886.27"},19495.4,19000,32900,{"v":0.09666666666666666,"d":"9.67%"}]
[6,"Others","ABCAPITAL","2022-01-27",131.55,{"v":130.91666666666666,"d":"130.92"},{"v":128.13333333333333,"d":"128.13"},{"v":124.71666666666667,"d":"124.72"},{"v":121.93333333333334,"d":"121.93"},{"v":134.33333333333331,"d":"134.33"},{"v":137.11666666666667,"d":"137.12"},{"v":140.5333333333333,"d":"140.53"},133.7,127.5,8588800,{"v":0.1543465405085748,"d":"15.43%"}]
[7,"Textile","ABFRL","2022-01-27",287.55,{"v":283.4666666666667,"d":"283.47"},{"v":277.8833333333334,"d":"277.88"},{"v":268.2166666666667,"d":"268.22"},{"v":262.6333333333334,"d":"262.63"},{"v":293.1333333333334,"d":"293.13"},{"v":298.71666666666664,"d":"298.72"},{"v":308.3833333333334,"d":"308.38"},289.05,273.8,10964200,{"v":0.07466870540265036,"d":"7.47%"}]
[8,"Cement","ACC","2022-01-27",2233.35,2243.65,{"v":2214.7000000000003,"d":"2214.70"},2196.05,{"v":2167.1000000000004,"d":"2167.10"},{"v":2262.3,"d":"2262.30"},2291.25,{"v":2309.9,"d":"2309.90"},2272.6,2225,2584250,{"v":-0.03527764815678955,"d":"-3.53%"}]
[9,"Others","ADANIENT","2022-01-27",1725.55,{"v":1722.8666666666668,"d":"1722.87"},{"v":1708.2333333333336,"d":"1708.23"},{"v":1690.9166666666667,"d":"1690.92"},{"v":1676.2833333333335,"d":"1676.28"},{"v":1740.1833333333336,"d":"1740.18"},{"v":1754.8166666666668,"d":"1754.82"},{"v":1772.1333333333337,"d":"1772.13"},1737.5,1705.55,20948000,{"v":-2.5949291750982026E-3,"d":"-0.26%"}]
[10,"Others","ADANIPORTS","2022-01-27",{"v":742.3,"d":"742.30"},{"v":742.4666666666667,"d":"742.47"},{"v":735.2333333333333,"d":"735.23"},{"v":728.1666666666666,"d":"728.17"},{"v":720.9333333333333,"d":"720.93"},{"v":749.5333333333334,"d":"749.53"},{"v":756.7666666666668,"d":"756.77"},{"v":763.8333333333335,"d":"763.83"},749.7,735.4,86671250,{"v":0.000764967380636222,"d":"0.08%"}]
{"$rows_left_out":208}
{"sheet":"Cash Intra","index":2,"n_rows":246,"n_cols":13,"rows_kept":246,"merged":[[7,0,8,0],[7,1,8,1],[7,2,8,2],[7,3,8,3],[7,4,7,6],[7,7,7,9]]}
[]
[]
[]
[]
[{"$nulls":12},"Back to Main Page"]
["FOR INTRA DAY TRADING",{"$nulls":9},{"$f":"Main!B10","v":"2022-01-05"}]
[]
["Sr.no",null,"CLOSE RATE","Pivot Point","Supports",null,null,"Resistances"]
[{"$nulls":4},"S1","S2","S3","R1","R2","R3","HIGH","LOW","Total Trade Quanity in Lakhs"]
[1,"Nifty 50",17805.25,{"v":17742.13333333333,"d":"17742.13"},{"v":17656.666666666664,"d":"17656.67"},{"v":17508.083333333332,"d":"17508.08"},{"v":17422.616666666665,"d":"17422.62"},{"v":17890.716666666664,"d":"17890.72"},{"v":17976.18333333333,"d":"17976.18"},{"v":18124.766666666663,"d":"18124.77"},17827.6,17593.55]
[2,"Nifty Bank",36840.15,{"v":36700.78333333333,"d":"36700.78"},{"v":36513.76666666666,"d":"36513.77"},{"v":36187.38333333333,"d":"36187.38"},{"v":36000.36666666666,"d":"36000.37"},{"v":37027.166666666664,"d":"37027.17"},{"v":37214.18333333334,"d":"37214.18"},{"v":37540.566666666666,"d":"37540.57"},36887.8,36374.4]
[3,"Nifty CPSE",2349.1,{"v":2338.9166666666665,"d":"2338.92"},{"v":2316.433333333333,"d":"2316.43"},{"v":2283.7666666666664,"d":"2283.77"},{"v":2261.283333333333,"d":"2261.28"},{"v":2371.583333333333,"d":"2371.58"},{"v":2394.0666666666666,"d":"2394.07"},{"v":2426.733333333333,"d":"2426.73"},2361.4,2306.25]
[4,"Nifty Infra",5068.7,{"v":5052.150000000001,"d":"5052.15"},{"v":5031.500000000001,"d":"5031.50"},{"v":4994.3,"d":"4994.30"},{"v":4973.650000000001,"d":"4973.65"},{"v":5089.350000000001,"d":"5089.35"},{"v":5110.000000000001,"d":"5110.00"},{"v":5147.200000000002,"d":"5147.20"},5072.8,5014.95]
[5,"Nifty IT",39370.7,{"v":39215.333333333336,"d":"39215.33"},{"v":38983.966666666674,"d":"38983.97"},{"v":38597.23333333334,"d":"38597.23"},{"v":38365.866666666676,"d":"38365.87"},{"v":39602.06666666667,"d":"39602.07"},{"v":39833.43333333333,"d":"39833.43"},{"v":40220.16666666667,"d":"40220.17"},39446.7,38828.6]
[6,"Nifty PSE",3952.45,{"v":3942.9833333333336,"d":"3942.98"},{"v":3915.966666666667,"d":"3915.97"},{"v":3879.4833333333336,"d":"3879.48"},{"v":3852.466666666667,"d":"3852.47"},{"v":3979.466666666667,"d":"3979.47"},{"v":4006.4833333333336,"d":"4006.48"},{"v":4042.966666666667,"d":"4042.97"},3970,3906.5]
[7,"Nifty Midcap 50",8559.15,{"v":8546.5,"d":"8546.50"},8509.65,8460.15,{"v":8423.3,"d":"8423.30"},{"v":8596,"d":"8596.00"},{"v":8632.849999999999,"d":"8632.85"},8682.35,8583.35,8497]
[8,"ACC",2224.3,{"v":2235.2000000000003,"d":"2235.20"},{"v":2205.6000000000004,"d":"2205.60"},{"v":2186.9,"d":"2186.90"},{"v":2157.3,"d":"2157.30"},{"v":2253.9000000000005,"d":"2253.90"},{"v":2283.5,"d":"2283.50"},{"v":2302.2000000000007,"d":"2302.20"},2264.8,2216.5,3.63436]
[9,"AUBANK",1095.9,{"v":1090.8833333333332,"d":"1090.88"},{"v":1076.9666666666665,"d":"1076.97"},{"v":1058.0333333333333,"d":"1058.03"},{"v":1044.1166666666666,"d":"1044.12"},{"v":1109.8166666666664,"d":"1109.82"},{"v":1123.7333333333333,"d":"1123.73"},{"v":1142.6666666666663,"d":"1142.67"},1104.8,1071.95,14.32337]
[10,"AARTIIND",992,{"v":999.9333333333334,"d":"999.93"},{"v":975.2166666666667,"d":"975.22"},{"v":958.4333333333333,"d":"958.43"},{"v":933.7166666666666,"d":"933.72"},{"v":1016.7166666666668,"d":"1016.72"},{"v":1041.4333333333334,"d":"1041.43"},{"v":1058.216666666667,"d":"1058.22"},1024.65,983.15,10.6718]
[11,"ADANIENT",1719,{"v":1715.6666666666667,"d":"1715.67"},{"v":1703.3333333333335,"d":"1703.33"},{"v":1687.6666666666667,"d":"1687.67"},{"v":1675.3333333333335,"d":"1675.33"},{"v":1731.3333333333335,"d":"1731.33"},{"v":1743.666666666667,"d":"1743.67"},{"v":1759.3333333333335,"d":"1759.33"},1728,1700,11.91189]
{"$rows_left_out":227}
{"sheet":"MidCap Intra","index":3,"n_rows":533,"n_cols":13,"rows_kept":533,"merged":[[0,0,0,1],[8,0,9,0],[8,1,9,1],[8,2,9,2],[8,3,9,3],[8,4,8,6],[8,7,8,9]]}
[]
[]
[]
[]
[{"$nulls":11},"Back To Main Page"]
["FOR INTRA DAY TRADING",{"$nulls":9},{"$f":"Main!B10","v":"2022-01-05"}]
[null,null," "]
[]
["Sr.no","Scrip","CLOSE RATE","Pivot Point","Supports",null,null,"Resistances"]
[{"$nulls":4},"S1","S2","S3","R1","R2","R3","HIGH","LOW","Total Trade Quanity in Lakhs"]
[1,"3MINDIA",25612.45,{"v":25696.766666666663,"d":"25696.77"},{"v":25423.533333333326,"d":"25423.53"},{"v":25234.61666666666,"d":"25234.62"},{"v":24961.383333333324,"d":"24961.38"},{"v":25885.683333333327,"d":"25885.68"},{"v":26158.916666666664,"d":"26158.92"},{"v":26347.83333333333,"d":"26347.83"},25970,25507.85,0.05996]
[2,"AARTIDRUGS",538,{"v":540.2333333333333,"d":"540.23"},{"v":533.7666666666667,"d":"533.77"},{"v":529.5333333333333,"d":"529.53"},{"v":523.0666666666666,"d":"523.07"},{"v":544.4666666666667,"d":"544.47"},{"v":550.9333333333334,"d":"550.93"},{"v":555.1666666666667,"d":"555.17"},546.7,536,0.8658]
[3,"AARTIIND",992,{"v":999.9333333333334,"d":"999.93"},{"v":975.2166666666667,"d":"975.22"},{"v":958.4333333333333,"d":"958.43"},{"v":933.7166666666666,"d":"933.72"},{"v":1016.7166666666668,"d":"1016.72"},{"v":1041.4333333333334,"d":"1041.43"},{"v":1058.216666666667,"d":"1058.22"},1024.65,983.15,10.6718]
[4,"AAVAS",2771,{"v":2723.5499999999997,"d":"2723.55"},{"v":2662.0999999999995,"d":"2662.10"},{"v":2553.2,"d":"2553.20"},{"v":2491.7499999999995,"d":"2491.75"},{"v":2832.4499999999994,"d":"2832.45"},{"v":2893.899999999999,"d":"2893.90"},{"v":3002.7999999999993,"d":"3002.80"},2785,2614.65,0.8935]
[5,"ABB",2219.75,{"v":2215.7999999999997,"d":"2215.80"},{"v":2193.9499999999994,"d":"2193.95"},{"v":2168.1499999999996,"d":"2168.15"},{"v":2146.2999999999993,"d":"2146.30"},{"v":2241.5999999999995,"d":"2241.60"},2263.45,{"v":2289.2499999999995,"d":"2289.25"},2237.65,2190,3.53471]
[6,"ABBOTINDIA",18986.2,{"v":19097.733333333334,"d":"19097.73"},{"v":18797.516666666666,"d":"18797.52"},{"v":18608.833333333332,"d":"18608.83"},{"v":18308.616666666665,"d":"18308.62"},{"v":19286.416666666668,"d":"19286.42"},{"v":19586.633333333335,"d":"19586.63"},{"v":19775.31666666667,"d":"19775.32"},19397.95,18909.05,0.12711]
[7,"ABCAPITAL",130.9,130.15,{"v":127.80000000000001,"d":"127.80"},{"v":124.7,"d":"124.70"},{"v":122.35000000000001,"d":"122.35"},133.25,{"v":135.59999999999997,"d":"135.60"},{"v":138.70000000000002,"d":"138.70"},132.5,127.05,108.8447]
[8,"ABFRL",286.35,282.25,276.35,266.35,{"v":260.45000000000005,"d":"260.45"},292.25,298.15,308.15,288.15,272.25,52.30203]
[9,"ACC",2224.3,{"v":2235.2000000000003,"d":"2235.20"},{"v":2205.6000000000004,"d":"2205.60"},{"v":2186.9,"d":"2186.90"},{"v":2157.3,"d":"2157.30"},{"v":2253.9000000000005,"d":"2253.90"},{"v":2283.5,"d":"2283.50"},{"v":2302.2000000000007,"d":"2302.20"},2264.8,2216.5,3.63436]
[10,"ADANIENT",1719,{"v":1715.6666666666667,"d":"1715.67"},{"v":1703.3333333333335,"d":"1703.33"},{"v":1687.6666666666667,"d":"1687.67"},{"v":1675.3333333333335,"d":"1675.33"},{"v":1731.3333333333335,"d":"1731.33"},{"v":1743.666666666667,"d":"1743.67"},{"v":1759.3333333333335,"d":"1759.33"},1728,1700,11.91189]
{"$rows_left_out":508}
{"sheet":"Bulk Deals","index":4,"n_rows":355,"n_cols":8,"rows_kept":355,"merged":[[4,0,4,1],[4,2,4,3],[6,1,6,2]]}
[" "]
[]
[]
[]
[]
[{"$nulls":4},"Back To Main Page"]
["Subject :","BULK DEAL",null,{"$f":"Main!B10","v":"2022-01-05"}]
[]
["Date","Scrip code","Scrip Name","Client Name","Buy / Sell","Quantity Traded","Trade Price / Wt.Avg.trade price","Exchange  "]
["2022-01-04",540615,"7NR","S N TRADEX","BUY",{"v":93072,"d":"93,072"},18.5,"BSE"]
["2022-01-04",530043,"ACKNIT","VED PRAKASH AGARWAL","BUY",{"v":28000,"d":"28,000"},152.76,"BSE"]
["2022-01-04",539506,"ADCON","KANCHANBHAI THAKORBHAI JAIN","SELL",{"v":100000,"d":"100,000"},11,"BSE"]
["2022-01-04",539506,"ADCON","GEETA MONDAL","BUY",{"v":50000,"d":"50,000"},11,"BSE"]
["2022-01-04",539506,"ADCON","ANITA ROY","BUY",{"v":50000,"d":"50,000"},11,"BSE"]
["2022-01-04",539506,"ADCON","JYOTI CHANDAK","BUY",{"v":20000,"d":"20,000"},11,"BSE"]
["2022-01-04",539506,"ADCON","BSAS SECURITIES LTD","SELL",{"v":20016,"d":"20,016"},11.06,"BSE"]
["2022-01-04",543377,"ADISHAKTI","PRAVINKUMAR MEHTA","SELL",{"v":30000,"d":"30,000"},9.59,"BSE"]
["2022-01-04",543377,"ADISHAKTI","NNM SECURITIES PVT LTD","BUY",{"v":40000,"d":"40,000"},9.59,"BSE"]
["2022-01-04",543377,"ADISHAKTI","NNM SECURITIES PVT LTD","SELL",{"v":20000,"d":"20,000"},9.59,"BSE"]
["2022-01-04",530889,"ALKA","ALPHA LEON ENTERPRISES LLP","BUY",4,3.47,"BSE"]
{"$rows_left_out":336}
{"sheet":"Call Tracker (Equity & F&O)","index":5,"n_rows":244,"n_cols":18,"rows_kept":244}
[]
[]
[]
[]
[{"$nulls":12},"Back To Main Page"]
["Retail Research Technical Calls & Fundamental Performance Report for the month of Jan-2022"]
[{"$nulls":12},{"$f":"Main!B10","v":"2022-01-05"}]
[null,"Positional  Call"]
["Sr.no","Date",null,"Company","Rec","Rec Price","Stop Loss***","Call Closed At","Target","Remark","Profit / Loss per Share","All charges","Net Gain / Loss  %","Status","Closed Date","Market Closing Price"]
[1,"2021-12-02",null,"CROMPTON","Buy","435-440",414,null,"465-475","Open",{"$nulls":5},{"$f":"VLOOKUP(D10,'MidCap Intra'!B42:C535,2,0)","v":436.05},null,"H"]
[2,"2021-12-02",null,"IOC","Buy","118-120",109,null,"130-135","Open",{"$nulls":5},{"$f":"VLOOKUP(D11,'MidCap Intra'!B43:C536,2,0)","v":114.05},null,"H"]
[3,"2021-12-14",null,"HDFCLIFE","Buy","663-668",635,null,"700-730","Open",{"$nulls":5},{"$f":"VLOOKUP(D12,'MidCap Intra'!B45:C538,2,0)","v":653.15},null,"H"]
[4,"2021-12-17",null,"BEL","Buy",201.5,188,{"v":214.5,"d":"214.50"},"220-230","Profit of Rs.13/-",{"$f":"H13-F13","v":13},{"$f":"(F13*-0.7)/100","v":{"v":-1.4104999999999999,"d":"-1.41"}},{"$f":"(K13+L13)/F13","v":{"v":0.05751612903225807,"d":"5.75%"}},"Successful","2021-01-04",null,null,"H"]
[5,"2021-12-17",null,"ICICIBANK","Buy",730,687,{"v":774,"d":"774.00"},"780-820","Profit of Rs.44/-",44,{"v":-5.109999999999999,"d":"-5.11"},{"v":0.05327397260273973,"d":"5.33%"},"Successful","2021-01-04",null,null,"H"]
[6,"2021-12-22",null,"ACC","Buy",2140,1995,{"v":2234,"d":"2,234.00"},"2350-2450","Part Profit of Rs.94/-",{"$f":"H15-F15","v":94},{"$f":"(F15*-0.7)/100","v":-14.98},{"$f":"(K15+L15)/F15","v":{"v":0.03692523364485981,"d":"3.69%"}},"Successful","2021-12-31",{"$f":"VLOOKUP(D15,'MidCap Intra'!B2:C541,2,0)","v":2224.3},null,"H"]
[7,"2021-12-27",null,"SUPREMEIND","Buy","2200-2230",2035,null,"2400-2500","Open",{"$nulls":5},{"$f":"VLOOKUP(D16,'MidCap Intra'!B12:M512,2,0)","v":2226.25},null,"H"]
[8,"2021-12-29",null,"ROUTE","Buy",1730,1640,{"v":1810,"d":"1,810.00"},"1900-2000","Part Profit of Rs.80/-",{"$f":"H17-F17","v":80},{"$f":"(F17*-0.7)/100","v":-12.11},{"$f":"(K17+L17)/F17","v":{"v":0.03924277456647399,"d":"3.92%"}},"Successful","2021-12-31",{"$f":"VLOOKUP(D17,'MidCap Intra'!B50:C543,2,0)","v":1821.85},null,"H"]
[9,"2021-12-31",null,"PIIND","Buy",2980,2790,{"v":3105,"d":"3,105.00"},"3200-3400","Part Profit of Rs.125/-",{"$f":"H18-F18","v":125},{"$f":"(F18*-0.7)/100","v":-20.86},{"$f":"(K18+L18)/F18","v":{"v":0.03494630872483222,"d":"3.49%"}},"Successful","2022-01-03",{"$f":"VLOOKUP(D18,'MidCap Intra'!B51:C544,2,0)","v":3013.9},null,"H"]
[]
[]
{"$rows_left_out":224}