{"text_format":"3","workbook":"xlsx","n_sheets":6,"sheets":["Main","Future Intra","Cash Intra","MidCap Intra","Bulk Deals","Call Tracker (Equity & F&O)"],"not_rendered":{"images":2,"defined_names":2},"read":"whole","date_system":"1900"}

{"sheet":"Main","index":0,"n_rows":27,"n_cols":11,"rows_kept":27}
[null,"                                                                                                 "]
{"$rows_empty":8}
[null,"2022-01-04"]
[]
[null,"Sheet No.","Template Name","Summary"]
[null,1,"Future Intra","For Intraday trading in F&O segment"]
[null,2,"Cash Intra","For Intraday trading in cash market segment"]
[null,3,"Mid-cap Intra","For Intraday trading in Mid-cap stocks"]
[null,4,"Bulk Deals","Reveals Bulk Deals carried on NSE & BSE"]
[null,5,"Call Tracker"]
{"$rows_empty":9}
[{"$nulls":10},"`"]

{"sheet":"Future Intra","index":1,"n_rows":240,"n_cols":16,"rows_kept":240,"merged":[[8,0,9,0],[8,1,9,1],[8,2,9,2],[8,3,9,3],[8,6,8,8],[8,9,8,11]]}
[]
[]
[]
[]
[{"$nulls":12},"Back to Main Page"]
["FOR INTRA DAY TRADING",{"$nulls":10},{"$f":"Main!B10","v":"2022-01-04"}]
[]
[]
["Sr.no","Sector","Scrip","Expiry Date","CLOSE RATE","Pivot Point","Supports",null,null,"Resistances"]
[{"$nulls":4},"Point","Point","S1","S2","S3","R1","R2","R3","HIGH","LOW","OI","% Change in OI"]
[1,"Index","BANKNIFTY","2022-01-27",36582.45,36292.25,{"v":35940.5,"d":"35940.50"},35298.55,{"v":34946.8,"d":"34946.80"},{"v":36934.2,"d":"36934.20"},37285.95,{"v":37927.899999999994,"d":"37927.90"},36644,35650.3,2550375,{"v":0.03587457606466156,"d":"3.59%"}]
[2,"Index","NIFTY","2022-01-27",17677.95,17593.45,{"v":17494.550000000003,"d":"17494.55"},17311.15,{"v":17212.250000000004,"d":"17212.25"},{"v":17776.850000000002,"d":"17776.85"},{"v":17875.750000000004,"d":"17875.75"},18059.15,17692.35,17410.05,11549850,{"v":0.03425163534768768,"d":"3.43%"}]
[3,"Index","FINNIFTY","2021-12-28",17864.95,{"v":17713.61666666667,"d":"17713.62"},{"v":17538.283333333336,"d":"17538.28"},{"v":17211.61666666667,"d":"17211.62"},{"v":17036.283333333336,"d":"17036.28"},{"v":18040.283333333336,"d":"18040.28"},{"v":18215.616666666665,"d":"18215.62"},{"v":18542.283333333336,"d":"18542.28"},17888.95,17386.95,2120,{"v":0.358974358974359,"d":"35.90%"}]
[4,"Chemical","AARTIIND","2022-01-27",1022.65,{"v":1018.9333333333334,"d":"1018.93"},{"v":1006.7166666666667,"d":"1006.72"},{"v":990.7833333333333,"d":"990.78"},{"v":978.5666666666666,"d":"978.57"},{"v":1034.8666666666668,"d":"1034.87"},{"v":1047.0833333333335,"d":"1047.08"},{"v":1063.0166666666669,"d":"1063.02"},1031.15,1003,2108850,{"v":0.04771959459459459,"d":"4.77%"}]
[5,"Pharma","ABBOTINDIA","2022-01-27",{"v":19399.8,"d":"19399.80"},{"v":19485.63333333333,"d":"19485.63"},{"v":19264.166666666664,"d":"19264.17"},{"v":19128.533333333333,"d":"19128.53"},{"v":18907.066666666666,"d":"18907.07"},{"v":19621.266666666663,"d":"19621.27"},{"v":19842.73333333333,"d":"19842.73"},{"v":19978.36666666666,"d":"19978.37"},19707.1,19350,30000,{"v":0.04529616724738676,"d":"4.53%"}]
[6,"Others","ABCAPITAL","2022-01-27",130.25,{"v":128.63333333333333,"d":"128.63"},{"v":126.01666666666665,"d":"126.02"},{"v":121.78333333333333,"d":"121.78"},{"v":119.16666666666666,"d":"119.17"},{"v":132.86666666666665,"d":"132.87"},{"v":135.48333333333332,"d":"135.48"},{"v":139.71666666666664,"d":"139.72"},131.25,124.4,7440400,{"v":0.5220522052205221,"d":"52.21%"}]
[7,"Textile","ABFRL","2022-01-27",275.05,{"v":273.6166666666667,"d":"273.62"},{"v":271.43333333333334,"d":"271.43"},{"v":267.81666666666666,"d":"267.82"},{"v":265.6333333333333,"d":"265.63"},{"v":277.23333333333335,"d":"277.23"},{"v":279.41666666666674,"d":"279.42"},{"v":283.03333333333336,"d":"283.03"},275.8,270,10202400,{"v":0.016317016317016316,"d":"1.63%"}]
[8,"Cement","ACC","2022-01-27",2260.35,{"v":2249.9833333333336,"d":"2249.98"},{"v":2231.966666666667,"d":"2231.97"},{"v":2203.5833333333335,"d":"2203.58"},{"v":2185.566666666667,"d":"2185.57"},{"v":2278.3666666666672,"d":"2278.37"},{"v":2296.3833333333337,"d":"2296.38"},{"v":2324.7666666666673,"d":"2324.77"},2268,2221.6,2678750,{"v":0.02693118650565459,"d":"2.69%"}]
[9,"Others","ADANIENT","2022-01-27",1724.85,{"v":1727.6166666666668,"d":"1727.62"},{"v":1714.2333333333336,"d":"1714.23"},{"v":1703.6166666666668,"d":"1703.62"},{"v":1690.2333333333336,"d":"1690.23"},{"v":1738.2333333333336,"d":"1738.23"},{"v":1751.6166666666668,"d":"1751.62"},{"v":1762.2333333333336,"d":"1762.23"},1741,1717,21002500,{"v":-0.006316237698713096,"d":"-0.63%"}]
[10,"Others","ADANIPORTS","2022-01-27",{"v":739.9,"d":"739.90"},{"v":738.8166666666666,"d":"738.82"},{"v":735.1833333333332,"d":"735.18"},{"v":730.4666666666666,"d":"730.47"},{"v":726.8333333333331,"d":"726.83"},{"v":743.5333333333332,"d":"743.53"},{"v":747.1666666666666,"d":"747.17"},{"v":751.8833333333332,"d":"751.88"},742.45,734.1,86605000,{"v":-1.0381221523732625E-3,"d":"-0.10%"}]
{"$rows_left_out":208}
{"sheet":"Cash Intra","index":2,"n_rows":246,"n_cols":13,"rows_kept":246,"merged":[[7,0,8,0],[7,1,8,1],[7,2,8,2],[7,3,8,3],[7,4,7,6],[7,7,7,9]]}
[]
[]
[]
[]
[{"$nulls":12},"Back to Main Page"]
["FOR INTRA DAY TRADING",{"$nulls":9},{"$f":"Main!B10","v":"2022-01-04"}]
[]
["Sr.no",null,"CLOSE RATE","Pivot Point","Supports",null,null,"Resistances"]
[{"$nulls":4},"S1","S2","S3","R1","R2","R3","HIGH","LOW","Total Trade Quanity in Lakhs"]
[1,"Nifty 50",17625.7,{"v":17551.883333333335,"d":"17551.88"},{"v":17457.11666666667,"d":"17457.12"},{"v":17288.533333333333,"d":"17288.53"},{"v":17193.766666666666,"d":"17193.77"},{"v":17720.46666666667,"d":"17720.47"},{"v":17815.23333333334,"d":"17815.23"},{"v":17983.816666666673,"d":"17983.82"},17646.65,17383.3]
[2,"Nifty Bank",36421.9,{"v":36146.86666666667,"d":"36146.87"},{"v":35801.63333333334,"d":"35801.63"},{"v":35181.36666666667,"d":"35181.37"},{"v":34836.13333333334,"d":"34836.13"},{"v":36767.13333333334,"d":"36767.13"},{"v":37112.366666666676,"d":"37112.37"},{"v":37732.63333333334,"d":"37732.63"},36492.1,35526.6]
[3,"Nifty CPSE",2296.5,{"v":2287.9666666666667,"d":"2287.97"},{"v":2276.883333333333,"d":"2276.88"},{"v":2257.2666666666664,"d":"2257.27"},{"v":2246.183333333333,"d":"2246.18"},{"v":2307.5833333333335,"d":"2307.58"},{"v":2318.6666666666665,"d":"2318.67"},{"v":2338.2833333333338,"d":"2338.28"},2299.05,2268.35]
[4,"Nifty Infra",5010.3,{"v":4993.683333333333,"d":"4993.68"},{"v":4972.266666666666,"d":"4972.27"},{"v":4934.233333333333,"d":"4934.23"},{"v":4912.816666666666,"d":"4912.82"},{"v":5031.716666666667,"d":"5031.72"},{"v":5053.133333333333,"d":"5053.13"},{"v":5091.166666666668,"d":"5091.17"},5015.1,4955.65]
[5,"Nifty IT",39123.8,{"v":39054.23333333333,"d":"39054.23"},{"v":38822.11666666666,"d":"38822.12"},{"v":38520.433333333334,"d":"38520.43"},{"v":38288.316666666666,"d":"38288.32"},{"v":39355.91666666666,"d":"39355.92"},{"v":39588.033333333326,"d":"39588.03"},{"v":39889.71666666665,"d":"39889.72"},39286.35,38752.55]
[6,"Nifty PSE",3889,{"v":3875.1166666666663,"d":"3875.12"},{"v":3857.5833333333326,"d":"3857.58"},{"v":3826.166666666666,"d":"3826.17"},{"v":3808.6333333333323,"d":"3808.63"},{"v":3906.533333333333,"d":"3906.53"},{"v":3924.0666666666666,"d":"3924.07"},{"v":3955.483333333333,"d":"3955.48"},3892.65,3843.7]
[7,"Nifty Midcap 50",8524.3,{"v":8494.783333333335,"d":"8494.78"},{"v":8453.966666666669,"d":"8453.97"},{"v":8383.633333333335,"d":"8383.63"},{"v":8342.81666666667,"d":"8342.82"},{"v":8565.116666666669,"d":"8565.12"},{"v":8605.933333333334,"d":"8605.93"},{"v":8676.266666666668,"d":"8676.27"},8535.6,8424.45]
[8,"ACC",2251.35,{"v":2241.683333333333,"d":"2241.68"},{"v":2223.8166666666657,"d":"2223.82"},{"v":2196.283333333333,"d":"2196.28"},{"v":2178.4166666666656,"d":"2178.42"},{"v":2269.216666666666,"d":"2269.22"},{"v":2287.0833333333335,"d":"2287.08"},{"v":2314.616666666666,"d":"2314.62"},2259.55,2214.15,3.35699]
[9,"AUBANK",1065.3,{"v":1063.9,"d":"1063.90"},{"v":1041.3000000000002,"d":"1041.30"},{"v":1017.3000000000002,"d":"1017.30"},{"v":994.7000000000003,"d":"994.70"},{"v":1087.9,"d":"1087.90"},{"v":1110.5,"d":"1110.50"},{"v":1134.5,"d":"1134.50"},1086.5,1039.9,15.11777]
[10,"AARTIIND",1017.35,{"v":1014.3333333333334,"d":"1014.33"},{"v":1003.6666666666667,"d":"1003.67"},{"v":989.9833333333333,"d":"989.98"},{"v":979.3166666666667,"d":"979.32"},{"v":1028.0166666666669,"d":"1028.02"},{"v":1038.6833333333334,"d":"1038.68"},{"v":1052.3666666666668,"d":"1052.37"},1025,1000.65,7.1377]
[11,"ADANIENT",1717.15,1720.45,{"v":1707.9,"d":"1707.90"},1698.65,{"v":1686.1000000000001,"d":"1686.10"},{"v":1729.7,"d":"1729.70"},{"v":1742.2499999999998,"d":"1742.25"},{"v":1751.5,"d":"1751.50"},1733,1711.2,10.94708]
{"$rows_left_out":227}
{"sheet":"MidCap Intra","index":3,"n_rows":533,"n_cols":13,"rows_kept":533,"merged":[[0,0,0,1],[8,0,9,0],[8,1,9,1],[8,2,9,2],[8,3,9,3],[8,4,8,6],[8,7,8,9]]}
[]
[]
[]
[]
[{"$nulls":11},"Back To Main Page"]
["FOR INTRA DAY TRADING",{"$nulls":9},{"$f":"Main!B10","v":"2022-01-04"}]
[null,null," "]
[]
["Sr.no","Scrip","CLOSE RATE","Pivot Point","Supports",null,null,"Resistances"]
[{"$nulls":4},"S1","S2","S3","R1","R2","R3","HIGH","LOW","Total Trade Quanity in Lakhs"]
[1,"3MINDIA",25797.2,{"v":25682.016666666666,"d":"25682.02"},{"v":25473.733333333334,"d":"25473.73"},{"v":25150.266666666666,"d":"25150.27"},{"v":24941.983333333334,"d":"24941.98"},{"v":26005.483333333334,"d":"26005.48"},{"v":26213.766666666666,"d":"26213.77"},{"v":26537.233333333334,"d":"26537.23"},25890.3,25358.55,0.04475]
[2,"AARTIDRUGS",544.6,{"v":545.1333333333333,"d":"545.13"},{"v":537.9666666666667,"d":"537.97"},{"v":531.3333333333334,"d":"531.33"},{"v":524.1666666666667,"d":"524.17"},{"v":551.7666666666667,"d":"551.77"},{"v":558.9333333333334,"d":"558.93"},{"v":565.5666666666666,"d":"565.57"},552.3,538.5,1.52309]
[3,"AARTIIND",1017.35,{"v":1014.3333333333334,"d":"1014.33"},{"v":1003.6666666666667,"d":"1003.67"},{"v":989.9833333333333,"d":"989.98"},{"v":979.3166666666667,"d":"979.32"},{"v":1028.0166666666669,"d":"1028.02"},{"v":1038.6833333333334,"d":"1038.68"},{"v":1052.3666666666668,"d":"1052.37"},1025,1000.65,7.1377]
[4,"AAVAS",2627.35,{"v":2628.133333333333,"d":"2628.13"},{"v":2596.3666666666663,"d":"2596.37"},{"v":2565.383333333333,"d":"2565.38"},{"v":2533.6166666666663,"d":"2533.62"},{"v":2659.1166666666663,"d":"2659.12"},{"v":2690.8833333333328,"d":"2690.88"},{"v":2721.8666666666663,"d":"2721.87"},2659.9,2597.15,0.29469]
[5,"ABB",2205.45,{"v":2219.883333333333,"d":"2219.88"},{"v":2171.1666666666665,"d":"2171.17"},{"v":2136.883333333333,"d":"2136.88"},{"v":2088.1666666666665,"d":"2088.17"},{"v":2254.1666666666665,"d":"2254.17"},{"v":2302.8833333333337,"d":"2302.88"},{"v":2337.1666666666665,"d":"2337.17"},2268.6,2185.6,1.13948]
[6,"ABBOTINDIA",19285.1,{"v":19379.399999999998,"d":"19379.40"},{"v":19138.799999999996,"d":"19138.80"},{"v":18992.499999999996,"d":"18992.50"},{"v":18751.899999999994,"d":"18751.90"},{"v":19525.699999999997,"d":"19525.70"},{"v":19766.299999999996,"d":"19766.30"},{"v":19912.6,"d":"19912.60"},19620,19233.1,0.09259]
[7,"ABCAPITAL",129.55,{"v":128,"d":"128.00"},{"v":125.55000000000001,"d":"125.55"},{"v":121.55000000000001,"d":"121.55"},{"v":119.10000000000002,"d":"119.10"},{"v":132,"d":"132.00"},134.45,138.45,130.45,124,134.28542]
[8,"ABFRL",273.6,{"v":272.3833333333333,"d":"272.38"},{"v":270.3666666666667,"d":"270.37"},{"v":267.1333333333333,"d":"267.13"},{"v":265.1166666666667,"d":"265.12"},{"v":275.6166666666667,"d":"275.62"},{"v":277.6333333333333,"d":"277.63"},{"v":280.8666666666667,"d":"280.87"},274.4,269.15,27.5595]
[9,"ACC",2251.35,{"v":2241.683333333333,"d":"2241.68"},{"v":2223.8166666666657,"d":"2223.82"},{"v":2196.283333333333,"d":"2196.28"},{"v":2178.4166666666656,"d":"2178.42"},{"v":2269.216666666666,"d":"2269.22"},{"v":2287.0833333333335,"d":"2287.08"},{"v":2314.616666666666,"d":"2314.62"},2259.55,2214.15,3.35699]
[10,"ADANIENT",1717.15,1720.45,{"v":1707.9,"d":"1707.90"},1698.65,{"v":1686.1000000000001,"d":"1686.10"},{"v":1729.7,"d":"1729.70"},{"v":1742.2499999999998,"d":"1742.25"},{"v":1751.5,"d":"1751.50"},1733,1711.2,10.94708]
{"$rows_left_out":508}
{"sheet":"Bulk Deals","index":4,"n_rows":304,"n_cols":8,"rows_kept":304,"merged":[[4,0,4,1],[4,2,4,3],[6,1,6,2]]}
[" "]
[]
[]
[]
[]
[{"$nulls":4},"Back To Main Page"]
["Subject :","BULK DEAL",null,{"$f":"Main!B10","v":"2022-01-04"}]
[]
["Date","Scrip code","Scrip Name","Client Name","Buy / Sell","Quantity Traded","Trade Price / Wt.Avg.trade price","Exchange  "]
["2022-01-03",543377,"ADISHAKTI","NNM SECURITIES PVT LTD","BUY",{"v":10000,"d":"10,000"},8.3,"BSE"]
["2022-01-03",543377,"ADISHAKTI","NNM SECURITIES PVT LTD","SELL",{"v":30000,"d":"30,000"},8.77,"BSE"]
["2022-01-03",531991,"AMRAAGRI","B.W.TRADERS","BUY",{"v":673654,"d":"673,654"},1.85,"BSE"]
["2022-01-03",530109,"ANUPAM","PANKAJ HIRJI DEDHIA","SELL",{"v":1500000,"d":"1,500,000"},4.35,"BSE"]
["2022-01-03",530109,"ANUPAM","JAYESH MALSI RITA","SELL",{"v":1800000,"d":"1,800,000"},4.35,"BSE"]
["2022-01-03",542865,"ANUROOP","ZYANA STOCKS AND COMMODITIES","SELL",{"v":200000,"d":"200,000"},16.25,"BSE"]
["2022-01-03",542865,"ANUROOP","SHERWOOD SECURITIES PVT LTD","SELL",{"v":140000,"d":"140,000"},16.27,"BSE"]
["2022-01-03",542865,"ANUROOP","BHAVESH JAYANTILAL SHAH","BUY",{"v":100000,"d":"100,000"},16.25,"BSE"]
["2022-01-03",542865,"ANUROOP","DARSHIL RAJESH SHAH","BUY",{"v":100000,"d":"100,000"},16.25,"BSE"]
["2022-01-03",542721,"ARL","SILKON TRADES LLP","BUY",{"v":2261,"d":"2,261"},280.5,"BSE"]
["2022-01-03",542721,"ARL","SILKON TRADES LLP","SELL",{"v":111352,"d":"111,352"},280.28,"BSE"]
{"$rows_left_out":285}
{"sheet":"Call Tracker (Equity & F&O)","index":5,"n_rows":254,"n_cols":18,"rows_kept":254}
[]
[]
[]
[]
[{"$nulls":12},"Back To Main Page"]
["Retail Research Technical Calls & Fundamental Performance Report for the month of Jan-2022"]
[{"$nulls":12},{"$f":"Main!B10","v":"2022-01-04"}]
[null,"Positional  Call"]
["Sr.no","Date",null,"Company","Rec","Rec Price","Stop Loss***","Call Closed At","Target","Remark","Profit / Loss per Share","All charges","Net Gain / Loss  %","Status","Closed Date","Market Closing Price"]
[1,"2021-12-02",null,"CROMPTON","Buy","435-440",414,null,"465-475","Open",{"$nulls":5},{"$f":"VLOOKUP(D10,'MidCap Intra'!B42:C535,2,0)","v":441.45},null,"H"]
[2,"2021-12-02",null,"IOC","Buy","118-120",109,null,"130-135","Open",{"$nulls":5},{"$f":"VLOOKUP(D11,'MidCap Intra'!B43:C536,2,0)","v":112.95},null,"H"]
[3,"2021-12-14",null,"HDFCLIFE","Buy","663-668",635,null,"700-730","Open",{"$nulls":5},{"$f":"VLOOKUP(D12,'MidCap Intra'!B45:C538,2,0)","v":650.5},null,"H"]
[4,"2021-12-17",null,"BEL","Buy",201.5,188,{"v":209.5,"d":"209.50"},"220-230","Part Profit of Rs.8/-",{"$f":"H13-F13","v":8},{"$f":"(F13*-0.7)/100","v":{"v":-1.4104999999999999,"d":"-1.41"}},{"$f":"(K13+L13)/F13","v":{"v":0.03270223325062035,"d":"3.27%"}},"Successful","2021-12-23",{"$f":"VLOOKUP(D13,'MidCap Intra'!B46:C539,2,0)","v":211.25},null,"H"]
[5,"2021-12-17",null,"ICICIBANK","Buy",730,687,{"v":760,"d":"760.00"},"780-820","Part Profit of Rs.30/-",30,{"v":-5.109999999999999,"d":"-5.11"},{"v":0.0340958904109589,"d":"3.41%"},"Successful","2022-01-03",{"$f":"VLOOKUP(D14,'MidCap Intra'!B47:C540,2,0)","v":764.7},null,"H"]
[6,"2021-12-22",null,"ACC","Buy",2140,1995,{"v":2234,"d":"2,234.00"},"2350-2450","Part Profit of Rs.94/-",{"$f":"H15-F15","v":94},{"$f":"(F15*-0.7)/100","v":-14.98},{"$f":"(K15+L15)/F15","v":{"v":0.03692523364485981,"d":"3.69%"}},"Successful","2021-12-31",{"$f":"VLOOKUP(D15,'MidCap Intra'!B2:C541,2,0)","v":2251.35},null,"H"]
[7,"2021-12-27",null,"SUPREMEIND","Buy","2200-2230",2035,null,"2400-2500","Open",{"$nulls":5},{"$f":"VLOOKUP(D16,'MidCap Intra'!B12:M512,2,0)","v":2230.15},null,"H"]
[8,"2021-12-29",null,"ROUTE","Buy",1730,1640,{"v":1810,"d":"1,810.00"},"1900-2000","Part Profit of Rs.80/-",{"$f":"H17-F17","v":80},{"$f":"(F17*-0.7)/100","v":-12.11},{"$f":"(K17+L17)/F17","v":{"v":0.03924277456647399,"d":"3.92%"}},"Successful","2021-12-31",{"$f":"VLOOKUP(D17,'MidCap Intra'!B50:C543,2,0)","v":1804.2},null,"H"]
[9,"2021-12-31",null,"PIIND","Buy",2980,2790,{"v":3105,"d":"3,105.00"},"3200-3400","Part Profit of Rs.125/-",{"$f":"H18-F18","v":125},{"$f":"(F18*-0.7)/100","v":-20.86},{"$f":"(K18+L18)/F18","v":{"v":0.03494630872483222,"d":"3.49%"}},"Successful","2022-01-03",{"$f":"VLOOKUP(D18,'MidCap Intra'!B51:C544,2,0)","v":3051.75},null,"H"]
[]
[]
{"$rows_left_out":217}