{"text_format":"3","workbook":"xlsx","n_sheets":6,"sheets":["Main","Future Intra","Cash Intra","MidCap Intra","Bulk Deals","Call Tracker (Equity & F&O)"],"not_rendered":{"images":4,"defined_names":1},"read":"whole","date_system":"1900"}

{"sheet":"Main","index":0,"n_rows":27,"n_cols":11,"rows_kept":27}
[null,"                                                                                                 "]
{"$rows_empty":8}
[null,"2021-10-01"]
[]
[null,"Sheet No.","Template Name","Summary"]
[null,1,"Future Intra","For Intraday trading in F&O segment"]
[null,2,"Cash Intra","For Intraday trading in cash market segment"]
[null,3,"Mid-cap Intra","For Intraday trading in Mid-cap stocks"]
[null,4,"Bulk Deals","Reveals Bulk Deals carried on NSE & BSE"]
[null,5,"Call Tracker"]
{"$rows_empty":9}
[{"$nulls":10},"`"]

{"sheet":"Future Intra","index":1,"n_rows":218,"n_cols":16,"rows_kept":218,"merged":[[8,0,9,0],[8,1,9,1],[8,2,9,2],[8,3,9,3],[8,6,8,8],[8,9,8,11]]}
[]
[]
[]
[]
[{"$nulls":12},"Back to Main Page"]
["FOR INTRA DAY TRADING",{"$nulls":10},{"$f":"Main!B10","v":"2021-10-01"}]
[]
[]
["Sr.no","Sector","Scrip","Expiry Date","CLOSE RATE","Pivot Point","Supports",null,null,"Resistances"]
[{"$nulls":4},"Point","Point","S1","S2","S3","R1","R2","R3","HIGH","LOW","OI","% Change in OI"]
[1,"Index","BANKNIFTY","2021-10-28",{"v":37618.9,"d":"37618.90"},{"v":37734,"d":"37734.00"},{"v":37444.9,"d":"37444.90"},{"v":37270.9,"d":"37270.90"},{"v":36981.8,"d":"36981.80"},{"v":37908,"d":"37908.00"},{"v":38197.100000000006,"d":"38197.10"},{"v":38371.1,"d":"38371.10"},38023.1,37560,2166375,{"v":-0.03661004135722862,"d":"-3.66%"}]
[2,"Index","NIFTY","2021-10-28",17623.15,{"v":17661.633333333335,"d":"17661.63"},{"v":17565.51666666667,"d":"17565.52"},{"v":17507.883333333335,"d":"17507.88"},{"v":17411.76666666667,"d":"17411.77"},{"v":17719.26666666667,"d":"17719.27"},{"v":17815.38333333333,"d":"17815.38"},{"v":17873.01666666667,"d":"17873.02"},17757.75,17604,12207500,{"v":-0.20488370426819338,"d":"-20.49%"}]
[3,"Index","FINNIFTY","2021-10-28",18426.65,{"v":18449.416666666668,"d":"18449.42"},{"v":18315.983333333337,"d":"18315.98"},{"v":18205.31666666667,"d":"18205.32"},{"v":18071.88333333334,"d":"18071.88"},{"v":18560.083333333336,"d":"18560.08"},{"v":18693.516666666663,"d":"18693.52"},{"v":18804.183333333334,"d":"18804.18"},18582.85,18338.75,2600,{"v":-0.32989690721649484,"d":"-32.99%"}]
[4,"Chemical","AARTIIND","2021-10-28",932.05,{"v":936.7666666666665,"d":"936.77"},{"v":923.8833333333331,"d":"923.88"},{"v":915.7166666666666,"d":"915.72"},{"v":902.8333333333331,"d":"902.83"},{"v":944.933333333333,"d":"944.93"},{"v":957.8166666666665,"d":"957.82"},{"v":965.983333333333,"d":"965.98"},949.65,928.6,2826250,{"v":-0.1291251964379256,"d":"-12.91%"}]
[5,"Textile","ABFRL","2021-10-28",{"v":247.3,"d":"247.30"},{"v":242.20000000000002,"d":"242.20"},{"v":234.10000000000002,"d":"234.10"},{"v":220.9,"d":"220.90"},{"v":212.8,"d":"212.80"},{"v":255.40000000000003,"d":"255.40"},{"v":263.5,"d":"263.50"},{"v":276.70000000000005,"d":"276.70"},250.3,229,9544600,{"v":-0.2944455122044974,"d":"-29.44%"}]
[6,"Cement","ACC","2021-10-28",{"v":2262.4,"d":"2262.40"},{"v":2268.7999999999997,"d":"2268.80"},{"v":2251.5999999999995,"d":"2251.60"},{"v":2240.7999999999997,"d":"2240.80"},{"v":2223.5999999999995,"d":"2223.60"},{"v":2279.5999999999995,"d":"2279.60"},{"v":2296.7999999999993,"d":"2296.80"},{"v":2307.5999999999995,"d":"2307.60"},2286,2258,2904500,{"v":-0.0467673121102724,"d":"-4.68%"}]
[7,"Others","ADANIENT","2021-10-28",1474.95,{"v":1489.9833333333333,"d":"1489.98"},{"v":1454.9666666666667,"d":"1454.97"},{"v":1434.9833333333333,"d":"1434.98"},{"v":1399.9666666666667,"d":"1399.97"},{"v":1509.9666666666667,"d":"1509.97"},{"v":1544.9833333333336,"d":"1544.98"},{"v":1564.9666666666667,"d":"1564.97"},1525,1470,26550000,{"v":-0.025151459519001284,"d":"-2.52%"}]
[8,"Others","ADANIPORTS","2021-10-28",739.95,{"v":746.0333333333333,"d":"746.03"},{"v":732.1666666666666,"d":"732.17"},{"v":724.3833333333333,"d":"724.38"},{"v":710.5166666666667,"d":"710.52"},{"v":753.8166666666666,"d":"753.82"},{"v":767.6833333333334,"d":"767.68"},{"v":775.4666666666666,"d":"775.47"},759.9,738.25,89512500,{"v":-0.018839487565938208,"d":"-1.88%"}]
[9,"Pharma","ALKEM","2021-10-28",{"v":4001.4,"d":"4001.40"},{"v":3976.133333333333,"d":"3976.13"},{"v":3935.2666666666664,"d":"3935.27"},{"v":3869.133333333333,"d":"3869.13"},{"v":3828.2666666666664,"d":"3828.27"},{"v":4042.2666666666664,"d":"4042.27"},{"v":4083.133333333333,"d":"4083.13"},{"v":4149.266666666666,"d":"4149.27"},4017,3910,392200,{"v":-0.003050330452465684,"d":"-0.31%"}]
[10,"Automobile","AMARAJABAT","2021-10-28",{"v":753.9,"d":"753.90"},{"v":756.4833333333332,"d":"756.48"},{"v":749.4166666666665,"d":"749.42"},{"v":744.9333333333333,"d":"744.93"},{"v":737.8666666666666,"d":"737.87"},{"v":760.9666666666665,"d":"760.97"},{"v":768.0333333333333,"d":"768.03"},{"v":772.5166666666664,"d":"772.52"},763.55,752,8589000,{"v":-0.02751358695652174,"d":"-2.75%"}]
{"$rows_left_out":183}
{"sheet":"Cash Intra","index":2,"n_rows":246,"n_cols":13,"rows_kept":246,"merged":[[7,0,8,0],[7,1,8,1],[7,2,8,2],[7,3,8,3],[7,4,7,6],[7,7,7,9]]}
[]
[]
[]
[]
[{"$nulls":12},"Back to Main Page"]
["FOR INTRA DAY TRADING",{"$nulls":9},{"$f":"Main!B10","v":"2021-10-01"}]
[]
["Sr.no",null,"CLOSE RATE","Pivot Point","Supports",null,null,"Resistances"]
[{"$nulls":4},"S1","S2","S3","R1","R2","R3","HIGH","LOW","Total Trade Quanity in Lakhs"]
[1,"Nifty 50",17618.15,17648.55,{"v":17554.949999999997,"d":"17554.95"},{"v":17491.749999999996,"d":"17491.75"},{"v":17398.149999999994,"d":"17398.15"},17711.75,17805.35,{"v":17868.550000000003,"d":"17868.55"},17742.15,17585.35]
[2,"Nifty Bank",37425.1,{"v":37554.73333333333,"d":"37554.73"},{"v":37224.61666666666,"d":"37224.62"},{"v":37024.13333333333,"d":"37024.13"},{"v":36694.01666666666,"d":"36694.02"},{"v":37755.21666666666,"d":"37755.22"},{"v":38085.33333333333,"d":"38085.33"},{"v":38285.81666666666,"d":"38285.82"},37884.85,37354.25]
[3,"Nifty CPSE",2362.55,{"v":2370.2666666666664,"d":"2370.27"},{"v":2340.683333333333,"d":"2340.68"},{"v":2318.8166666666666,"d":"2318.82"},{"v":2289.233333333333,"d":"2289.23"},{"v":2392.1333333333328,"d":"2392.13"},{"v":2421.7166666666667,"d":"2421.72"},{"v":2443.5833333333326,"d":"2443.58"},2399.85,2348.4]
[4,"Nifty Infra",5025.35,{"v":5032.116666666667,"d":"5032.12"},{"v":5003.633333333333,"d":"5003.63"},{"v":4981.916666666666,"d":"4981.92"},{"v":4953.4333333333325,"d":"4953.43"},{"v":5053.833333333334,"d":"5053.83"},{"v":5082.3166666666675,"d":"5082.32"},{"v":5104.033333333335,"d":"5104.03"},5060.6,5010.4]
[5,"Nifty IT",35028,{"v":35137.23333333334,"d":"35137.23"},{"v":34866.366666666676,"d":"34866.37"},{"v":34704.73333333334,"d":"34704.73"},{"v":34433.866666666676,"d":"34433.87"},{"v":35298.866666666676,"d":"35298.87"},{"v":35569.733333333344,"d":"35569.73"},{"v":35731.366666666676,"d":"35731.37"},35408.1,34975.6]
[6,"Nifty PSE",4096.7,{"v":4109.383333333333,"d":"4109.38"},{"v":4061.666666666666,"d":"4061.67"},{"v":4026.6333333333328,"d":"4026.63"},{"v":3978.9166666666656,"d":"3978.92"},{"v":4144.416666666666,"d":"4144.42"},{"v":4192.133333333333,"d":"4192.13"},{"v":4227.166666666667,"d":"4227.17"},4157.1,4074.35]
[7,"Nifty Midcap 50",8278.55,{"v":8285.933333333332,"d":"8285.93"},{"v":8253.116666666665,"d":"8253.12"},{"v":8227.683333333332,"d":"8227.68"},{"v":8194.866666666665,"d":"8194.87"},{"v":8311.366666666665,"d":"8311.37"},{"v":8344.183333333334,"d":"8344.18"},{"v":8369.616666666665,"d":"8369.62"},8318.75,8260.5]
[8,"ACC",2254.5,{"v":2260.8666666666663,"d":"2260.87"},{"v":2244.8333333333326,"d":"2244.83"},{"v":2235.166666666666,"d":"2235.17"},{"v":2219.1333333333323,"d":"2219.13"},{"v":2270.533333333333,"d":"2270.53"},{"v":2286.5666666666666,"d":"2286.57"},{"v":2296.233333333333,"d":"2296.23"},2276.9,2251.2,3.00368]
[9,"AUBANK",1164.25,{"v":1169.2833333333333,"d":"1169.28"},{"v":1149.9666666666667,"d":"1149.97"},{"v":1135.6833333333334,"d":"1135.68"},{"v":1116.3666666666668,"d":"1116.37"},{"v":1183.5666666666666,"d":"1183.57"},{"v":1202.8833333333332,"d":"1202.88"},{"v":1217.1666666666665,"d":"1217.17"},1188.6,1155,23.116]
[10,"AARTIIND",929.85,{"v":935.0333333333333,"d":"935.03"},{"v":922.6666666666666,"d":"922.67"},{"v":915.4833333333333,"d":"915.48"},{"v":903.1166666666667,"d":"903.12"},{"v":942.2166666666666,"d":"942.22"},{"v":954.5833333333334,"d":"954.58"},{"v":961.7666666666665,"d":"961.77"},947.4,927.85,7.14066]
[11,"ABBOTINDIA",20517.8,{"v":20287.666666666668,"d":"20287.67"},{"v":19933.333333333336,"d":"19933.33"},{"v":19348.86666666667,"d":"19348.87"},{"v":18994.533333333336,"d":"18994.53"},{"v":20872.133333333335,"d":"20872.13"},{"v":21226.46666666667,"d":"21226.47"},{"v":21810.933333333334,"d":"21810.93"},20642,19703.2,0.50607]
{"$rows_left_out":227}
{"sheet":"MidCap Intra","index":3,"n_rows":537,"n_cols":13,"rows_kept":537,"merged":[[0,0,0,1],[8,0,9,0],[8,1,9,1],[8,2,9,2],[8,3,9,3],[8,4,8,6],[8,7,8,9]]}
[]
[]
[]
[]
[{"$nulls":11},"Back To Main Page"]
["FOR INTRA DAY TRADING",{"$nulls":9},{"$f":"Main!B10","v":"2021-10-01"}]
[null,null," "]
[]
["Sr.no","Scrip","CLOSE RATE","Pivot Point","Supports",null,null,"Resistances"]
[{"$nulls":4},"S1","S2","S3","R1","R2","R3","HIGH","LOW","Total Trade Quanity in Lakhs"]
[1,"3MINDIA",24832.5,{"v":24758.350000000002,"d":"24758.35"},{"v":24536.650000000005,"d":"24536.65"},{"v":24240.800000000003,"d":"24240.80"},{"v":24019.100000000006,"d":"24019.10"},{"v":25054.200000000004,"d":"25054.20"},{"v":25275.9,"d":"25275.90"},{"v":25571.750000000004,"d":"25571.75"},24980.05,24462.5,0.01845]
[2,"ABB",1870.6,{"v":1856.9666666666665,"d":"1856.97"},{"v":1834.933333333333,"d":"1834.93"},{"v":1799.2666666666664,"d":"1799.27"},{"v":1777.233333333333,"d":"1777.23"},{"v":1892.633333333333,"d":"1892.63"},{"v":1914.6666666666663,"d":"1914.67"},{"v":1950.333333333333,"d":"1950.33"},1879,1821.3,0.7099]
[3,"POWERINDIA",2438.8,2431.15,2387.65,{"v":2336.5,"d":"2336.50"},{"v":2293,"d":"2293.00"},{"v":2482.3,"d":"2482.30"},{"v":2525.8,"d":"2525.80"},{"v":2576.9500000000003,"d":"2576.95"},2474.65,2380,0.70378]
[4,"ACC",2254.5,{"v":2260.8666666666663,"d":"2260.87"},{"v":2244.8333333333326,"d":"2244.83"},{"v":2235.166666666666,"d":"2235.17"},{"v":2219.1333333333323,"d":"2219.13"},{"v":2270.533333333333,"d":"2270.53"},{"v":2286.5666666666666,"d":"2286.57"},{"v":2296.233333333333,"d":"2296.23"},2276.9,2251.2,3.00368]
[5,"AIAENG",1955.3,{"v":1944.9000000000003,"d":"1944.90"},{"v":1921.3000000000006,"d":"1921.30"},{"v":1887.3000000000004,"d":"1887.30"},{"v":1863.7000000000007,"d":"1863.70"},{"v":1978.9000000000005,"d":"1978.90"},{"v":2002.5000000000005,"d":"2002.50"},{"v":2036.5000000000005,"d":"2036.50"},1968.5,1910.9,0.31905]
[6,"APLAPOLLO",821.8,{"v":820.8166666666666,"d":"820.82"},{"v":805.0833333333333,"d":"805.08"},{"v":788.3666666666667,"d":"788.37"},{"v":772.6333333333333,"d":"772.63"},{"v":837.5333333333332,"d":"837.53"},{"v":853.2666666666665,"d":"853.27"},{"v":869.9833333333331,"d":"869.98"},836.55,804.1,9.26191]
[7,"AUBANK",1164.25,{"v":1169.2833333333333,"d":"1169.28"},{"v":1149.9666666666667,"d":"1149.97"},{"v":1135.6833333333334,"d":"1135.68"},{"v":1116.3666666666668,"d":"1116.37"},{"v":1183.5666666666666,"d":"1183.57"},{"v":1202.8833333333332,"d":"1202.88"},{"v":1217.1666666666665,"d":"1217.17"},1188.6,1155,23.116]
[8,"AARTIDRUGS",607.3,{"v":609.4833333333332,"d":"609.48"},{"v":603.9666666666665,"d":"603.97"},{"v":600.6333333333332,"d":"600.63"},{"v":595.1166666666664,"d":"595.12"},{"v":612.8166666666665,"d":"612.82"},{"v":618.3333333333331,"d":"618.33"},{"v":621.6666666666665,"d":"621.67"},615,606.15,0.95787]
[9,"AARTIIND",929.85,{"v":935.0333333333333,"d":"935.03"},{"v":922.6666666666666,"d":"922.67"},{"v":915.4833333333333,"d":"915.48"},{"v":903.1166666666667,"d":"903.12"},{"v":942.2166666666666,"d":"942.22"},{"v":954.5833333333334,"d":"954.58"},{"v":961.7666666666665,"d":"961.77"},947.4,927.85,7.14066]
[10,"AAVAS",2560,{"v":2574.5166666666664,"d":"2574.52"},{"v":2515.833333333333,"d":"2515.83"},{"v":2471.6666666666665,"d":"2471.67"},{"v":2412.983333333333,"d":"2412.98"},{"v":2618.683333333333,"d":"2618.68"},{"v":2677.3666666666663,"d":"2677.37"},{"v":2721.533333333333,"d":"2721.53"},2633.2,2530.35,1.17083]
{"$rows_left_out":518}
{"sheet":"Bulk Deals","index":4,"n_rows":119,"n_cols":8,"rows_kept":119,"merged":[[4,0,4,1],[4,2,4,3],[6,1,6,2]]}
[" "]
[]
[]
[]
[]
[{"$nulls":4},"Back To Main Page"]
["Subject :","BULK DEAL",null,{"$f":"Main!B10","v":"2021-10-01"}]
[]
["Date","Scrip code","Scrip Name","Client Name","Buy / Sell","Quantity Traded","Trade Price / Wt.Avg.trade price","Exchange  "]
["2021-09-30",540694,"ANG","WAYS VINIMAY PRIVATE LIMITED","SELL",{"v":32000,"d":"32,000"},349.55,"BSE"]
["2021-09-30",533095,"BENGALASM","NAVBHARAT VANIJYA LIMITED","BUY",{"v":97000,"d":"97,000"},2300,"BSE"]
["2021-09-30",533095,"BENGALASM","J K CREDIT & FINANCE LIMITED","BUY",{"v":188000,"d":"188,000"},2300,"BSE"]
["2021-09-30",533095,"BENGALASM","HARI SHANKAR SINGHANIA HOLDINGS PRIVATE LIMITED","SELL",{"v":325000,"d":"325,000"},2299.94,"BSE"]
["2021-09-30",543209,"BILLWIN","SUJATA PILINJA RAO","SELL",{"v":12000,"d":"12,000"},19,"BSE"]
["2021-09-30",530427,"CHOKSI","AKSHOBHYA HEALTH CARE PRIVATE LIMITED","BUY",{"v":27500,"d":"27,500"},41.57,"BSE"]
["2021-09-30",530427,"CHOKSI","RATNA GAURAV CHOKSI","SELL",{"v":34260,"d":"34,260"},41.21,"BSE"]
["2021-09-30",530457,"CINERAD","TALLURI NARASIMHA RAO","BUY",{"v":30000,"d":"30,000"},2.08,"BSE"]
["2021-09-30",530457,"CINERAD","PREMJI BHURALAL GALA","SELL",{"v":29798,"d":"29,798"},2.08,"BSE"]
["2021-09-30",540811,"DML","KINGSMAN WEALTH MANAGEMENT PRIVATE LIMITED","BUY",{"v":50000,"d":"50,000"},12,"BSE"]
["2021-09-30",532022,"FILATFASH","NEETA SHRINIVAS ZANVAR","SELL",{"v":672336,"d":"672,336"},2.97,"BSE"]
{"$rows_left_out":100}
{"sheet":"Call Tracker (Equity & F&O)","index":5,"n_rows":391,"n_cols":18,"rows_kept":391,"merged":[[110,0,111,0],[110,1,111,1],[110,12,111,12],[110,13,111,13],[110,14,111,14],[110,15,111,15],[155,0,156,0],[155,1,156,1],[155,9,156,9],[155,12,156,12],[155,13,156,13],[155,14,156,14],[155,15,156,15],[176,0,177,0],[176,1,177,1],[176,9,177,9],[176,12,177,12],[176,13,177,13],[176,14,177,14],[176,15,177,15],[184,0,185,0],[184,1,185,1],[184,9,185,9],[184,12,185,12],[184,13,185,13],[184,14,185,14],[184,15,185,15]]}
[]
[]
[]
[]
[{"$nulls":12},"Back To Main Page"]
["Retail Research Technical Calls & Fundamental Performance Report for the month of Sep-2021"]
[{"$nulls":12},{"$f":"Main!B10","v":"2021-10-01"}]
[null,"Positional  Call"]
["Sr.no","Date",null,"Company","Rec","Rec Price","Stop Loss***","Call Closed At","Target","Remark","Profit / Loss per Share","All charges","Net Gain / Loss  %","Status","Closed Date","Market Closing Price"]
[1,"2021-07-19",null,"IGL","Buy",547.5,510,{"v":568,"d":"568.00"},"620-640","Profit of Rs.20.5/-",{"$f":"H10-F10","v":20.5},{"$f":"(F10*-0.7)/100","v":{"v":-3.8325,"d":"-3.83"}},{"$f":"(K10+L10)/F10","v":{"v":0.030442922374429224,"d":"3.04%"}},"Successful","2021-09-06",null,null,"H"]
[2,"2021-07-20",null,"IOC","Buy",104.5,96.5,{"v":111.5,"d":"111.50"},"120-122","Profit of Rs.7/-",{"$f":"H11-F11","v":7},{"$f":"(F11*-0.7)/100","v":{"v":-0.7314999999999999,"d":"-0.73"}},{"$f":"(K11+L11)/F11","v":{"v":0.05998564593301436,"d":"6.00%"}},"Successful","2021-09-03",null,null,"H"]
[3,"2021-07-30",null,"AMARAJABAT","Buy",715,675,{"v":730,"d":"730.00"},"780-800","Profit of Rs.15/-",{"$f":"H12-F12","v":15},{"v":-5.004999999999999,"d":"-5.01"},{"$f":"(K12+L12)/F12","v":{"v":0.01397902097902098,"d":"1.40%"}},"Successful","2021-09-03",null,null,"H"]
[4,"2021-08-13",null,"MCX","Buy",1500,1415,{"v":1607.5,"d":"1,607.50"},"1650-1680","Profit of Rs.107.5/-",107.5,{"v":-10.5,"d":"-10.50"},{"v":0.06466666666666666,"d":"6.47%"},"Successful","2021-09-03",null,null,"H"]
[5,"2021-09-03",null,"ALKYLAMINE","Buy",4085,3900,{"v":3900,"d":"3,900.00"},"4400-4500","Loss of Rs.185/-",-185,{"v":-28.595,"d":"-28.60"},{"v":-0.05228763769889841,"d":"-5.23%"},"Unsuccessful","2021-09-16",null,null,"H"]
[6,"2021-09-03",null,"JBCHEPHARM","Buy",1670,1570,{"v":1785,"d":"1,785.00"},"1840-1880","Profit of Rs.115/-",{"$f":"H15-F15","v":115},{"$f":"(F15*-0.7)/100","v":-11.69},{"$f":"(K15+L15)/F15","v":{"v":0.0618622754491018,"d":"6.19%"}},"Successful","2021-09-07",null,null,"H"]
[7,"2021-09-08",null,"GLAXO","Buy",1500,1395,{"v":1600,"d":"1,600.00"},"1650-1700","Profit of Rs.100/-",100,{"v":-10.5,"d":"-10.50"},{"v":0.059666666666666666,"d":"5.97%"},"Successful","2021-09-16",null,null,"H"]
[8,"2021-09-13",null,"HDFCAMC","Buy",3205,3000,{"v":3125,"d":"3,125.00"},"3500-3600","Loss of Rs.80/-",{"$f":"H17-F17","v":-80},{"$f":"(F17*-0.7)/100","v":{"v":-22.435,"d":"-22.44"}},{"$f":"(K17+L17)/F17","v":{"v":-0.0319609984399376,"d":"-3.20%"}},"Unsuccessful","2021-09-29",null,null,"N"]
[9,"2021-09-15",null,"AKZOINDIA","Buy",2195,2080,{"v":2295,"d":"2,295.00"},"2400-2500","Part Profit of Rs.100/-",100,{"v":-15.365,"d":"-15.37"},{"v":0.03855808656036447,"d":"3.86%"},"Successful","2021-09-30",{"$f":"VLOOKUP(D18,'MidCap Intra'!B11:C511,2,0)","v":2284.35},null,"H"]
[10,"2021-09-17",null,"BANKBARODA","Buy",84,78,78.85,"90-92","Loss of Rs.5.15/-",{"$f":"H19-F19","v":-5.150000000000006},{"$f":"(F19*-0.7)/100","v":{"v":-0.588,"d":"-0.59"}},{"$f":"(K19+L19)/F19","v":{"v":-0.06830952380952388,"d":"-6.83%"}},"Unsuccessful","2021-09-16",null,null,"H"]
[11,"2021-09-21",null,"GLAXO","Buy","1500-1520",1395,null,"1680-1720","Open",{"$nulls":5},{"$f":"VLOOKUP(D20,'MidCap Intra'!B13:C513,2,0)","v":1480.75},null,"H"]
{"$rows_left_out":353}