{"text_format":"3","workbook":"xlsx","n_sheets":6,"sheets":["Main","Future Intra","Cash Intra","MidCap Intra","Bulk Deals","Call Tracker (Equity & F&O)"],"not_rendered":{"images":2,"defined_names":2},"read":"whole","date_system":"1900"}

{"sheet":"Main","index":0,"n_rows":27,"n_cols":11,"rows_kept":27}
[null,"                                                                                                 "]
{"$rows_empty":8}
[null,"2022-03-02"]
[]
[null,"Sheet No.","Template Name","Summary"]
[null,1,"Future Intra","For Intraday trading in F&O segment"]
[null,2,"Cash Intra","For Intraday trading in cash market segment"]
[null,3,"Mid-cap Intra","For Intraday trading in Mid-cap stocks"]
[null,4,"Bulk Deals","Reveals Bulk Deals carried on NSE & BSE"]
[null,5,"Call Tracker"]
{"$rows_empty":9}
[{"$nulls":10},"`"]

{"sheet":"Future Intra","index":1,"n_rows":240,"n_cols":16,"rows_kept":240,"merged":[[8,0,9,0],[8,1,9,1],[8,2,9,2],[8,3,9,3],[8,6,8,8],[8,9,8,11]]}
[]
[]
[]
[]
[{"$nulls":12},"Back to Main Page"]
["FOR INTRA DAY TRADING",{"$nulls":10},{"$f":"Main!B10","v":"2022-03-02"}]
[]
[]
["Sr.no","Sector","Scrip","Expiry Date","CLOSE RATE","Pivot Point","Supports",null,null,"Resistances"]
[{"$nulls":4},"Point","Point","S1","S2","S3","R1","R2","R3","HIGH","LOW","OI","% Change in OI"]
[1,"Index","NIFTY","2022-03-31",16794.25,{"v":16662.033333333333,"d":"16662.03"},{"v":16499.066666666666,"d":"16499.07"},{"v":16203.883333333333,"d":"16203.88"},{"v":16040.916666666666,"d":"16040.92"},{"v":16957.216666666667,"d":"16957.22"},{"v":17120.183333333334,"d":"17120.18"},{"v":17415.366666666665,"d":"17415.37"},16825,16366.85,13759950,{"v":0.12087307858358926,"d":"12.09%"}]
[2,"Index","BANKNIFTY","2022-03-31",36261.65,{"v":36087.083333333336,"d":"36087.08"},{"v":35829.76666666667,"d":"35829.77"},{"v":35397.88333333333,"d":"35397.88"},{"v":35140.566666666666,"d":"35140.57"},{"v":36518.966666666674,"d":"36518.97"},{"v":36776.28333333334,"d":"36776.28"},{"v":37208.16666666668,"d":"37208.17"},36344.4,35655.2,2754125,{"v":0.06640530468031557,"d":"6.64%"}]
[3,"Index","FINNIFTY","2022-03-29",{"v":16951.6,"d":"16951.60"},{"v":16898.733333333334,"d":"16898.73"},{"v":16752.766666666666,"d":"16752.77"},{"v":16553.933333333334,"d":"16553.93"},{"v":16407.966666666667,"d":"16407.97"},{"v":17097.566666666666,"d":"17097.57"},{"v":17243.533333333333,"d":"17243.53"},{"v":17442.366666666665,"d":"17442.37"},17044.7,16699.9,3240,{"v":0.0125,"d":"1.25%"}]
[4,"Index","MIDCPNIFTY","2022-03-29",7041.25,7010.75,6841.55,6641.85,{"v":6472.650000000001,"d":"6472.65"},7210.45,{"v":7379.650000000001,"d":"7379.65"},{"v":7579.349999999999,"d":"7579.35"},7179.95,6811.05,1875,{"v":-0.13793103448275862,"d":"-13.79%"}]
[5,"Chemical","AARTIIND","2022-03-31",927.05,{"v":923.2666666666668,"d":"923.27"},{"v":916.7833333333335,"d":"916.78"},{"v":906.5166666666668,"d":"906.52"},{"v":900.0333333333335,"d":"900.03"},{"v":933.5333333333335,"d":"933.53"},{"v":940.0166666666669,"d":"940.02"},{"v":950.2833333333335,"d":"950.28"},929.75,913,2185350,{"v":0.006656225528582615,"d":"0.67%"}]
[6,"Pharma","ABBOTINDIA","2022-03-31",17580.45,{"v":17526.683333333334,"d":"17526.68"},{"v":17263.81666666667,"d":"17263.82"},{"v":16947.183333333334,"d":"16947.18"},{"v":16684.31666666667,"d":"16684.32"},{"v":17843.31666666667,"d":"17843.32"},{"v":18106.183333333338,"d":"18106.18"},{"v":18422.81666666667,"d":"18422.82"},17789.55,17210.05,37450,{"v":0.027434842249657063,"d":"2.74%"}]
[7,"Others","ABCAPITAL","2022-03-31",105.85,{"v":104.53333333333332,"d":"104.53"},{"v":102.76666666666664,"d":"102.77"},{"v":99.68333333333332,"d":"99.68"},{"v":97.91666666666664,"d":"97.92"},{"v":107.61666666666663,"d":"107.62"},{"v":109.38333333333331,"d":"109.38"},{"v":112.46666666666663,"d":"112.47"},106.3,101.45,16552800,{"v":0.005344735435595938,"d":"0.53%"}]
[8,"Textile","ABFRL","2022-03-31",{"v":268.6,"d":"268.60"},{"v":267.4166666666667,"d":"267.42"},{"v":262.73333333333335,"d":"262.73"},{"v":256.8666666666667,"d":"256.87"},{"v":252.18333333333334,"d":"252.18"},{"v":273.28333333333336,"d":"273.28"},{"v":277.96666666666664,"d":"277.97"},{"v":283.83333333333337,"d":"283.83"},272.1,261.55,13436800,{"v":-1.7384585667374927E-3,"d":"-0.17%"}]
[9,"Cement","ACC","2022-03-31",{"v":2088.4,"d":"2088.40"},2068.05,{"v":2044.3000000000002,"d":"2044.30"},{"v":2000.2,"d":"2000.20"},1976.45,{"v":2112.1500000000005,"d":"2112.15"},{"v":2135.9000000000005,"d":"2135.90"},{"v":2180.0000000000005,"d":"2180.00"},2091.8,2023.95,2215750,{"v":0.011989038593286138,"d":"1.20%"}]
[10,"Others","ADANIENT","2022-03-31",1646.35,{"v":1632.5166666666667,"d":"1632.52"},{"v":1611.1333333333332,"d":"1611.13"},{"v":1575.9166666666665,"d":"1575.92"},{"v":1554.533333333333,"d":"1554.53"},{"v":1667.7333333333333,"d":"1667.73"},{"v":1689.116666666667,"d":"1689.12"},{"v":1724.3333333333335,"d":"1724.33"},1653.9,1597.3,20676500,{"v":2.1325578577486974E-3,"d":"0.21%"}]
{"$rows_left_out":209}
{"sheet":"Cash Intra","index":2,"n_rows":246,"n_cols":13,"rows_kept":246,"merged":[[7,0,8,0],[7,1,8,1],[7,2,8,2],[7,3,8,3],[7,4,7,6],[7,7,7,9]]}
[]
[]
[]
[]
[{"$nulls":12},"Back to Main Page"]
["FOR INTRA DAY TRADING",{"$nulls":9},{"$f":"Main!B10","v":"2022-03-02"}]
[]
["Sr.no",null,"CLOSE RATE","Pivot Point","Supports",null,null,"Resistances"]
[{"$nulls":4},"S1","S2","S3","R1","R2","R3","HIGH","LOW","Total Trade Quanity in Lakhs"]
[1,"Nifty 50",16793.9,{"v":16655.36666666667,"d":"16655.37"},{"v":16494.833333333336,"d":"16494.83"},{"v":16195.766666666666,"d":"16195.77"},{"v":16035.233333333334,"d":"16035.23"},{"v":16954.433333333338,"d":"16954.43"},{"v":17114.96666666667,"d":"17114.97"},{"v":17414.03333333334,"d":"17414.03"},16815.9,16356.3]
[2,"Nifty Bank",36205.3,36029.15,35788.05,{"v":35370.8,"d":"35370.80"},{"v":35129.700000000004,"d":"35129.70"},{"v":36446.4,"d":"36446.40"},{"v":36687.49999999999,"d":"36687.50"},37104.75,36270.25,35611.9]
[3,"Nifty CPSE",2415.8,{"v":2387.4166666666665,"d":"2387.42"},{"v":2354.633333333333,"d":"2354.63"},{"v":2293.4666666666667,"d":"2293.47"},{"v":2260.6833333333334,"d":"2260.68"},{"v":2448.583333333333,"d":"2448.58"},{"v":2481.366666666667,"d":"2481.37"},{"v":2542.533333333333,"d":"2542.53"},2420.2,2326.25]
[4,"Nifty Infra",4798.75,{"v":4746.616666666666,"d":"4746.62"},{"v":4686.083333333332,"d":"4686.08"},{"v":4573.416666666666,"d":"4573.42"},{"v":4512.883333333332,"d":"4512.88"},{"v":4859.283333333332,"d":"4859.28"},{"v":4919.816666666667,"d":"4919.82"},{"v":5032.483333333332,"d":"5032.48"},4807.15,4633.95]
[5,"Nifty IT",33847.85,{"v":33555.88333333333,"d":"33555.88"},{"v":33150.71666666666,"d":"33150.72"},{"v":32453.58333333333,"d":"32453.58"},{"v":32048.416666666657,"d":"32048.42"},{"v":34253.01666666666,"d":"34253.02"},{"v":34658.183333333334,"d":"34658.18"},{"v":35355.316666666666,"d":"35355.32"},33961.05,32858.75]
[6,"Nifty PSE",3955.3,{"v":3904.433333333334,"d":"3904.43"},{"v":3844.7166666666676,"d":"3844.72"},{"v":3734.1333333333337,"d":"3734.13"},{"v":3674.4166666666674,"d":"3674.42"},{"v":4015.016666666668,"d":"4015.02"},{"v":4074.733333333334,"d":"4074.73"},{"v":4185.3166666666675,"d":"4185.32"},3964.15,3793.85]
[7,"Nifty Midcap 50",7810.45,{"v":7738.016666666666,"d":"7738.02"},{"v":7653.9333333333325,"d":"7653.93"},{"v":7497.416666666666,"d":"7497.42"},{"v":7413.333333333332,"d":"7413.33"},{"v":7894.533333333333,"d":"7894.53"},{"v":7978.616666666667,"d":"7978.62"},{"v":8135.133333333333,"d":"8135.13"},7822.1,7581.5]
[8,"ACC",2089.15,{"v":2068.1666666666665,"d":"2068.17"},{"v":2041.333333333333,"d":"2041.33"},{"v":1993.5166666666664,"d":"1993.52"},{"v":1966.683333333333,"d":"1966.68"},{"v":2115.983333333333,"d":"2115.98"},{"v":2142.816666666666,"d":"2142.82"},{"v":2190.633333333333,"d":"2190.63"},2095,2020.35,3.49612]
[9,"AUBANK",1203.6,{"v":1206.4666666666665,"d":"1206.47"},{"v":1182.933333333333,"d":"1182.93"},{"v":1162.2666666666664,"d":"1162.27"},{"v":1138.733333333333,"d":"1138.73"},{"v":1227.133333333333,"d":"1227.13"},{"v":1250.6666666666663,"d":"1250.67"},{"v":1271.333333333333,"d":"1271.33"},1230,1185.8,11.18005]
[10,"AARTIIND",926.15,{"v":922.4166666666666,"d":"922.42"},{"v":914.9333333333333,"d":"914.93"},{"v":903.7166666666667,"d":"903.72"},{"v":896.2333333333333,"d":"896.23"},{"v":933.6333333333332,"d":"933.63"},{"v":941.1166666666666,"d":"941.12"},{"v":952.3333333333331,"d":"952.33"},929.9,911.2,5.59306]
[11,"ADANIENT",1644.45,{"v":1629.2666666666667,"d":"1629.27"},{"v":1607.4333333333334,"d":"1607.43"},{"v":1570.4166666666667,"d":"1570.42"},{"v":1548.5833333333335,"d":"1548.58"},{"v":1666.2833333333333,"d":"1666.28"},{"v":1688.1166666666668,"d":"1688.12"},{"v":1725.1333333333332,"d":"1725.13"},1651.1,1592.25,18.69037]
{"$rows_left_out":227}
{"sheet":"MidCap Intra","index":3,"n_rows":529,"n_cols":13,"rows_kept":529,"merged":[[0,0,0,1],[8,0,9,0],[8,1,9,1],[8,2,9,2],[8,3,9,3],[8,4,8,6],[8,7,8,9]]}
[]
[]
[]
[]
[{"$nulls":11},"Back To Main Page"]
["FOR INTRA DAY TRADING",{"$nulls":9},{"$f":"Main!B10","v":"2022-03-02"}]
[null,null," "]
[]
["Sr.no","Scrip","CLOSE RATE","Pivot Point","Supports",null,null,"Resistances"]
[{"$nulls":4},"S1","S2","S3","R1","R2","R3","HIGH","LOW","Total Trade Quanity in Lakhs"]
[1,"3MINDIA",21208.4,{"v":21310.683333333334,"d":"21310.68"},{"v":20871.966666666667,"d":"20871.97"},{"v":20535.533333333333,"d":"20535.53"},{"v":20096.816666666666,"d":"20096.82"},{"v":21647.11666666667,"d":"21647.12"},{"v":22085.833333333336,"d":"22085.83"},{"v":22422.26666666667,"d":"22422.27"},21749.4,20974.25,0.02052]
[2,"AARTIDRUGS",455.7,{"v":456.4666666666667,"d":"456.47"},{"v":449.7333333333334,"d":"449.73"},{"v":443.7666666666667,"d":"443.77"},{"v":437.0333333333334,"d":"437.03"},{"v":462.4333333333334,"d":"462.43"},{"v":469.16666666666674,"d":"469.17"},{"v":475.1333333333334,"d":"475.13"},463.2,450.5,1.21865]
[3,"AARTIIND",926.15,{"v":922.4166666666666,"d":"922.42"},{"v":914.9333333333333,"d":"914.93"},{"v":903.7166666666667,"d":"903.72"},{"v":896.2333333333333,"d":"896.23"},{"v":933.6333333333332,"d":"933.63"},{"v":941.1166666666666,"d":"941.12"},{"v":952.3333333333331,"d":"952.33"},929.9,911.2,5.59306]
[4,"AAVAS",2795.25,2855.25,{"v":2690,"d":"2690.00"},2584.75,{"v":2419.5,"d":"2419.50"},{"v":2960.5,"d":"2960.50"},3125.75,{"v":3231,"d":"3231.00"},3020.5,2750,3.34327]
[5,"ABB",2159.45,{"v":2140.083333333333,"d":"2140.08"},{"v":2108.566666666666,"d":"2108.57"},{"v":2057.683333333333,"d":"2057.68"},{"v":2026.166666666666,"d":"2026.17"},{"v":2190.9666666666662,"d":"2190.97"},{"v":2222.4833333333327,"d":"2222.48"},{"v":2273.3666666666663,"d":"2273.37"},2171.6,2089.2,1.8099]
[6,"ABBOTINDIA",17556.5,{"v":17503.816666666666,"d":"17503.82"},{"v":17232.68333333333,"d":"17232.68"},{"v":16908.866666666665,"d":"16908.87"},{"v":16637.73333333333,"d":"16637.73"},{"v":17827.63333333333,"d":"17827.63"},{"v":18098.766666666663,"d":"18098.77"},{"v":18422.583333333332,"d":"18422.58"},17774.95,17180,0.24091]
[7,"ABCAPITAL",105.55,{"v":104.33333333333333,"d":"104.33"},{"v":102.41666666666666,"d":"102.42"},{"v":99.28333333333333,"d":"99.28"},{"v":97.36666666666666,"d":"97.37"},{"v":107.46666666666665,"d":"107.47"},{"v":109.38333333333331,"d":"109.38"},{"v":112.51666666666665,"d":"112.52"},106.25,101.2,34.22266]
[8,"ABFRL",268.4,{"v":266.7833333333333,"d":"266.78"},{"v":261.6166666666666,"d":"261.62"},{"v":254.83333333333331,"d":"254.83"},{"v":249.66666666666663,"d":"249.67"},{"v":273.5666666666666,"d":"273.57"},{"v":278.73333333333335,"d":"278.73"},{"v":285.5166666666666,"d":"285.52"},271.95,260,38.53921]
[9,"ACC",2089.15,{"v":2068.1666666666665,"d":"2068.17"},{"v":2041.333333333333,"d":"2041.33"},{"v":1993.5166666666664,"d":"1993.52"},{"v":1966.683333333333,"d":"1966.68"},{"v":2115.983333333333,"d":"2115.98"},{"v":2142.816666666666,"d":"2142.82"},{"v":2190.633333333333,"d":"2190.63"},2095,2020.35,3.49612]
[10,"ADANIENT",1644.45,{"v":1629.2666666666667,"d":"1629.27"},{"v":1607.4333333333334,"d":"1607.43"},{"v":1570.4166666666667,"d":"1570.42"},{"v":1548.5833333333335,"d":"1548.58"},{"v":1666.2833333333333,"d":"1666.28"},{"v":1688.1166666666668,"d":"1688.12"},{"v":1725.1333333333332,"d":"1725.13"},1651.1,1592.25,18.69037]
{"$rows_left_out":510}
{"sheet":"Bulk Deals","index":4,"n_rows":117,"n_cols":8,"rows_kept":117,"merged":[[4,0,4,1],[4,2,4,3],[6,1,6,2]]}
[" "]
[]
[]
[]
[]
[{"$nulls":4},"Back To Main Page"]
["Subject :","BULK DEAL",null,{"$f":"Main!B10","v":"2022-03-02"}]
[]
["Date","Scrip code","Scrip Name","Client Name","Buy / Sell","Quantity Traded","Trade Price / Wt.Avg.trade price","Exchange  "]
["2022-02-28",539773,"ADVIKCA","PARESH DHIRAJLAL SHAH","BUY",{"v":300000,"d":"300,000"},3.2,"BSE"]
["2022-02-28",539773,"ADVIKCA","PARESH DHIRAJLAL SHAH","SELL",{"v":13606,"d":"13,606"},3.2,"BSE"]
["2022-02-28",542579,"AGOL","NSI INFINIUM GLOBAL PRIVATE LIMITED","SELL",{"v":200000,"d":"200,000"},65.06,"BSE"]
["2022-02-28",540718,"AKM","GYAN CHAND JAIN","BUY",{"v":42000,"d":"42,000"},31.24,"BSE"]
["2022-02-28",540718,"AKM","GYAN CHAND JAIN","SELL",{"v":36000,"d":"36,000"},25.5,"BSE"]
["2022-02-28",540718,"AKM","SHIVAM VERMA","BUY",{"v":36000,"d":"36,000"},25.5,"BSE"]
["2022-02-28",540718,"AKM","SHIVAM VERMA","SELL",{"v":18000,"d":"18,000"},31.3,"BSE"]
["2022-02-28",532166,"ALKASEC","ALPHA LEON ENTERPRISES LLP","BUY",{"v":150000,"d":"150,000"},0.48,"BSE"]
["2022-02-28",532166,"ALKASEC","ALPHA LEON ENTERPRISES LLP","SELL",{"v":800000,"d":"800,000"},0.48,"BSE"]
["2022-02-28",532166,"ALKASEC","ARUN SHANKAR TIWARI","SELL",{"v":650000,"d":"650,000"},0.48,"BSE"]
["2022-02-28",501270,"ANTARIKSH","VIJAY KUMAR MAKKAR","BUY",{"v":2001,"d":"2,001"},1.22,"BSE"]
{"$rows_left_out":98}
{"sheet":"Call Tracker (Equity & F&O)","index":5,"n_rows":356,"n_cols":18,"rows_kept":356,"merged":[[75,0,76,0],[75,1,76,1],[75,9,76,9],[75,12,76,12],[75,13,76,13],[75,14,76,14],[75,15,76,15],[112,0,113,0],[112,1,113,1],[112,9,113,9],[112,12,113,12],[112,13,113,13],[112,14,113,14],[112,15,113,15],[117,0,118,0],[117,1,118,1],[117,9,118,9],[117,12,118,12],[117,13,118,13],[117,14,118,14],[117,15,118,15]]}
[]
[]
[]
[]
[{"$nulls":12},"Back To Main Page"]
["Retail Research Technical Calls & Fundamental Performance Report for the month of Feb-2022"]
[{"$nulls":12},{"$f":"Main!B10","v":"2022-03-02"}]
[null,"Positional  Call"]
["Sr.no","Date",null,"Company","Rec","Rec Price","Stop Loss***","Call Closed At","Target","Remark","Profit / Loss per Share","All charges","Net Gain / Loss  %","Status","Closed Date","Market Closing Price"]
[1,"2022-01-21",null,"HCLTECH","Buy","1150-1170",1090,null,"1250-1300","Open",{"$nulls":5},{"$f":"VLOOKUP(D10,'MidCap Intra'!B55:C544,2,0)","v":1126.95},null,"H"]
[2,"2022-01-21",null,"TCS","Buy",3775,3590,{"v":3590,"d":"3,590.00"},"4000-4100","Loss of Rs.185/-",{"$f":"H11-F11","v":-185},{"$f":"(F11*-0.7)/100","v":{"v":-26.425,"d":"-26.43"}},{"$f":"(K11+L11)/F11","v":{"v":-0.0560066225165563,"d":"-5.60%"}},"Unsuccessful","2022-02-23",null,null,"H"]
[3,"2022-01-25",null,"TATACOMM","Buy",1255,1190,{"v":1327.5,"d":"1,327.50"},"1350-1400","Profit of Rs.72.5/-",{"$f":"H12-F12","v":72.5},{"$f":"(F12*-0.7)/100","v":{"v":-8.785,"d":"-8.79"}},{"$f":"(K12+L12)/F12","v":{"v":0.05076892430278885,"d":"5.08%"}},"Successful","2022-02-03",null,null,"H"]
[4,"2022-01-25",null,"HDFC","Buy",2500,2340,{"v":2595,"d":"2,595.00"},"2700-2800","Profit of Rs.95/-",{"$f":"H13-F13","v":95},{"$f":"(F13*-0.7)/100","v":{"v":-17.5,"d":"-17.50"}},{"$f":"(K13+L13)/F13","v":{"v":0.031,"d":"3.10%"}},"Successful","2022-02-01",null,null,"H"]
[5,"2022-01-25",null,"CARBORUNIV","Buy",855,815,{"v":905,"d":"905.00"},"900-930","Profit of Rs.50/-",{"$f":"H14-F14","v":50},{"$f":"(F14*-0.7)/100","v":{"v":-5.985,"d":"-5.99"}},{"$f":"(K14+L14)/F14","v":{"v":0.05147953216374269,"d":"5.15%"}},"Successful","2022-02-04",null,null,"H"]
[6,"2022-01-25",null,"TRENT","Buy",1070,995,{"v":1115,"d":"1,115.00"},"1150-1200","Part Profit of Rs.45/-",45,-7.49,{"v":0.03505607476635514,"d":"3.51%"},"Successful","2022-02-28",{"$f":"VLOOKUP(D15,'MidCap Intra'!B60:C549,2,0)","v":{"v":1108.1,"d":"1108.10"}},null,"H"]
[7,"2022-01-27",null,"SRF","Buy",2360,2200,{"v":2505,"d":"2,505.00"},"2550-2650","Profit of Rs.145/-",{"$f":"H16-F16","v":145},{"$f":"(F16*-0.7)/100","v":-16.52},{"$f":"(K16+L16)/F16","v":{"v":0.05444067796610169,"d":"5.44%"}},"Successful","2022-02-07",null,null,"N"]
[8,"2022-01-28",null,"INDIGO","Buy",1860,1695,{"v":1900,"d":"1,900.00"},"2050-2150","Profit of Rs.40/-",40,-13.02,{"v":0.014505376344086022,"d":"1.45%"},"Successful","2022-02-01",null,null,"H"]
[9,"2022-02-03",null,"APOLLOTYRE","Buy",223.5,210,{"v":210,"d":"210.00"},"240-250","Loss of Rs.13.5/-",-13.5,{"v":-1.5644999999999998,"d":"-1.56"},{"v":-0.06740268456375838,"d":"-6.74%"},"Unsuccessful","2022-02-18",null,null,"N"]
[10,"2022-02-07",null,"SUMICHEM","Buy",412.5,387,{"v":387,"d":"387.00"},"440-460","Loss of Rs.25.5/-",{"$f":"H19-F19","v":-25.5},{"$f":"(F19*-0.7)/100","v":{"v":-2.8875,"d":"-2.89"}},{"$f":"(K19+L19)/F19","v":{"v":-0.06881818181818182,"d":"-6.88%"}},"Unsuccessful","2022-02-17",null,null,"H"]
[11,"2022-02-09",null,"REDINGTON","Buy",162.5,149,{"v":177,"d":"177.00"},"180-190","Profit of Rs.14.5/-",{"$f":"H20-F20","v":14.5},{"$f":"(F20*-0.7)/100","v":{"v":-1.1375,"d":"-1.14"}},{"$f":"(K20+L20)/F20","v":{"v":0.08223076923076923,"d":"8.22%"}},"Successful","2022-02-10",null,null,"H"]
{"$rows_left_out":325}