{"text_format":"3","workbook":"xlsx","n_sheets":6,"sheets":["Main","Future Intra","Cash Intra","MidCap Intra","Bulk Deals","Call Tracker (Equity & F&O)"],"not_rendered":{"images":2,"defined_names":2},"read":"whole","date_system":"1900"}

{"sheet":"Main","index":0,"n_rows":27,"n_cols":11,"rows_kept":27}
[null,"                                                                                                 "]
{"$rows_empty":8}
[null,"2021-12-01"]
[]
[null,"Sheet No.","Template Name","Summary"]
[null,1,"Future Intra","For Intraday trading in F&O segment"]
[null,2,"Cash Intra","For Intraday trading in cash market segment"]
[null,3,"Mid-cap Intra","For Intraday trading in Mid-cap stocks"]
[null,4,"Bulk Deals","Reveals Bulk Deals carried on NSE & BSE"]
[null,5,"Call Tracker"]
{"$rows_empty":9}
[{"$nulls":10},"`"]

{"sheet":"Future Intra","index":1,"n_rows":225,"n_cols":16,"rows_kept":225,"merged":[[8,0,9,0],[8,1,9,1],[8,2,9,2],[8,3,9,3],[8,6,8,8],[8,9,8,11]]}
[]
[]
[]
[]
[{"$nulls":12},"Back to Main Page"]
["FOR INTRA DAY TRADING",{"$nulls":10},{"$f":"Main!B10","v":"2021-12-01"}]
[]
[]
["Sr.no","Sector","Scrip","Expiry Date","CLOSE RATE","Pivot Point","Supports",null,null,"Resistances"]
[{"$nulls":4},"Point","Point","S1","S2","S3","R1","R2","R3","HIGH","LOW","OI","% Change in OI"]
[1,"Index","BANKNIFTY","2021-12-30",{"v":35780.2,"d":"35780.20"},{"v":36091.63333333333,"d":"36091.63"},{"v":35334.26666666666,"d":"35334.27"},{"v":34888.33333333333,"d":"34888.33"},{"v":34130.96666666666,"d":"34130.97"},{"v":36537.566666666666,"d":"36537.57"},{"v":37294.933333333334,"d":"37294.93"},{"v":37740.86666666667,"d":"37740.87"},36849,35645.7,2744050,{"v":0.04201792359687097,"d":"4.20%"}]
[2,"Index","NIFTY","2021-12-30",{"v":17033.6,"d":"17033.60"},{"v":17126.866666666665,"d":"17126.87"},{"v":16906.73333333333,"d":"16906.73"},{"v":16779.866666666665,"d":"16779.87"},{"v":16559.73333333333,"d":"16559.73"},{"v":17253.73333333333,"d":"17253.73"},{"v":17473.86666666667,"d":"17473.87"},{"v":17600.73333333333,"d":"17600.73"},17347,17000,11968000,{"v":0.03532098583873284,"d":"3.53%"}]
[3,"Index","FINNIFTY","2021-12-28",{"v":17909.9,"d":"17909.90"},{"v":17919.883333333335,"d":"17919.88"},{"v":17899.91666666667,"d":"17899.92"},{"v":17889.933333333338,"d":"17889.93"},{"v":17869.966666666674,"d":"17869.97"},{"v":17929.86666666667,"d":"17929.87"},{"v":17949.833333333336,"d":"17949.83"},{"v":17959.816666666666,"d":"17959.82"},17939.85,17909.9,320,{"v":-0.6666666666666666,"d":"-66.67%"}]
[4,"Chemical","AARTIIND","2021-12-30",{"v":938.3,"d":"938.30"},{"v":943,"d":"943.00"},{"v":927.3,"d":"927.30"},{"v":916.3,"d":"916.30"},{"v":900.5999999999999,"d":"900.60"},{"v":954,"d":"954.00"},{"v":969.7,"d":"969.70"},{"v":980.7,"d":"980.70"},958.7,932,2234650,{"v":-0.012396694214876033,"d":"-1.24%"}]
[5,"Pharma","ABBOTINDIA","2021-12-30",19156.25,{"v":19201.916666666668,"d":"19201.92"},{"v":19003.833333333336,"d":"19003.83"},{"v":18851.416666666668,"d":"18851.42"},{"v":18653.333333333336,"d":"18653.33"},{"v":19354.333333333336,"d":"19354.33"},{"v":19552.41666666667,"d":"19552.42"},{"v":19704.833333333336,"d":"19704.83"},19400,19049.5,28575,{"v":0.012400354295837024,"d":"1.24%"}]
[6,"Textile","ABFRL","2021-12-30",256.05,{"v":257.8833333333334,"d":"257.88"},{"v":250.91666666666674,"d":"250.92"},{"v":245.78333333333336,"d":"245.78"},{"v":238.81666666666672,"d":"238.82"},{"v":263.01666666666677,"d":"263.02"},{"v":269.98333333333335,"d":"269.98"},{"v":275.1166666666668,"d":"275.12"},264.85,252.75,10995400,{"v":0.0033214709371293,"d":"0.33%"}]
[7,"Cement","ACC","2021-12-30",{"v":2294.6,"d":"2294.60"},{"v":2300.9833333333336,"d":"2300.98"},{"v":2272.966666666667,"d":"2272.97"},{"v":2251.3333333333335,"d":"2251.33"},{"v":2223.316666666667,"d":"2223.32"},{"v":2322.6166666666672,"d":"2322.62"},{"v":2350.6333333333337,"d":"2350.63"},{"v":2372.2666666666673,"d":"2372.27"},2329,2279.35,2047500,{"v":-6.1012812690665037E-4,"d":"-0.06%"}]
[8,"Others","ADANIENT","2021-12-30",{"v":1665,"d":"1665.00"},{"v":1681.6333333333332,"d":"1681.63"},{"v":1639.3666666666663,"d":"1639.37"},{"v":1613.7333333333331,"d":"1613.73"},{"v":1571.4666666666662,"d":"1571.47"},{"v":1707.2666666666664,"d":"1707.27"},{"v":1749.5333333333333,"d":"1749.53"},{"v":1775.1666666666665,"d":"1775.17"},1723.9,1656,21162500,{"v":-0.012228990174799878,"d":"-1.22%"}]
[9,"Others","ADANIPORTS","2021-12-30",{"v":686.5,"d":"686.50"},{"v":694.8166666666666,"d":"694.82"},{"v":674.8333333333333,"d":"674.83"},{"v":663.1666666666666,"d":"663.17"},{"v":643.1833333333333,"d":"643.18"},{"v":706.4833333333332,"d":"706.48"},{"v":726.4666666666666,"d":"726.47"},{"v":738.1333333333332,"d":"738.13"},714.8,683.15,90621250,{"v":0.012542074609980587,"d":"1.25%"}]
[10,"Pharma","ALKEM","2021-12-30",3604.55,{"v":3571.9166666666665,"d":"3571.92"},{"v":3524.833333333333,"d":"3524.83"},{"v":3445.1166666666663,"d":"3445.12"},{"v":3398.033333333333,"d":"3398.03"},{"v":3651.633333333333,"d":"3651.63"},{"v":3698.7166666666662,"d":"3698.72"},{"v":3778.4333333333334,"d":"3778.43"},3619,3492.2,540400,{"v":0.1444303261329945,"d":"14.44%"}]
{"$rows_left_out":199}
{"sheet":"Cash Intra","index":2,"n_rows":246,"n_cols":13,"rows_kept":246,"merged":[[7,0,8,0],[7,1,8,1],[7,2,8,2],[7,3,8,3],[7,4,7,6],[7,7,7,9]]}
[]
[]
[]
[]
[{"$nulls":12},"Back to Main Page"]
["FOR INTRA DAY TRADING",{"$nulls":9},{"$f":"Main!B10","v":"2021-12-01"}]
[]
["Sr.no",null,"CLOSE RATE","Pivot Point","Supports",null,null,"Resistances"]
[{"$nulls":4},"S1","S2","S3","R1","R2","R3","HIGH","LOW","Total Trade Quanity in Lakhs"]
[1,"Nifty 50",16983.2,{"v":17079.750000000004,"d":"17079.75"},{"v":16834.850000000006,"d":"16834.85"},{"v":16686.500000000004,"d":"16686.50"},{"v":16441.600000000006,"d":"16441.60"},{"v":17228.100000000006,"d":"17228.10"},{"v":17473.000000000007,"d":"17473.00"},{"v":17621.350000000006,"d":"17621.35"},17324.65,16931.4]
[2,"Nifty Bank",35695.3,{"v":35998.61666666667,"d":"35998.62"},{"v":35223.03333333334,"d":"35223.03"},{"v":34750.76666666667,"d":"34750.77"},{"v":33975.18333333334,"d":"33975.18"},{"v":36470.88333333334,"d":"36470.88"},{"v":37246.46666666667,"d":"37246.47"},{"v":37718.73333333334,"d":"37718.73"},36774.2,35526.35]
[3,"Nifty CPSE",2254.55,{"v":2261.633333333333,"d":"2261.63"},{"v":2229.9166666666665,"d":"2229.92"},{"v":2205.2833333333333,"d":"2205.28"},{"v":2173.5666666666666,"d":"2173.57"},{"v":2286.2666666666664,"d":"2286.27"},{"v":2317.9833333333336,"d":"2317.98"},{"v":2342.6166666666663,"d":"2342.62"},2293.35,2237]
[4,"Nifty Infra",4959.35,{"v":4983.633333333333,"d":"4983.63"},{"v":4912.566666666667,"d":"4912.57"},{"v":4865.783333333334,"d":"4865.78"},{"v":4794.716666666667,"d":"4794.72"},{"v":5030.416666666666,"d":"5030.42"},{"v":5101.483333333332,"d":"5101.48"},{"v":5148.2666666666655,"d":"5148.27"},5054.7,4936.85]
[5,"Nifty IT",35043.75,{"v":35205.51666666666,"d":"35205.52"},{"v":34756.83333333333,"d":"34756.83"},{"v":34469.916666666664,"d":"34469.92"},{"v":34021.23333333333,"d":"34021.23"},{"v":35492.43333333333,"d":"35492.43"},{"v":35941.11666666666,"d":"35941.12"},{"v":36228.033333333326,"d":"36228.03"},35654.2,34918.6]
[6,"Nifty PSE",3820.05,{"v":3837.6666666666665,"d":"3837.67"},{"v":3783.433333333333,"d":"3783.43"},{"v":3746.8166666666666,"d":"3746.82"},{"v":3692.583333333333,"d":"3692.58"},{"v":3874.283333333333,"d":"3874.28"},{"v":3928.5166666666664,"d":"3928.52"},{"v":3965.1333333333328,"d":"3965.13"},3891.9,3801.05]
[7,"Nifty Midcap 50",8186.3,{"v":8247.433333333332,"d":"8247.43"},{"v":8095.916666666664,"d":"8095.92"},{"v":8005.533333333332,"d":"8005.53"},{"v":7854.016666666664,"d":"7854.02"},{"v":8337.816666666666,"d":"8337.82"},{"v":8489.333333333332,"d":"8489.33"},{"v":8579.716666666665,"d":"8579.72"},8398.95,8157.05]
[8,"ACC",2286.4,{"v":2293.066666666667,"d":"2293.07"},{"v":2263.1833333333343,"d":"2263.18"},{"v":2239.966666666667,"d":"2239.97"},{"v":2210.0833333333344,"d":"2210.08"},{"v":2316.283333333334,"d":"2316.28"},{"v":2346.1666666666665,"d":"2346.17"},{"v":2369.383333333334,"d":"2369.38"},2322.95,2269.85,4.15128]
[9,"AUBANK",1096.1,{"v":1105.3833333333332,"d":"1105.38"},{"v":1074.7666666666664,"d":"1074.77"},{"v":1053.4333333333332,"d":"1053.43"},{"v":1022.8166666666664,"d":"1022.82"},{"v":1126.7166666666665,"d":"1126.72"},{"v":1157.3333333333333,"d":"1157.33"},{"v":1178.6666666666665,"d":"1178.67"},1136,1084.05,7.44583]
[10,"AARTIIND",937.3,{"v":941.0833333333334,"d":"941.08"},{"v":927.2166666666667,"d":"927.22"},{"v":917.1333333333333,"d":"917.13"},{"v":903.2666666666667,"d":"903.27"},{"v":951.1666666666667,"d":"951.17"},{"v":965.0333333333333,"d":"965.03"},{"v":975.1166666666668,"d":"975.12"},954.95,931,8.98079]
[11,"ADANIENT",1662.85,1676.55,{"v":1634.4499999999998,"d":"1634.45"},1606.05,{"v":1563.9499999999998,"d":"1563.95"},{"v":1704.9499999999998,"d":"1704.95"},{"v":1747.0499999999997,"d":"1747.05"},{"v":1775.4499999999998,"d":"1775.45"},1718.65,1648.15,29.52368]
{"$rows_left_out":227}
{"sheet":"MidCap Intra","index":3,"n_rows":533,"n_cols":13,"rows_kept":533,"merged":[[0,0,0,1],[8,0,9,0],[8,1,9,1],[8,2,9,2],[8,3,9,3],[8,4,8,6],[8,7,8,9]]}
[]
[]
[]
[]
[{"$nulls":11},"Back To Main Page"]
["FOR INTRA DAY TRADING",{"$nulls":9},{"$f":"Main!B10","v":"2021-12-01"}]
[null,null," "]
[]
["Sr.no","Scrip","CLOSE RATE","Pivot Point","Supports",null,null,"Resistances"]
[{"$nulls":4},"S1","S2","S3","R1","R2","R3","HIGH","LOW","Total Trade Quanity in Lakhs"]
[1,"3MINDIA",25034.4,{"v":24959.833333333332,"d":"24959.83"},{"v":24674.666666666664,"d":"24674.67"},{"v":24314.93333333333,"d":"24314.93"},{"v":24029.766666666663,"d":"24029.77"},{"v":25319.566666666666,"d":"25319.57"},{"v":25604.73333333333,"d":"25604.73"},{"v":25964.466666666667,"d":"25964.47"},25245,24600.1,0.02581]
[2,"AARTIDRUGS",506.75,{"v":511.09999999999997,"d":"511.10"},495.65,484.55,{"v":469.1,"d":"469.10"},{"v":522.1999999999999,"d":"522.20"},{"v":537.6499999999999,"d":"537.65"},{"v":548.7499999999999,"d":"548.75"},526.55,500,2.57278]
[3,"AARTIIND",937.3,{"v":941.0833333333334,"d":"941.08"},{"v":927.2166666666667,"d":"927.22"},{"v":917.1333333333333,"d":"917.13"},{"v":903.2666666666667,"d":"903.27"},{"v":951.1666666666667,"d":"951.17"},{"v":965.0333333333333,"d":"965.03"},{"v":975.1166666666668,"d":"975.12"},954.95,931,8.98079]
[4,"AAVAS",2816.05,2811.35,{"v":2724.7,"d":"2724.70"},2633.35,{"v":2546.7,"d":"2546.70"},{"v":2902.7,"d":"2902.70"},{"v":2989.3500000000004,"d":"2989.35"},{"v":3080.7,"d":"3080.70"},2898,2720,0.84664]
[5,"ABB",2061.85,{"v":2082.7833333333333,"d":"2082.78"},{"v":2001.0666666666666,"d":"2001.07"},{"v":1940.2833333333333,"d":"1940.28"},{"v":1858.5666666666666,"d":"1858.57"},{"v":2143.5666666666666,"d":"2143.57"},{"v":2225.283333333333,"d":"2225.28"},{"v":2286.0666666666666,"d":"2286.07"},2164.5,2022,2.39856]
[6,"ABBOTINDIA",19087.25,{"v":19157.416666666668,"d":"19157.42"},{"v":18939.933333333334,"d":"18939.93"},{"v":18792.616666666665,"d":"18792.62"},{"v":18575.13333333333,"d":"18575.13"},{"v":19304.733333333337,"d":"19304.73"},{"v":19522.216666666667,"d":"19522.22"},{"v":19669.53333333334,"d":"19669.53"},19374.9,19010.1,0.10597]
[7,"ABCAPITAL",109.1,{"v":108.59999999999998,"d":"108.60"},{"v":105.84999999999997,"d":"105.85"},{"v":102.59999999999998,"d":"102.60"},{"v":99.84999999999997,"d":"99.85"},{"v":111.84999999999997,"d":"111.85"},{"v":114.6,"d":"114.60"},{"v":117.84999999999997,"d":"117.85"},111.35,105.35,63.30797]
[8,"ABFRL",255.1,{"v":256.7,"d":"256.70"},{"v":249.39999999999998,"d":"249.40"},{"v":243.7,"d":"243.70"},{"v":236.39999999999998,"d":"236.40"},{"v":262.4,"d":"262.40"},{"v":269.70000000000005,"d":"269.70"},{"v":275.4,"d":"275.40"},264,251,24.64402]
[9,"ACC",2286.4,{"v":2293.066666666667,"d":"2293.07"},{"v":2263.1833333333343,"d":"2263.18"},{"v":2239.966666666667,"d":"2239.97"},{"v":2210.0833333333344,"d":"2210.08"},{"v":2316.283333333334,"d":"2316.28"},{"v":2346.1666666666665,"d":"2346.17"},{"v":2369.383333333334,"d":"2369.38"},2322.95,2269.85,4.15128]
[10,"ADANIENT",1662.85,1676.55,{"v":1634.4499999999998,"d":"1634.45"},1606.05,{"v":1563.9499999999998,"d":"1563.95"},{"v":1704.9499999999998,"d":"1704.95"},{"v":1747.0499999999997,"d":"1747.05"},{"v":1775.4499999999998,"d":"1775.45"},1718.65,1648.15,29.52368]
{"$rows_left_out":508}
{"sheet":"Bulk Deals","index":4,"n_rows":74,"n_cols":8,"rows_kept":74,"merged":[[4,0,4,1],[4,2,4,3],[6,1,6,2]]}
[" "]
[]
[]
[]
[]
[{"$nulls":4},"Back To Main Page"]
["Subject :","BULK DEAL",null,{"$f":"Main!B10","v":"2021-12-01"}]
[]
["Date","Scrip code","Scrip Name","Client Name","Buy / Sell","Quantity Traded","Trade Price / Wt.Avg.trade price","Exchange  "]
["2021-11-30",531991,"AMRAAGRI","ALPHA LEON ENTERPRISES LLP","BUY",5,0.62,"BSE"]
["2021-11-30",531991,"AMRAAGRI","ALPHA LEON ENTERPRISES LLP","SELL",{"v":1300005,"d":"1,300,005"},0.62,"BSE"]
["2021-11-30",542865,"ANUROOP","MANOHARRAMCHANDRAWAGLEHUF","SELL",{"v":40000,"d":"40,000"},14.8,"BSE"]
["2021-11-30",542865,"ANUROOP","NEETA BIPIN SHAH","BUY",{"v":50000,"d":"50,000"},14.84,"BSE"]
["2021-11-30",539288,"AVI","KAPIL KUMAR SHARMA","SELL",{"v":25856,"d":"25,856"},59.5,"BSE"]
["2021-11-30",539288,"AVI","ANCHAL KUMAR TIWARI","SELL",{"v":30917,"d":"30,917"},59.5,"BSE"]
["2021-11-30",539288,"AVI","DAHYABHAI PATEL","SELL",{"v":27200,"d":"27,200"},59.32,"BSE"]
["2021-11-30",539288,"AVI","BHAVIN JAYESHKUMAR BHIMANI","SELL",{"v":23625,"d":"23,625"},59.33,"BSE"]
["2021-11-30",539621,"BCLENTERPR","ABHINAY MAULIK JOSHI","SELL",{"v":36000,"d":"36,000"},10.11,"BSE"]
["2021-11-30",539621,"BCLENTERPR","JAYASEELAN SINGARAVELU","BUY",{"v":37394,"d":"37,394"},10.1,"BSE"]
["2021-11-30",539304,"CANOPYFIN","SHIV PARVATI LEASING LIMITED","SELL",{"v":236983,"d":"236,983"},14.25,"BSE"]
{"$rows_left_out":55}
{"sheet":"Call Tracker (Equity & F&O)","index":5,"n_rows":345,"n_cols":18,"rows_kept":345,"merged":[[86,0,87,0],[86,1,87,1],[86,12,87,12],[86,13,87,13],[86,14,87,14],[86,15,87,15],[107,0,108,0],[107,1,108,1],[107,9,108,9],[107,12,108,12],[107,13,108,13],[107,14,108,14],[107,15,108,15],[122,0,123,0],[122,1,123,1],[122,9,123,9],[122,12,123,12],[122,13,123,13],[122,14,123,14],[122,15,123,15],[126,0,127,0],[126,1,127,1],[126,9,127,9],[126,12,127,12],[126,13,127,13],[126,14,127,14],[126,15,127,15]]}
[]
[]
[]
[]
[{"$nulls":12},"Back To Main Page"]
["Retail Research Technical Calls & Fundamental Performance Report for the month of Nov-2021"]
[{"$nulls":12},{"$f":"Main!B10","v":"2021-12-01"}]
[null,"Positional  Call"]
["Sr.no","Date",null,"Company","Rec","Rec Price","Stop Loss***","Call Closed At","Target","Remark","Profit / Loss per Share","All charges","Net Gain / Loss  %","Status","Closed Date","Market Closing Price"]
[1,"2021-09-15",null,"AKZOINDIA","Buy",2195,2080,{"v":2295,"d":"2,295.00"},"2400-2500"," Profit of Rs.50/-",50,{"$f":"(F10*-0.7)/100","v":{"v":-15.365,"d":"-15.37"}},{"$f":"(K10+L10)/F10","v":{"v":0.01577904328018223,"d":"1.58%"}},"Successful","2021-11-22",null,null,"H"]
[2,"2021-09-21",null,"GLAXO","Buy",1510,1395,{"v":1585,"d":"1,585.00"},"1680-1720","Profit of Rs.75/-",{"$f":"H11-F11","v":75},-10.57,{"v":0.042668874172185435,"d":"4.27%"},"Successful","2021-11-01",null,null,"H"]
[3,"2021-10-05",null,"HDFCLIFE","Buy","715-725",660,null,"820-850","Open",{"$nulls":5},{"$f":"VLOOKUP(D12,'MidCap Intra'!B22:C524,2,0)","v":680.8},null,"H"]
[4,"2021-10-08",null,"BRITANNIA","Buy",3870,3670,{"v":3670,"d":"3,670.00"},"4200-4300","Loss of Rs.200/-",{"$f":"H13-F13","v":-200},{"$f":"(F13*-0.7)/100","v":-27.09},{"$f":"(K13+L13)/F13","v":{"v":-0.0586795865633075,"d":"-5.87%"}},"Unsuccessful","2021-11-03",null,null,"H"]
[5,"2021-10-11",null,"ULTRACEMCO","Buy",7330,6980,{"v":7760,"d":"7,760.00"},"7700-8000","Profit of Rs.430/-",{"$f":"H14-F14","v":430},{"$f":"(F14*-0.7)/100","v":-51.31},{"$f":"(K14+L14)/F14","v":{"v":0.051663028649386086,"d":"5.17%"}},"Successful","2021-11-01",null,null,"H"]
[6,"2021-10-26",null,"ICICIGI","Buy","1480-1500",1395,null,"1600-1700","Open",{"$nulls":5},{"$f":"VLOOKUP(D15,'MidCap Intra'!B29:C522,2,0)","v":1437.35},null,"H"]
[7,"2021-10-27",null,"WHIRLPOOL","Buy",2245,2080,{"v":2080,"d":"2,080.00"},"2400-2500","Loss of Rs.165/-",{"$f":"H16-F16","v":-165},{"$f":"(F16*-0.7)/100","v":{"v":-15.715,"d":"-15.72"}},{"$f":"(K16+L16)/F16","v":{"v":-0.0804966592427617,"d":"-8.05%"}},"Unsuccessful","2021-11-03",null,null,"H"]
[8,"2021-11-01",null,"IGL","Buy",474,447,{"v":501,"d":"501.00"},"500-520","Profit of Rs.27/-",27,{"v":-3.3179999999999996,"d":"-3.32"},{"v":0.0499620253164557,"d":"5.00%"},"Successful","2021-11-11",null,null,"H"]
[9,"2021-11-01",null,"MGL","Buy",1010,955,{"v":955,"d":"955.00"},"1070-1120","Loss of Rs.55/-",{"$f":"H18-F18","v":-55},{"$f":"(F18*-0.7)/100","v":-7.07},{"$f":"(K18+L18)/F18","v":{"v":-0.061455445544554455,"d":"-6.15%"}},"Unsuccessful","2021-11-22",null,null,"N"]
[10,"2021-11-02",null,"BEL","Buy",201,188,{"v":214.5,"d":"214.50"},"215-225","Profit of Rs.13.5/-",{"$f":"H19-F19","v":13.5},{"$f":"(F19*-0.7)/100","v":{"v":-1.4069999999999998,"d":"-1.41"}},{"$f":"(K19+L19)/F19","v":{"v":0.06016417910447761,"d":"6.02%"}},"Successful","2021-11-09",null,null,"H"]
[11,"2021-11-09",null,"JBCHEPHARM","Buy",1660,1578,{"v":1745,"d":"1,745.00"},"1740-1800","Profit of Rs.85/-",{"$f":"H20-F20","v":85},{"$f":"(F20*-0.7)/100","v":-11.62},{"$f":"(K20+L20)/F20","v":{"v":0.04420481927710843,"d":"4.42%"}},"Successful","2021-11-10",null,null,"H"]
{"$rows_left_out":314}